Diagnosed failure
Parameters/TestRpc.TestCallWithChainCertAndChainCA/SSL_UnixSocket: /data0/somelongdirectorytoavoidrpathissues/src/kudu/src/kudu/rpc/rpc-test.cc:270: Failure
Failed
Bad status: Runtime error: could not verify certificate chain (error with cert: subject=CN = localhost, ST = sadfjas, C = AS, emailAddress = sdflkdsajf, O = lskdfjlsad, OU = sldfkja, issuer=C = AS, ST = ASDfkjdhf, L = lskdjf, O = saldfja, OU = skdjf, CN = localhost, emailAddress = sadjflkadsj): : certificate has expired
Google Test trace:
/data0/somelongdirectorytoavoidrpathissues/src/kudu/src/kudu/rpc/rpc-test.cc:267: Connecting to unix:/tmp/dist-test-taskTR5t7O/test-tmp/rpc-test-70771005c8fe4ff29111e9770eae82ff.sock
I20260929 21:51:31.407902 5541 test_util.cc:175] -----------------------------------------------
I20260929 21:51:31.408092 5541 test_util.cc:176] Had fatal failures, leaving test files at /tmp/dist-test-taskTR5t7O/test-tmp/rpc-test.6.Parameters_TestRpc.TestCallWithChainCertAndChainCA_SSL_UnixSocket.1790718690102523-5541-0
Full log
Note: This is test shard 7 of 8.
[==========] Running 21 tests from 2 test suites.
[----------] Global test environment set-up.
[----------] 20 tests from Parameters/TestRpc
[ RUN ] Parameters/TestRpc.TestMessengerCreateDestroy/SSL_UnixSocket
WARNING: Logging before InitGoogleLogging() is written to STDERR
I20260929 21:51:30.205562 5541 rpc-test.cc:169] started messenger TestCreateDestroy
[ OK ] Parameters/TestRpc.TestMessengerCreateDestroy/SSL_UnixSocket (1108 ms)
[ RUN ] Parameters/TestRpc.TestNegotiationDeadlock/SSL_UnixSocket
I20260929 21:51:31.294484 5563 acceptor_pool.cc:254] collecting diagnostics on the listening RPC socket unix:/tmp/dist-test-taskTR5t7O/test-tmp/rpc-test-c791c6b187cd4699bc890e37ead9ae3c.sock every 8 connection(s)
I20260929 21:51:31.295780 5564 acceptor_pool.cc:254] collecting diagnostics on the listening RPC socket unix:/tmp/dist-test-taskTR5t7O/test-tmp/rpc-test-c791c6b187cd4699bc890e37ead9ae3c.sock every 8 connection(s)
[ OK ] Parameters/TestRpc.TestNegotiationDeadlock/SSL_UnixSocket (81 ms)
[ RUN ] Parameters/TestRpc.TestCallWithChainCertAndChainCA/SSL_UnixSocket
I20260929 21:51:31.378557 5579 acceptor_pool.cc:254] collecting diagnostics on the listening RPC socket unix:/tmp/dist-test-taskTR5t7O/test-tmp/rpc-test-70771005c8fe4ff29111e9770eae82ff.sock every 8 connection(s)
I20260929 21:51:31.380445 5580 acceptor_pool.cc:254] collecting diagnostics on the listening RPC socket unix:/tmp/dist-test-taskTR5t7O/test-tmp/rpc-test-70771005c8fe4ff29111e9770eae82ff.sock every 8 connection(s)
/data0/somelongdirectorytoavoidrpathissues/src/kudu/src/kudu/rpc/rpc-test.cc:270: Failure
Failed
Bad status: Runtime error: could not verify certificate chain (error with cert: subject=CN = localhost, ST = sadfjas, C = AS, emailAddress = sdflkdsajf, O = lskdfjlsad, OU = sldfkja, issuer=C = AS, ST = ASDfkjdhf, L = lskdjf, O = saldfja, OU = skdjf, CN = localhost, emailAddress = sadjflkadsj): : certificate has expired
Google Test trace:
/data0/somelongdirectorytoavoidrpathissues/src/kudu/src/kudu/rpc/rpc-test.cc:267: Connecting to unix:/tmp/dist-test-taskTR5t7O/test-tmp/rpc-test-70771005c8fe4ff29111e9770eae82ff.sock
I20260929 21:51:31.407902 5541 test_util.cc:175] -----------------------------------------------
I20260929 21:51:31.408092 5541 test_util.cc:176] Had fatal failures, leaving test files at /tmp/dist-test-taskTR5t7O/test-tmp/rpc-test.6.Parameters_TestRpc.TestCallWithChainCertAndChainCA_SSL_UnixSocket.1790718690102523-5541-0
[ FAILED ] Parameters/TestRpc.TestCallWithChainCertAndChainCA/SSL_UnixSocket, where GetParam() = (true, true) (60 ms)
[ RUN ] Parameters/TestRpc.TestCallWithPasswordProtectedKey/SSL_UnixSocket
I20260929 21:51:31.424657 5604 acceptor_pool.cc:254] collecting diagnostics on the listening RPC socket unix:/tmp/dist-test-taskTR5t7O/test-tmp/rpc-test-abad04ef33944d66a8e627c905fb6047.sock every 8 connection(s)
I20260929 21:51:31.425251 5605 acceptor_pool.cc:254] collecting diagnostics on the listening RPC socket unix:/tmp/dist-test-taskTR5t7O/test-tmp/rpc-test-abad04ef33944d66a8e627c905fb6047.sock every 8 connection(s)
W20260929 21:51:31.467554 5601 connection.cc:196] Error closing socket: Network error: TlsSocket::Close: Broken pipe
[ OK ] Parameters/TestRpc.TestCallWithPasswordProtectedKey/SSL_UnixSocket (64 ms)
[ RUN ] Parameters/TestRpc.TestCallToBadServer/SSL_UnixSocket
I20260929 21:51:31.498906 5541 rpc-test.cc:394] Status: Network error: Client connection negotiation failed: client connection to 0.0.0.0:0: connect: Connection refused (error 111)
I20260929 21:51:31.500577 5541 rpc-test.cc:394] Status: Network error: Client connection negotiation failed: client connection to 0.0.0.0:0: connect: Connection refused (error 111)
I20260929 21:51:31.501942 5541 rpc-test.cc:394] Status: Network error: Client connection negotiation failed: client connection to 0.0.0.0:0: connect: Connection refused (error 111)
I20260929 21:51:31.503388 5541 rpc-test.cc:394] Status: Network error: Client connection negotiation failed: client connection to 0.0.0.0:0: connect: Connection refused (error 111)
I20260929 21:51:31.504787 5541 rpc-test.cc:394] Status: Network error: Client connection negotiation failed: client connection to 0.0.0.0:0: connect: Connection refused (error 111)
[ OK ] Parameters/TestRpc.TestCallToBadServer/SSL_UnixSocket (34 ms)
[ RUN ] Parameters/TestRpc.TestWrongService/SSL_UnixSocket
I20260929 21:51:31.532979 5639 acceptor_pool.cc:254] collecting diagnostics on the listening RPC socket unix:/tmp/dist-test-taskTR5t7O/test-tmp/rpc-test-d04b13cc9c3b4be08746a994d4a2c666.sock every 8 connection(s)
I20260929 21:51:31.533790 5640 acceptor_pool.cc:254] collecting diagnostics on the listening RPC socket unix:/tmp/dist-test-taskTR5t7O/test-tmp/rpc-test-d04b13cc9c3b4be08746a994d4a2c666.sock every 8 connection(s)
I20260929 21:51:31.570251 5636 messenger.cc:345] service WrongServiceName not registered on TestServer
[ OK ] Parameters/TestRpc.TestWrongService/SSL_UnixSocket (69 ms)
[ RUN ] Parameters/TestRpc.TestConnectionKeepalive/SSL_UnixSocket
I20260929 21:51:31.594907 5662 acceptor_pool.cc:254] collecting diagnostics on the listening RPC socket unix:/tmp/dist-test-taskTR5t7O/test-tmp/rpc-test-ea40109cace04cdd9c9f3b0f445f9217.sock every 8 connection(s)
I20260929 21:51:31.595592 5663 acceptor_pool.cc:254] collecting diagnostics on the listening RPC socket unix:/tmp/dist-test-taskTR5t7O/test-tmp/rpc-test-ea40109cace04cdd9c9f3b0f445f9217.sock every 8 connection(s)
I20260929 21:51:31.598649 5541 rpc-test.cc:488] Connecting to unix:/tmp/dist-test-taskTR5t7O/test-tmp/rpc-test-ea40109cace04cdd9c9f3b0f445f9217.sock
W20260929 21:51:32.081075 5675 connection.cc:196] Error closing socket: Network error: TlsSocket::Close: Broken pipe
[ OK ] Parameters/TestRpc.TestConnectionKeepalive/SSL_UnixSocket (1063 ms)
[ RUN ] Parameters/TestRpc.TestClientConnectionMetrics/SSL_UnixSocket
I20260929 21:51:32.662540 5687 acceptor_pool.cc:254] collecting diagnostics on the listening RPC socket unix:/tmp/dist-test-taskTR5t7O/test-tmp/rpc-test-b33156c9b5f54e54b2f9333cb3a67e8e.sock every 8 connection(s)
I20260929 21:51:32.663362 5688 acceptor_pool.cc:254] collecting diagnostics on the listening RPC socket unix:/tmp/dist-test-taskTR5t7O/test-tmp/rpc-test-b33156c9b5f54e54b2f9333cb3a67e8e.sock every 8 connection(s)
I20260929 21:51:32.666926 5541 rpc-test.cc:569] Connecting to unix:/tmp/dist-test-taskTR5t7O/test-tmp/rpc-test-b33156c9b5f54e54b2f9333cb3a67e8e.sock
W20260929 21:53:48.696313 5684 connection.cc:196] Error closing socket: Network error: TlsSocket::Close: Broken pipe
[ OK ] Parameters/TestRpc.TestClientConnectionMetrics/SSL_UnixSocket (136067 ms)
[ RUN ] Parameters/TestRpc.TestCredentialsPolicy/SSL_UnixSocket
I20260929 21:53:48.741341 5723 acceptor_pool.cc:254] collecting diagnostics on the listening RPC socket unix:/tmp/dist-test-taskTR5t7O/test-tmp/rpc-test-81bc48bc795642d7ba4d4f63e7af2455.sock every 8 connection(s)
I20260929 21:53:48.742153 5724 acceptor_pool.cc:254] collecting diagnostics on the listening RPC socket unix:/tmp/dist-test-taskTR5t7O/test-tmp/rpc-test-81bc48bc795642d7ba4d4f63e7af2455.sock every 8 connection(s)
I20260929 21:53:48.745325 5541 rpc-test.cc:700] Connecting to unix:/tmp/dist-test-taskTR5t7O/test-tmp/rpc-test-81bc48bc795642d7ba4d4f63e7af2455.sock
W20260929 21:53:48.780879 5722 connection.cc:196] Error closing socket: Network error: TlsSocket::Close: Broken pipe
[ OK ] Parameters/TestRpc.TestCredentialsPolicy/SSL_UnixSocket (92 ms)
[ RUN ] Parameters/TestRpc.TestCallLongerThanKeepalive/SSL_UnixSocket
I20260929 21:53:48.832163 5748 acceptor_pool.cc:254] collecting diagnostics on the listening RPC socket unix:/tmp/dist-test-taskTR5t7O/test-tmp/rpc-test-a03a47e99af946618d034affdeeac4a2.sock every 8 connection(s)
I20260929 21:53:48.832805 5749 acceptor_pool.cc:254] collecting diagnostics on the listening RPC socket unix:/tmp/dist-test-taskTR5t7O/test-tmp/rpc-test-a03a47e99af946618d034affdeeac4a2.sock every 8 connection(s)
I20260929 21:53:48.869038 5752 rpc-test-base.h:222] got call: sleep_micros: 3000000 deferred: true
I20260929 21:53:51.873495 5752 rpcz_store.cc:275] Call kudu.rpc.GenericCalculatorService.Sleep from unix:<unnamed> (request call id 0) took 3004 ms. Trace:
I20260929 21:53:51.874037 5752 rpcz_store.cc:276] 0929 21:53:48.868872 (+ 0us) service_pool.cc:170] Inserting onto call queue
0929 21:53:48.868974 (+ 102us) service_pool.cc:227] Handling call
0929 21:53:51.873270 (+3004296us) inbound_call.cc:173] Queueing success response
Metrics: {}
W20260929 21:53:51.879617 5745 connection.cc:196] Error closing socket: Network error: TlsSocket::Close: Broken pipe
[ OK ] Parameters/TestRpc.TestCallLongerThanKeepalive/SSL_UnixSocket (3086 ms)
[ RUN ] Parameters/TestRpc.TestRpcSidecar/SSL_UnixSocket
I20260929 21:53:51.914822 5774 acceptor_pool.cc:254] collecting diagnostics on the listening RPC socket unix:/tmp/dist-test-taskTR5t7O/test-tmp/rpc-test-93bd27ad71364fce8283ae5279160ad8.sock every 8 connection(s)
I20260929 21:53:51.915799 5775 acceptor_pool.cc:254] collecting diagnostics on the listening RPC socket unix:/tmp/dist-test-taskTR5t7O/test-tmp/rpc-test-93bd27ad71364fce8283ae5279160ad8.sock every 8 connection(s)
W20260929 21:53:52.460861 5771 connection.cc:196] Error closing socket: Network error: TlsSocket::Close: Broken pipe
[ OK ] Parameters/TestRpc.TestRpcSidecar/SSL_UnixSocket (577 ms)
[ RUN ] Parameters/TestRpc.TestRpcSidecarLimits/SSL_UnixSocket
I20260929 21:54:08.698861 5800 acceptor_pool.cc:254] collecting diagnostics on the listening RPC socket unix:/tmp/dist-test-taskTR5t7O/test-tmp/rpc-test-2917d8e20a6740d2a61028ec9a5bf2db.sock every 8 connection(s)
I20260929 21:54:08.699561 5801 acceptor_pool.cc:254] collecting diagnostics on the listening RPC socket unix:/tmp/dist-test-taskTR5t7O/test-tmp/rpc-test-2917d8e20a6740d2a61028ec9a5bf2db.sock every 8 connection(s)
W20260929 21:54:08.724870 5541 serialization.cc:72] Serialized kudu.rpc_test.PushStringsRequestPB (2147483654 bytes) is larger than the maximum configured RPC message size (52428800 bytes). Sending anyway, but peer may reject the data.
W20260929 21:54:08.736763 5797 connection.cc:535] server connection from unix:<unnamed> recv error: Network error: RPC frame had a length of 2147483714, but we only support messages up to 52428800 bytes long.
W20260929 21:54:08.737185 5797 connection.cc:158] shutting down server connection from unix:<unnamed> with pending inbound data: 4/2147483714 bytes received; last active 0 ns ago: status Network error: RPC frame had a length of 2147483714, but we only support messages up to 52428800 bytes long.
W20260929 21:54:08.738248 5813 connection.cc:698] client connection to unix:/tmp/dist-test-taskTR5t7O/test-tmp/rpc-test-2917d8e20a6740d2a61028ec9a5bf2db.sock send error: Network error: failed to write to TLS socket: Broken pipe
W20260929 21:54:08.738862 5813 connection.cc:196] Error closing socket: Network error: TlsSocket::Close: Success
[ OK ] Parameters/TestRpc.TestRpcSidecarLimits/SSL_UnixSocket (16991 ms)
[ RUN ] Parameters/TestRpc.TestCallTimeoutDoesntAffectNegotiation/SSL_UnixSocket
I20260929 21:54:09.490264 5825 acceptor_pool.cc:254] collecting diagnostics on the listening RPC socket unix:/tmp/dist-test-taskTR5t7O/test-tmp/rpc-test-a9f2565f105747a3a705c0565f8c05c8.sock every 8 connection(s)
I20260929 21:54:09.490974 5826 acceptor_pool.cc:254] collecting diagnostics on the listening RPC socket unix:/tmp/dist-test-taskTR5t7O/test-tmp/rpc-test-a9f2565f105747a3a705c0565f8c05c8.sock every 8 connection(s)
W20260929 21:54:09.552508 5821 negotiation.cc:266] Injecting 500ms delay in negotiation
I20260929 21:54:09.602015 5541 rpc-test-base.h:595] status: Timed out: connection negotiation to unix:/tmp/dist-test-taskTR5t7O/test-tmp/rpc-test-a9f2565f105747a3a705c0565f8c05c8.sock for RPC Sleep timed out after 0.050s (ON_OUTBOUND_QUEUE), seconds elapsed: 0.0509657
W20260929 21:54:10.064833 5822 connection.cc:196] Error closing socket: Network error: TlsSocket::Close: Broken pipe
[ OK ] Parameters/TestRpc.TestCallTimeoutDoesntAffectNegotiation/SSL_UnixSocket (611 ms)
[ RUN ] Parameters/TestRpc.TestRpcHandlerLatencyMetric/SSL_UnixSocket
I20260929 21:54:10.088085 5850 acceptor_pool.cc:254] collecting diagnostics on the listening RPC socket unix:/tmp/dist-test-taskTR5t7O/test-tmp/rpc-test-b07cba116e864cbe96e6306091ea9a13.sock every 8 connection(s)
I20260929 21:54:10.088804 5851 acceptor_pool.cc:254] collecting diagnostics on the listening RPC socket unix:/tmp/dist-test-taskTR5t7O/test-tmp/rpc-test-b07cba116e864cbe96e6306091ea9a13.sock every 8 connection(s)
I20260929 21:54:10.149477 5541 rpc-test.cc:1236] Sleep() min lat: 21557
I20260929 21:54:10.149704 5541 rpc-test.cc:1237] Sleep() mean lat: 21557
I20260929 21:54:10.149824 5541 rpc-test.cc:1238] Sleep() max lat: 21557
I20260929 21:54:10.149953 5541 rpc-test.cc:1239] Sleep() #calls: 1
W20260929 21:54:10.152211 5847 connection.cc:196] Error closing socket: Network error: TlsSocket::Close: Broken pipe
[ OK ] Parameters/TestRpc.TestRpcHandlerLatencyMetric/SSL_UnixSocket (87 ms)
[ RUN ] Parameters/TestRpc.TimedOutOnResponseMetricServiceQueue/SSL_UnixSocket
I20260929 21:54:10.174553 5876 acceptor_pool.cc:254] collecting diagnostics on the listening RPC socket unix:/tmp/dist-test-taskTR5t7O/test-tmp/rpc-test-027b069f1d094a98b851ea1375fd5749.sock every 8 connection(s)
I20260929 21:54:10.175209 5877 acceptor_pool.cc:254] collecting diagnostics on the listening RPC socket unix:/tmp/dist-test-taskTR5t7O/test-tmp/rpc-test-027b069f1d094a98b851ea1375fd5749.sock every 8 connection(s)
W20260929 21:54:10.262393 5878 rpcz_store.cc:267] Call kudu.rpc_test.CalculatorService.Sleep from unix:<unnamed> (request call id 2) took 20 ms (client timeout 20 ms). Trace:
W20260929 21:54:10.262732 5878 rpcz_store.cc:269] 0929 21:54:10.241882 (+ 0us) service_pool.cc:170] Inserting onto call queue
0929 21:54:10.262234 (+ 20352us) service_pool.cc:214] Skipping call since client already timed out
0929 21:54:10.262334 (+ 100us) inbound_call.cc:173] Queueing failure response
Metrics: {}
W20260929 21:54:10.265267 5873 connection.cc:196] Error closing socket: Network error: TlsSocket::Close: Broken pipe
[ OK ] Parameters/TestRpc.TimedOutOnResponseMetricServiceQueue/SSL_UnixSocket (111 ms)
[ RUN ] Parameters/TestRpc.RpcPendingConnectionsMetric/SSL_UnixSocket
I20260929 21:54:10.279839 5899 acceptor_pool.cc:254] collecting diagnostics on the listening RPC socket 0.0.0.0:40627 every 8 connection(s)
I20260929 21:54:10.280689 5900 acceptor_pool.cc:254] collecting diagnostics on the listening RPC socket 0.0.0.0:40627 every 8 connection(s)
W20260929 21:54:10.285660 5895 negotiation.cc:337] Failed RPC negotiation. Trace:
0929 21:54:10.284341 (+ 0us) reactor.cc:625] Submitting negotiation task for server connection from 127.0.0.1:35564 (local address 127.0.0.1:40627)
0929 21:54:10.284737 (+ 396us) server_negotiation.cc:206] Beginning negotiation
0929 21:54:10.284754 (+ 17us) server_negotiation.cc:399] Waiting for connection header
0929 21:54:10.285011 (+ 257us) negotiation.cc:327] Negotiation complete: Network error: Server connection negotiation failed: server connection from 127.0.0.1:35564: BlockingRecv error: recv got EOF from 127.0.0.1:35564 (error 108)
Metrics: {"server-negotiator.queue_time_us":111}
[ OK ] Parameters/TestRpc.RpcPendingConnectionsMetric/SSL_UnixSocket (31 ms)
[ RUN ] Parameters/TestRpc.TestRpcContextClientDeadline/SSL_UnixSocket
I20260929 21:54:10.333442 5915 acceptor_pool.cc:254] collecting diagnostics on the listening RPC socket unix:/tmp/dist-test-taskTR5t7O/test-tmp/rpc-test-88f73ca05dda4592bc0f7c070254d75f.sock every 8 connection(s)
I20260929 21:54:10.334092 5916 acceptor_pool.cc:254] collecting diagnostics on the listening RPC socket unix:/tmp/dist-test-taskTR5t7O/test-tmp/rpc-test-88f73ca05dda4592bc0f7c070254d75f.sock every 8 connection(s)
[ OK ] Parameters/TestRpc.TestRpcContextClientDeadline/SSL_UnixSocket (127 ms)
[ RUN ] Parameters/TestRpc.TestApplicationFeatureFlagUnsupportedServer/SSL_UnixSocket
I20260929 21:54:10.444847 5940 acceptor_pool.cc:254] collecting diagnostics on the listening RPC socket unix:/tmp/dist-test-taskTR5t7O/test-tmp/rpc-test-f786af07e5f14b71bdb9d4ac745ccd26.sock every 8 connection(s)
I20260929 21:54:10.445534 5941 acceptor_pool.cc:254] collecting diagnostics on the listening RPC socket unix:/tmp/dist-test-taskTR5t7O/test-tmp/rpc-test-f786af07e5f14b71bdb9d4ac745ccd26.sock every 8 connection(s)
[ OK ] Parameters/TestRpc.TestApplicationFeatureFlagUnsupportedServer/SSL_UnixSocket (54 ms)
[ RUN ] Parameters/TestRpc.TestCancellationAsync/SSL_UnixSocket
I20260929 21:54:10.503372 5965 acceptor_pool.cc:254] collecting diagnostics on the listening RPC socket unix:/tmp/dist-test-taskTR5t7O/test-tmp/rpc-test-453b0a9534e64bfe88ede881b37ff798.sock every 8 connection(s)
I20260929 21:54:10.504088 5966 acceptor_pool.cc:254] collecting diagnostics on the listening RPC socket unix:/tmp/dist-test-taskTR5t7O/test-tmp/rpc-test-453b0a9534e64bfe88ede881b37ff798.sock every 8 connection(s)
I20260929 21:54:10.507220 5541 rpc-test.cc:1716] Connecting to unix:/tmp/dist-test-taskTR5t7O/test-tmp/rpc-test-453b0a9534e64bfe88ede881b37ff798.sock
I20260929 21:54:10.529635 5541 test_util.cc:268] Using random seed: 955939146
I20260929 21:54:10.802277 5969 rpc-test-base.h:240] got call: sleep_micros: 500 pattern: 4294967295 num_repetitions: 2097152 sidecar_idx: 0
I20260929 21:54:11.009430 5969 rpc-test-base.h:240] got call: sleep_micros: 500 pattern: 4294967295 num_repetitions: 2097152 sidecar_idx: 0
I20260929 21:54:11.213295 5969 rpc-test-base.h:240] got call: sleep_micros: 500 pattern: 4294967295 num_repetitions: 2097152 sidecar_idx: 0
I20260929 21:54:11.415282 5969 rpc-test-base.h:240] got call: sleep_micros: 500 pattern: 4294967295 num_repetitions: 2097152 sidecar_idx: 0
I20260929 21:54:11.632484 5968 rpc-test-base.h:240] got call: sleep_micros: 500 pattern: 4294967295 num_repetitions: 2097152 sidecar_idx: 0
I20260929 21:54:11.830986 5969 rpc-test-base.h:240] got call: sleep_micros: 500 pattern: 4294967295 num_repetitions: 2097152 sidecar_idx: 0
I20260929 21:54:12.030835 5968 rpc-test-base.h:240] got call: sleep_micros: 500 pattern: 4294967295 num_repetitions: 2097152 sidecar_idx: 0
I20260929 21:54:12.222468 5969 rpc-test-base.h:240] got call: sleep_micros: 500 pattern: 4294967295 num_repetitions: 2097152 sidecar_idx: 0
I20260929 21:54:12.433007 5969 rpc-test-base.h:240] got call: sleep_micros: 500 pattern: 4294967295 num_repetitions: 2097152 sidecar_idx: 0
W20260929 21:54:12.456311 5962 connection.cc:196] Error closing socket: Network error: TlsSocket::Close: Broken pipe
W20260929 21:54:12.576195 5962 connection.cc:441] server connection from unix:<unnamed> torn down before Call kudu.rpc.GenericCalculatorService.SleepWithSidecar from unix:<unnamed> (request call id 9) could send its response
[ OK ] Parameters/TestRpc.TestCancellationAsync/SSL_UnixSocket (2103 ms)
[ RUN ] Parameters/TestRpc.TestPerformanceBySocketType/SSL_UnixSocket
I20260929 21:54:12.676038 5991 acceptor_pool.cc:254] collecting diagnostics on the listening RPC socket unix:/tmp/dist-test-taskTR5t7O/test-tmp/rpc-test-7ddcee6762ec41d2a1f4d0f34bc7b9e5.sock every 8 connection(s)
I20260929 21:54:12.676826 5992 acceptor_pool.cc:254] collecting diagnostics on the listening RPC socket unix:/tmp/dist-test-taskTR5t7O/test-tmp/rpc-test-7ddcee6762ec41d2a1f4d0f34bc7b9e5.sock every 8 connection(s)
I20260929 21:54:12.679812 5541 rpc-test.cc:1846] Connecting to unix:/tmp/dist-test-taskTR5t7O/test-tmp/rpc-test-7ddcee6762ec41d2a1f4d0f34bc7b9e5.sock
I20260929 21:54:34.503309 5541 rpc-test.cc:1859] Sending 1024MB via ssl-enabled unix socket: real 21.807s user 20.540s sys 13.175s
I20260929 21:54:55.862138 5541 rpc-test.cc:1859] Sending 1024MB via ssl-enabled unix socket: real 21.358s user 19.979s sys 12.870s
I20260929 21:55:16.707330 5541 rpc-test.cc:1859] Sending 1024MB via ssl-enabled unix socket: real 20.845s user 19.480s sys 12.347s
I20260929 21:55:37.801496 5541 rpc-test.cc:1859] Sending 1024MB via ssl-enabled unix socket: real 21.094s user 20.098s sys 12.289s
I20260929 21:55:59.565682 5541 rpc-test.cc:1859] Sending 1024MB via ssl-enabled unix socket: real 21.764s user 20.404s sys 13.330s
[ OK ] Parameters/TestRpc.TestPerformanceBySocketType/SSL_UnixSocket (106995 ms)
[----------] 20 tests from Parameters/TestRpc (269425 ms total)
[----------] 1 test from Parameters/TestRpcSocketTxRxQueue
[ RUN ] Parameters/TestRpcSocketTxRxQueue.AcceptorRxQueueSizeMetric/0
I20260929 21:55:59.599004 6026 acceptor_pool.cc:254] collecting diagnostics on the listening RPC socket 0.0.0.0:40343 every 1 connection(s)
I20260929 21:55:59.599768 6027 acceptor_pool.cc:254] collecting diagnostics on the listening RPC socket 0.0.0.0:40343 every 1 connection(s)
W20260929 21:55:59.605417 6022 negotiation.cc:337] Failed RPC negotiation. Trace:
0929 21:55:59.603771 (+ 0us) reactor.cc:625] Submitting negotiation task for server connection from 127.0.0.1:36146 (local address 127.0.0.1:40343)
0929 21:55:59.604266 (+ 495us) server_negotiation.cc:206] Beginning negotiation
0929 21:55:59.604290 (+ 24us) server_negotiation.cc:399] Waiting for connection header
0929 21:55:59.604545 (+ 255us) negotiation.cc:327] Negotiation complete: Network error: Server connection negotiation failed: server connection from 127.0.0.1:36146: BlockingRecv error: recv got EOF from 127.0.0.1:36146 (error 108)
Metrics: {"server-negotiator.queue_time_us":138}
[ OK ] Parameters/TestRpcSocketTxRxQueue.AcceptorRxQueueSizeMetric/0 (31 ms)
[----------] 1 test from Parameters/TestRpcSocketTxRxQueue (31 ms total)
[----------] Global test environment tear-down
[==========] 21 tests from 2 test suites ran. (269457 ms total)
[ PASSED ] 20 tests.
[ FAILED ] 1 test, listed below:
[ FAILED ] Parameters/TestRpc.TestCallWithChainCertAndChainCA/SSL_UnixSocket, where GetParam() = (true, true)
1 FAILED TEST