Diagnosed failure

Parameters/TestRpc.TestCallWithChainCertAndRootCA/SSL_UnixSocket: /data0/somelongdirectorytoavoidrpathissues/src/kudu/src/kudu/rpc/rpc-test.cc:303: Failure
Failed
Bad status: Runtime error: could not verify certificate chain (error with cert: subject=CN = localhost, ST = sadfjas, C = AS, emailAddress = sdflkdsajf, O = lskdfjlsad, OU = sldfkja, issuer=C = AS, ST = ASDfkjdhf, L = lskdjf, O = saldfja, OU = skdjf, CN = localhost, emailAddress = sadjflkadsj): : certificate has expired
Google Test trace:
/data0/somelongdirectorytoavoidrpathissues/src/kudu/src/kudu/rpc/rpc-test.cc:300: Connecting to unix:/tmp/dist-test-task4eaUur/test-tmp/rpc-test-8bd89ad4340941a4aeb64a41d086ea83.sock
I20260926 22:06:03.704347 10305 test_util.cc:175] -----------------------------------------------
I20260926 22:06:03.704530 10305 test_util.cc:176] Had fatal failures, leaving test files at /tmp/dist-test-task4eaUur/test-tmp/rpc-test.2.Parameters_TestRpc.TestCallWithChainCertAndRootCA_SSL_UnixSocket.1790460360234630-10305-0

Full log

Note: This is test shard 3 of 8.
[==========] Running 21 tests from 2 test suites.
[----------] Global test environment set-up.
[----------] 1 test from TestRpc
[ RUN      ] TestRpc.TestNegotiationTimeout
WARNING: Logging before InitGoogleLogging() is written to STDERR
I20260926 22:06:00.418344 10305 rpc-test-base.h:595] status: Timed out: connection negotiation to 0.0.0.0:40207 for RPC Sleep timed out after 0.100s (ON_OUTBOUND_QUEUE), seconds elapsed: 0.10158
W20260926 22:06:03.400794 10315 negotiation.cc:337] Failed RPC negotiation. Trace:
0926 22:06:00.317593 (+     0us) reactor.cc:625] Submitting negotiation task for client connection to 0.0.0.0:40207 (local address 127.0.0.1:35312)
0926 22:06:00.318363 (+   770us) negotiation.cc:107] Waiting for socket to connect
0926 22:06:00.318410 (+    47us) client_negotiation.cc:174] Beginning negotiation
0926 22:06:00.330196 (+ 11786us) client_negotiation.cc:252] Sending NEGOTIATE NegotiatePB request
0926 22:06:03.399720 (+3069524us) negotiation.cc:327] Negotiation complete: Timed out: Client connection negotiation failed: client connection to 0.0.0.0:40207: received 0 of 4 requested bytes
Metrics: {"client-negotiator.queue_time_us":215}
[       OK ] TestRpc.TestNegotiationTimeout (3122 ms)
[----------] 1 test from TestRpc (3122 ms total)

[----------] 20 tests from Parameters/TestRpc
[ RUN      ] Parameters/TestRpc.TestAcceptorPoolStartStop/SSL_UnixSocket
I20260926 22:06:03.437450 10331 acceptor_pool.cc:254] collecting diagnostics on the listening RPC socket unix:/tmp/dist-test-task4eaUur/test-tmp/rpc-test-0e15520b2ae24dbba176e4266d2157cf.sock every 8 connection(s)
I20260926 22:06:03.438881 10332 acceptor_pool.cc:254] collecting diagnostics on the listening RPC socket unix:/tmp/dist-test-task4eaUur/test-tmp/rpc-test-0e15520b2ae24dbba176e4266d2157cf.sock every 8 connection(s)
I20260926 22:06:03.484268 10342 acceptor_pool.cc:254] collecting diagnostics on the listening RPC socket unix:/tmp/dist-test-task4eaUur/test-tmp/rpc-test-0e15520b2ae24dbba176e4266d2157cf.sock every 8 connection(s)
I20260926 22:06:03.485491 10343 acceptor_pool.cc:254] collecting diagnostics on the listening RPC socket unix:/tmp/dist-test-task4eaUur/test-tmp/rpc-test-0e15520b2ae24dbba176e4266d2157cf.sock every 8 connection(s)
I20260926 22:06:03.504194 10353 acceptor_pool.cc:254] collecting diagnostics on the listening RPC socket unix:/tmp/dist-test-task4eaUur/test-tmp/rpc-test-0e15520b2ae24dbba176e4266d2157cf.sock every 8 connection(s)
I20260926 22:06:03.504838 10354 acceptor_pool.cc:254] collecting diagnostics on the listening RPC socket unix:/tmp/dist-test-task4eaUur/test-tmp/rpc-test-0e15520b2ae24dbba176e4266d2157cf.sock every 8 connection(s)
I20260926 22:06:03.523557 10364 acceptor_pool.cc:254] collecting diagnostics on the listening RPC socket unix:/tmp/dist-test-task4eaUur/test-tmp/rpc-test-0e15520b2ae24dbba176e4266d2157cf.sock every 8 connection(s)
I20260926 22:06:03.524242 10365 acceptor_pool.cc:254] collecting diagnostics on the listening RPC socket unix:/tmp/dist-test-task4eaUur/test-tmp/rpc-test-0e15520b2ae24dbba176e4266d2157cf.sock every 8 connection(s)
I20260926 22:06:03.576363 10375 acceptor_pool.cc:254] collecting diagnostics on the listening RPC socket unix:/tmp/dist-test-task4eaUur/test-tmp/rpc-test-0e15520b2ae24dbba176e4266d2157cf.sock every 8 connection(s)
I20260926 22:06:03.577026 10376 acceptor_pool.cc:254] collecting diagnostics on the listening RPC socket unix:/tmp/dist-test-task4eaUur/test-tmp/rpc-test-0e15520b2ae24dbba176e4266d2157cf.sock every 8 connection(s)
[       OK ] Parameters/TestRpc.TestAcceptorPoolStartStop/SSL_UnixSocket (172 ms)
[ RUN      ] Parameters/TestRpc.TestCall/SSL_UnixSocket
I20260926 22:06:03.599390 10388 acceptor_pool.cc:254] collecting diagnostics on the listening RPC socket unix:/tmp/dist-test-task4eaUur/test-tmp/rpc-test-6c7be79e56c74ef8b998329b2fac8000.sock every 8 connection(s)
I20260926 22:06:03.601310 10389 acceptor_pool.cc:254] collecting diagnostics on the listening RPC socket unix:/tmp/dist-test-task4eaUur/test-tmp/rpc-test-6c7be79e56c74ef8b998329b2fac8000.sock every 8 connection(s)
I20260926 22:06:03.605791 10305 rpc-test.cc:234] Connecting to unix:/tmp/dist-test-task4eaUur/test-tmp/rpc-test-6c7be79e56c74ef8b998329b2fac8000.sock
[       OK ] Parameters/TestRpc.TestCall/SSL_UnixSocket (85 ms)
[ RUN      ] Parameters/TestRpc.TestCallWithChainCertAndRootCA/SSL_UnixSocket
I20260926 22:06:03.684954 10413 acceptor_pool.cc:254] collecting diagnostics on the listening RPC socket unix:/tmp/dist-test-task4eaUur/test-tmp/rpc-test-8bd89ad4340941a4aeb64a41d086ea83.sock every 8 connection(s)
I20260926 22:06:03.685634 10414 acceptor_pool.cc:254] collecting diagnostics on the listening RPC socket unix:/tmp/dist-test-task4eaUur/test-tmp/rpc-test-8bd89ad4340941a4aeb64a41d086ea83.sock every 8 connection(s)
/data0/somelongdirectorytoavoidrpathissues/src/kudu/src/kudu/rpc/rpc-test.cc:303: Failure
Failed
Bad status: Runtime error: could not verify certificate chain (error with cert: subject=CN = localhost, ST = sadfjas, C = AS, emailAddress = sdflkdsajf, O = lskdfjlsad, OU = sldfkja, issuer=C = AS, ST = ASDfkjdhf, L = lskdjf, O = saldfja, OU = skdjf, CN = localhost, emailAddress = sadjflkadsj): : certificate has expired
Google Test trace:
/data0/somelongdirectorytoavoidrpathissues/src/kudu/src/kudu/rpc/rpc-test.cc:300: Connecting to unix:/tmp/dist-test-task4eaUur/test-tmp/rpc-test-8bd89ad4340941a4aeb64a41d086ea83.sock
I20260926 22:06:03.704347 10305 test_util.cc:175] -----------------------------------------------
I20260926 22:06:03.704530 10305 test_util.cc:176] Had fatal failures, leaving test files at /tmp/dist-test-task4eaUur/test-tmp/rpc-test.2.Parameters_TestRpc.TestCallWithChainCertAndRootCA_SSL_UnixSocket.1790460360234630-10305-0
[  FAILED  ] Parameters/TestRpc.TestCallWithChainCertAndRootCA/SSL_UnixSocket, where GetParam() = (true, true) (38 ms)
[ RUN      ] Parameters/TestRpc.TestCallWithBadPasswordProtectedKey/SSL_UnixSocket
[       OK ] Parameters/TestRpc.TestCallWithBadPasswordProtectedKey/SSL_UnixSocket (28 ms)
[ RUN      ] Parameters/TestRpc.TestInvalidMethodCall/SSL_UnixSocket
I20260926 22:06:03.789197 10450 acceptor_pool.cc:254] collecting diagnostics on the listening RPC socket unix:/tmp/dist-test-task4eaUur/test-tmp/rpc-test-2111bee225e84b528c84ab8970406db4.sock every 8 connection(s)
I20260926 22:06:03.789897 10451 acceptor_pool.cc:254] collecting diagnostics on the listening RPC socket unix:/tmp/dist-test-task4eaUur/test-tmp/rpc-test-2111bee225e84b528c84ab8970406db4.sock every 8 connection(s)
I20260926 22:06:03.793026 10305 rpc-test.cc:406] Connecting to unix:/tmp/dist-test-task4eaUur/test-tmp/rpc-test-2111bee225e84b528c84ab8970406db4.sock
W20260926 22:06:03.817790 10447 connection.cc:196] Error closing socket: Network error: TlsSocket::Close: Broken pipe
[       OK ] Parameters/TestRpc.TestInvalidMethodCall/SSL_UnixSocket (88 ms)
[ RUN      ] Parameters/TestRpc.TestHighFDs/SSL_UnixSocket
I20260926 22:06:04.020251 10475 acceptor_pool.cc:254] collecting diagnostics on the listening RPC socket unix:/tmp/dist-test-task4eaUur/test-tmp/rpc-test-f7997916cfbb4bb29a4be1d7c3cbf8b9.sock every 8 connection(s)
I20260926 22:06:04.020941 10476 acceptor_pool.cc:254] collecting diagnostics on the listening RPC socket unix:/tmp/dist-test-task4eaUur/test-tmp/rpc-test-f7997916cfbb4bb29a4be1d7c3cbf8b9.sock every 8 connection(s)
W20260926 22:06:04.062034 10472 connection.cc:196] Error closing socket: Network error: TlsSocket::Close: Broken pipe
[       OK ] Parameters/TestRpc.TestHighFDs/SSL_UnixSocket (251 ms)
[ RUN      ] Parameters/TestRpc.TestConnectionAlwaysKeepalive/SSL_UnixSocket
I20260926 22:06:04.093650 10498 acceptor_pool.cc:254] collecting diagnostics on the listening RPC socket unix:/tmp/dist-test-task4eaUur/test-tmp/rpc-test-947c10534bc94e3d921b70aa7e5d69bb.sock every 8 connection(s)
I20260926 22:06:04.094318 10499 acceptor_pool.cc:254] collecting diagnostics on the listening RPC socket unix:/tmp/dist-test-task4eaUur/test-tmp/rpc-test-947c10534bc94e3d921b70aa7e5d69bb.sock every 8 connection(s)
I20260926 22:06:04.097199 10305 rpc-test.cc:532] Connecting to unix:/tmp/dist-test-task4eaUur/test-tmp/rpc-test-947c10534bc94e3d921b70aa7e5d69bb.sock
W20260926 22:06:07.140202 10497 connection.cc:196] Error closing socket: Network error: TlsSocket::Close: Broken pipe
[       OK ] Parameters/TestRpc.TestConnectionAlwaysKeepalive/SSL_UnixSocket (3071 ms)
[ RUN      ] Parameters/TestRpc.TestReopenOutboundConnections/SSL_UnixSocket
I20260926 22:06:07.166308 10521 acceptor_pool.cc:254] collecting diagnostics on the listening RPC socket unix:/tmp/dist-test-task4eaUur/test-tmp/rpc-test-643187844f7447009d4223e5d6c17e4e.sock every 8 connection(s)
I20260926 22:06:07.167016 10522 acceptor_pool.cc:254] collecting diagnostics on the listening RPC socket unix:/tmp/dist-test-task4eaUur/test-tmp/rpc-test-643187844f7447009d4223e5d6c17e4e.sock every 8 connection(s)
I20260926 22:06:07.170310 10305 rpc-test.cc:658] Connecting to unix:/tmp/dist-test-task4eaUur/test-tmp/rpc-test-643187844f7447009d4223e5d6c17e4e.sock
W20260926 22:06:07.199698 10520 connection.cc:196] Error closing socket: Network error: TlsSocket::Close: Broken pipe
W20260926 22:06:07.209200 10520 connection.cc:196] Error closing socket: Network error: TlsSocket::Close: Broken pipe
W20260926 22:06:07.219165 10520 connection.cc:196] Error closing socket: Network error: TlsSocket::Close: Broken pipe
W20260926 22:06:07.228967 10520 connection.cc:196] Error closing socket: Network error: TlsSocket::Close: Broken pipe
W20260926 22:06:07.238874 10520 connection.cc:196] Error closing socket: Network error: TlsSocket::Close: Broken pipe
W20260926 22:06:07.248919 10520 connection.cc:196] Error closing socket: Network error: TlsSocket::Close: Broken pipe
W20260926 22:06:07.259043 10520 connection.cc:196] Error closing socket: Network error: TlsSocket::Close: Broken pipe
W20260926 22:06:07.279627 10520 connection.cc:196] Error closing socket: Network error: TlsSocket::Close: Broken pipe
W20260926 22:06:07.289440 10520 connection.cc:196] Error closing socket: Network error: TlsSocket::Close: Broken pipe
W20260926 22:06:07.299279 10520 connection.cc:196] Error closing socket: Network error: TlsSocket::Close: Broken pipe
W20260926 22:06:07.309136 10520 connection.cc:196] Error closing socket: Network error: TlsSocket::Close: Broken pipe
W20260926 22:06:07.318800 10520 connection.cc:196] Error closing socket: Network error: TlsSocket::Close: Broken pipe
W20260926 22:06:07.328732 10520 connection.cc:196] Error closing socket: Network error: TlsSocket::Close: Broken pipe
W20260926 22:06:07.328753 10521 acceptor_pool.cc:285] unable to collect diagnostics on RPC socket unix:/tmp/dist-test-task4eaUur/test-tmp/rpc-test-643187844f7447009d4223e5d6c17e4e.sock: Not implemented: netlink diagnostics is currently supported only on IPv4 TCP sockets
W20260926 22:06:07.338153 10520 connection.cc:196] Error closing socket: Network error: TlsSocket::Close: Broken pipe
W20260926 22:06:07.347395 10520 connection.cc:196] Error closing socket: Network error: TlsSocket::Close: Broken pipe
W20260926 22:06:07.357028 10520 connection.cc:196] Error closing socket: Network error: TlsSocket::Close: Broken pipe
W20260926 22:06:07.367076 10520 connection.cc:196] Error closing socket: Network error: TlsSocket::Close: Broken pipe
W20260926 22:06:07.377170 10520 connection.cc:196] Error closing socket: Network error: TlsSocket::Close: Broken pipe
W20260926 22:06:07.387156 10520 connection.cc:196] Error closing socket: Network error: TlsSocket::Close: Broken pipe
W20260926 22:06:07.397272 10520 connection.cc:196] Error closing socket: Network error: TlsSocket::Close: Broken pipe
W20260926 22:06:07.407326 10520 connection.cc:196] Error closing socket: Network error: TlsSocket::Close: Broken pipe
W20260926 22:06:07.416787 10520 connection.cc:196] Error closing socket: Network error: TlsSocket::Close: Broken pipe
W20260926 22:06:07.426666 10520 connection.cc:196] Error closing socket: Network error: TlsSocket::Close: Broken pipe
W20260926 22:06:07.436327 10520 connection.cc:196] Error closing socket: Network error: TlsSocket::Close: Broken pipe
W20260926 22:06:07.445474 10520 connection.cc:196] Error closing socket: Network error: TlsSocket::Close: Broken pipe
W20260926 22:06:07.454412 10520 connection.cc:196] Error closing socket: Network error: TlsSocket::Close: Broken pipe
W20260926 22:06:07.463462 10520 connection.cc:196] Error closing socket: Network error: TlsSocket::Close: Broken pipe
W20260926 22:06:07.472472 10520 connection.cc:196] Error closing socket: Network error: TlsSocket::Close: Broken pipe
W20260926 22:06:07.481283 10520 connection.cc:196] Error closing socket: Network error: TlsSocket::Close: Broken pipe
W20260926 22:06:07.489985 10520 connection.cc:196] Error closing socket: Network error: TlsSocket::Close: Broken pipe
W20260926 22:06:07.500340 10520 connection.cc:196] Error closing socket: Network error: TlsSocket::Close: Broken pipe
[       OK ] Parameters/TestRpc.TestReopenOutboundConnections/SSL_UnixSocket (359 ms)
[ RUN      ] Parameters/TestRpc.TestConnectionNetworkPlane/SSL_UnixSocket
I20260926 22:06:07.525460 10544 acceptor_pool.cc:254] collecting diagnostics on the listening RPC socket unix:/tmp/dist-test-task4eaUur/test-tmp/rpc-test-ab5eb66c011041ac8b2f63912cd4d055.sock every 8 connection(s)
I20260926 22:06:07.526119 10545 acceptor_pool.cc:254] collecting diagnostics on the listening RPC socket unix:/tmp/dist-test-task4eaUur/test-tmp/rpc-test-ab5eb66c011041ac8b2f63912cd4d055.sock every 8 connection(s)
I20260926 22:06:07.529197 10305 rpc-test.cc:772] Connecting to unix:/tmp/dist-test-task4eaUur/test-tmp/rpc-test-ab5eb66c011041ac8b2f63912cd4d055.sock
W20260926 22:06:07.607614 10543 connection.cc:196] Error closing socket: Network error: TlsSocket::Close: Broken pipe
W20260926 22:06:07.608378 10543 connection.cc:196] Error closing socket: Network error: TlsSocket::Close: Broken pipe
[       OK ] Parameters/TestRpc.TestConnectionNetworkPlane/SSL_UnixSocket (108 ms)
[ RUN      ] Parameters/TestRpc.TestTCPKeepalive/SSL_UnixSocket
I20260926 22:06:07.640496 10569 acceptor_pool.cc:254] collecting diagnostics on the listening RPC socket unix:/tmp/dist-test-task4eaUur/test-tmp/rpc-test-521652d13ba44311930c5e3551e7cc26.sock every 8 connection(s)
I20260926 22:06:07.641201 10570 acceptor_pool.cc:254] collecting diagnostics on the listening RPC socket unix:/tmp/dist-test-task4eaUur/test-tmp/rpc-test-521652d13ba44311930c5e3551e7cc26.sock every 8 connection(s)
I20260926 22:06:07.666338 10573 rpc-test-base.h:222] got call: sleep_micros: 8000000 deferred: true
I20260926 22:06:15.670290 10573 rpcz_store.cc:275] Call kudu.rpc.GenericCalculatorService.Sleep from unix:<unnamed> (request call id 0) took 8004 ms. Trace:
I20260926 22:06:15.670717 10573 rpcz_store.cc:276] 0926 22:06:07.666194 (+     0us) service_pool.cc:170] Inserting onto call queue
0926 22:06:07.666287 (+    93us) service_pool.cc:227] Handling call
0926 22:06:15.670127 (+8003840us) inbound_call.cc:173] Queueing success response
Metrics: {}
W20260926 22:06:15.677150 10566 connection.cc:196] Error closing socket: Network error: TlsSocket::Close: Broken pipe
[       OK ] Parameters/TestRpc.TestTCPKeepalive/SSL_UnixSocket (8070 ms)
[ RUN      ] Parameters/TestRpc.TestMaxSmallSidecars/SSL_UnixSocket
I20260926 22:06:15.726575 10595 acceptor_pool.cc:254] collecting diagnostics on the listening RPC socket unix:/tmp/dist-test-task4eaUur/test-tmp/rpc-test-765607320ebe4837ad9431f21e1a7f5f.sock every 8 connection(s)
I20260926 22:06:15.727377 10596 acceptor_pool.cc:254] collecting diagnostics on the listening RPC socket unix:/tmp/dist-test-task4eaUur/test-tmp/rpc-test-765607320ebe4837ad9431f21e1a7f5f.sock every 8 connection(s)
W20260926 22:06:15.893738 10592 connection.cc:196] Error closing socket: Network error: TlsSocket::Close: Broken pipe
[       OK ] Parameters/TestRpc.TestMaxSmallSidecars/SSL_UnixSocket (214 ms)
[ RUN      ] Parameters/TestRpc.TestCallTimeout/SSL_UnixSocket
I20260926 22:06:15.922472 10620 acceptor_pool.cc:254] collecting diagnostics on the listening RPC socket unix:/tmp/dist-test-task4eaUur/test-tmp/rpc-test-2c65e9dffe0143b68328ae43c4050f77.sock every 8 connection(s)
I20260926 22:06:15.923273 10621 acceptor_pool.cc:254] collecting diagnostics on the listening RPC socket unix:/tmp/dist-test-task4eaUur/test-tmp/rpc-test-2c65e9dffe0143b68328ae43c4050f77.sock every 8 connection(s)
I20260926 22:06:15.950171 10305 rpc-test-base.h:595] status: Timed out: connection negotiation to unix:/tmp/dist-test-task4eaUur/test-tmp/rpc-test-2c65e9dffe0143b68328ae43c4050f77.sock for RPC Sleep timed out after 0.000s (ON_OUTBOUND_QUEUE), seconds elapsed: 0.00232159
I20260926 22:06:15.957365 10624 rpc-test-base.h:222] got call: sleep_micros: 700000
I20260926 22:06:16.150942 10305 rpc-test-base.h:595] status: Timed out: Sleep RPC to unix:/tmp/dist-test-task4eaUur/test-tmp/rpc-test-2c65e9dffe0143b68328ae43c4050f77.sock timed out after 0.200s (SENT), seconds elapsed: 0.200474
I20260926 22:06:16.152263 10623 rpc-test-base.h:222] got call: sleep_micros: 2000000
W20260926 22:06:16.657964 10624 rpcz_store.cc:267] Call kudu.rpc.GenericCalculatorService.Sleep from unix:<unnamed> (request call id 1) took 700 ms (client timeout 200 ms). Trace:
W20260926 22:06:16.658329 10624 rpcz_store.cc:269] 0926 22:06:15.957202 (+     0us) service_pool.cc:170] Inserting onto call queue
0926 22:06:15.957316 (+   114us) service_pool.cc:227] Handling call
0926 22:06:16.657913 (+700597us) inbound_call.cc:173] Queueing success response
Metrics: {}
I20260926 22:06:17.653451 10305 rpc-test-base.h:595] status: Timed out: Sleep RPC to unix:/tmp/dist-test-task4eaUur/test-tmp/rpc-test-2c65e9dffe0143b68328ae43c4050f77.sock timed out after 1.500s (SENT), seconds elapsed: 1.50216
W20260926 22:06:18.152763 10623 rpcz_store.cc:267] Call kudu.rpc.GenericCalculatorService.Sleep from unix:<unnamed> (request call id 2) took 2000 ms (client timeout 1500 ms). Trace:
W20260926 22:06:18.153060 10623 rpcz_store.cc:269] 0926 22:06:16.152076 (+     0us) service_pool.cc:170] Inserting onto call queue
0926 22:06:16.152197 (+   121us) service_pool.cc:227] Handling call
0926 22:06:18.152708 (+2000511us) inbound_call.cc:173] Queueing success response
Metrics: {}
W20260926 22:06:18.153640 10617 connection.cc:441] server connection from unix:<unnamed> torn down before Call kudu.rpc.GenericCalculatorService.Sleep from unix:<unnamed> (request call id 2) could send its response
[       OK ] Parameters/TestRpc.TestCallTimeout/SSL_UnixSocket (2259 ms)
[ RUN      ] Parameters/TestRpc.TestServerShutsDown/SSL_UnixSocket
I20260926 22:06:18.160351 10305 rpc-test.cc:1125] Connecting to 0.0.0.0:38755
W20260926 22:06:18.169654 10637 negotiation.cc:337] Failed RPC negotiation. Trace:
0926 22:06:18.168158 (+     0us) reactor.cc:625] Submitting negotiation task for client connection to 0.0.0.0:38755 (local address 127.0.0.1:34154)
0926 22:06:18.168639 (+   481us) negotiation.cc:107] Waiting for socket to connect
0926 22:06:18.168671 (+    32us) client_negotiation.cc:174] Beginning negotiation
0926 22:06:18.168886 (+   215us) client_negotiation.cc:252] Sending NEGOTIATE NegotiatePB request
0926 22:06:18.169126 (+   240us) negotiation.cc:327] Negotiation complete: Network error: Client connection negotiation failed: client connection to 0.0.0.0:38755: BlockingWrite error: write error: Broken pipe (error 32)
Metrics: {"client-negotiator.queue_time_us":128}
[       OK ] Parameters/TestRpc.TestServerShutsDown/SSL_UnixSocket (13 ms)
[ RUN      ] Parameters/TestRpc.TimedOutOnResponseMetric/SSL_UnixSocket
I20260926 22:06:18.194484 10654 acceptor_pool.cc:254] collecting diagnostics on the listening RPC socket unix:/tmp/dist-test-task4eaUur/test-tmp/rpc-test-88bb32c14da649dfa4b28d0d610cbd00.sock every 8 connection(s)
I20260926 22:06:18.195148 10655 acceptor_pool.cc:254] collecting diagnostics on the listening RPC socket unix:/tmp/dist-test-task4eaUur/test-tmp/rpc-test-88bb32c14da649dfa4b28d0d610cbd00.sock every 8 connection(s)
W20260926 22:06:18.444281 10658 rpcz_store.cc:267] Call kudu.rpc_test.CalculatorService.Sleep from unix:<unnamed> (request call id 3) took 50 ms (client timeout 25 ms). Trace:
W20260926 22:06:18.444597 10658 rpcz_store.cc:269] 0926 22:06:18.393645 (+     0us) service_pool.cc:170] Inserting onto call queue
0926 22:06:18.393785 (+   140us) service_pool.cc:227] Handling call
0926 22:06:18.444207 (+ 50422us) inbound_call.cc:173] Queueing success response
Related trace 'test_child':
Metrics: {"test_sleep_us":50000,"child_traces":[["test_child",{"related_trace_metric":1}]]}
W20260926 22:06:18.503837 10658 rpcz_store.cc:267] Call kudu.rpc_test.CalculatorService.Sleep from unix:<unnamed> (request call id 4) took 50 ms (client timeout 50 ms). Trace:
W20260926 22:06:18.504184 10658 rpcz_store.cc:269] 0926 22:06:18.453239 (+     0us) service_pool.cc:170] Inserting onto call queue
0926 22:06:18.453377 (+   138us) service_pool.cc:227] Handling call
0926 22:06:18.503769 (+ 50392us) inbound_call.cc:173] Queueing success response
Related trace 'test_child':
Metrics: {"test_sleep_us":50000,"child_traces":[["test_child",{"related_trace_metric":1}]]}
W20260926 22:06:18.506489 10651 connection.cc:196] Error closing socket: Network error: TlsSocket::Close: Broken pipe
[       OK ] Parameters/TestRpc.TimedOutOnResponseMetric/SSL_UnixSocket (339 ms)
[ RUN      ] Parameters/TestRpc.AcceptorDispatchingTimesMetric/SSL_UnixSocket
I20260926 22:06:18.523540 10679 acceptor_pool.cc:254] collecting diagnostics on the listening RPC socket 0.0.0.0:35213 every 8 connection(s)
I20260926 22:06:18.524170 10680 acceptor_pool.cc:254] collecting diagnostics on the listening RPC socket 0.0.0.0:35213 every 8 connection(s)
W20260926 22:06:18.529986 10675 negotiation.cc:337] Failed RPC negotiation. Trace:
0926 22:06:18.527941 (+     0us) reactor.cc:625] Submitting negotiation task for server connection from 127.0.0.1:59784 (local address 127.0.0.1:35213)
0926 22:06:18.528491 (+   550us) server_negotiation.cc:206] Beginning negotiation
0926 22:06:18.528516 (+    25us) server_negotiation.cc:399] Waiting for connection header
0926 22:06:18.528834 (+   318us) negotiation.cc:327] Negotiation complete: Network error: Server connection negotiation failed: server connection from 127.0.0.1:59784: BlockingRecv error: recv got EOF from 127.0.0.1:59784 (error 108)
Metrics: {"server-negotiator.queue_time_us":175}
[       OK ] Parameters/TestRpc.AcceptorDispatchingTimesMetric/SSL_UnixSocket (21 ms)
[ RUN      ] Parameters/TestRpc.TestRpcCallbackDestroysMessenger/SSL_UnixSocket
[       OK ] Parameters/TestRpc.TestRpcCallbackDestroysMessenger/SSL_UnixSocket (55 ms)
[ RUN      ] Parameters/TestRpc.TestApplicationFeatureFlag/SSL_UnixSocket
I20260926 22:06:18.614771 10704 acceptor_pool.cc:254] collecting diagnostics on the listening RPC socket unix:/tmp/dist-test-task4eaUur/test-tmp/rpc-test-8f8ee28896b049a28f0456351a3e2972.sock every 8 connection(s)
I20260926 22:06:18.615504 10705 acceptor_pool.cc:254] collecting diagnostics on the listening RPC socket unix:/tmp/dist-test-task4eaUur/test-tmp/rpc-test-8f8ee28896b049a28f0456351a3e2972.sock every 8 connection(s)
W20260926 22:06:18.656773 10701 messenger.cc:357] Unable to handle RPC call: Not implemented: call requires unsupported application feature flags: 99
W20260926 22:06:18.659999 10701 connection.cc:196] Error closing socket: Network error: TlsSocket::Close: Broken pipe
[       OK ] Parameters/TestRpc.TestApplicationFeatureFlag/SSL_UnixSocket (76 ms)
[ RUN      ] Parameters/TestRpc.TestCancellation/SSL_UnixSocket
I20260926 22:06:18.699206 10729 acceptor_pool.cc:254] collecting diagnostics on the listening RPC socket unix:/tmp/dist-test-task4eaUur/test-tmp/rpc-test-3965fde28cc24a4d8e858d7d8009b5be.sock every 8 connection(s)
I20260926 22:06:18.699891 10730 acceptor_pool.cc:254] collecting diagnostics on the listening RPC socket unix:/tmp/dist-test-task4eaUur/test-tmp/rpc-test-3965fde28cc24a4d8e858d7d8009b5be.sock every 8 connection(s)
I20260926 22:06:18.703037 10305 rpc-test.cc:1648] Connecting to unix:/tmp/dist-test-task4eaUur/test-tmp/rpc-test-3965fde28cc24a4d8e858d7d8009b5be.sock
I20260926 22:06:18.805101 10305 rpc-test-base.h:595] status: Aborted: Sleep RPC to unix:/tmp/dist-test-task4eaUur/test-tmp/rpc-test-3965fde28cc24a4d8e858d7d8009b5be.sock is cancelled in state READY, seconds elapsed: 0.000361766
I20260926 22:06:18.966800 10305 rpc-test-base.h:595] status: Aborted: Sleep RPC to unix:/tmp/dist-test-task4eaUur/test-tmp/rpc-test-3965fde28cc24a4d8e858d7d8009b5be.sock is cancelled in state SENT, seconds elapsed: 0.000900523
I20260926 22:06:18.966980 10732 rpc-test-base.h:222] got call: sleep_micros: 510000
I20260926 22:06:19.133461 10305 rpc-test-base.h:595] status: Aborted: Sleep RPC to unix:/tmp/dist-test-task4eaUur/test-tmp/rpc-test-3965fde28cc24a4d8e858d7d8009b5be.sock is cancelled in state SENT, seconds elapsed: 0.000791694
I20260926 22:06:19.133674 10731 rpc-test-base.h:222] got call: sleep_micros: 510000
I20260926 22:06:19.316676 10305 rpc-test-base.h:595] status: Aborted: Sleep RPC to unix:/tmp/dist-test-task4eaUur/test-tmp/rpc-test-3965fde28cc24a4d8e858d7d8009b5be.sock is cancelled in state SENT, seconds elapsed: 0.000734299
W20260926 22:06:19.327447 10733 rpcz_store.cc:267] Call kudu.rpc.GenericCalculatorService.Sleep from unix:<unnamed> (request call id 11) took 10 ms (client timeout 10 ms). Trace:
W20260926 22:06:19.327724 10733 rpcz_store.cc:269] 0926 22:06:19.316890 (+     0us) service_pool.cc:170] Inserting onto call queue
0926 22:06:19.327212 (+ 10322us) service_pool.cc:214] Skipping call since client already timed out
0926 22:06:19.327301 (+    89us) inbound_call.cc:173] Queueing failure response
Metrics: {}
I20260926 22:06:19.328169 10733 rpc-test-base.h:222] got call: sleep_micros: 1500000
W20260926 22:06:19.477581 10732 rpcz_store.cc:267] Call kudu.rpc.GenericCalculatorService.Sleep from unix:<unnamed> (request call id 3) took 510 ms (client timeout 10 ms). Trace:
W20260926 22:06:19.477885 10732 rpcz_store.cc:269] 0926 22:06:18.966831 (+     0us) service_pool.cc:170] Inserting onto call queue
0926 22:06:18.966938 (+   107us) service_pool.cc:227] Handling call
0926 22:06:19.477527 (+510589us) inbound_call.cc:173] Queueing success response
Metrics: {}
W20260926 22:06:19.644196 10731 rpcz_store.cc:267] Call kudu.rpc.GenericCalculatorService.Sleep from unix:<unnamed> (request call id 7) took 510 ms (client timeout 10 ms). Trace:
W20260926 22:06:19.644527 10731 rpcz_store.cc:269] 0926 22:06:19.133502 (+     0us) service_pool.cc:170] Inserting onto call queue
0926 22:06:19.133604 (+   102us) service_pool.cc:227] Handling call
0926 22:06:19.644141 (+510537us) inbound_call.cc:173] Queueing success response
Metrics: {}
I20260926 22:06:20.318531 10305 rpc-test-base.h:595] status: Timed out: Sleep RPC to unix:/tmp/dist-test-task4eaUur/test-tmp/rpc-test-3965fde28cc24a4d8e858d7d8009b5be.sock timed out after 1.000s (SENT), seconds elapsed: 1.00135
I20260926 22:06:20.320426 10731 rpc-test-base.h:222] got call: sleep_micros: 1500000
W20260926 22:06:20.828779 10733 rpcz_store.cc:267] Call kudu.rpc.GenericCalculatorService.Sleep from unix:<unnamed> (request call id 12) took 1511 ms (client timeout 1000 ms). Trace:
W20260926 22:06:20.829108 10733 rpcz_store.cc:269] 0926 22:06:19.317674 (+     0us) service_pool.cc:170] Inserting onto call queue
0926 22:06:19.328143 (+ 10469us) service_pool.cc:227] Handling call
0926 22:06:20.828639 (+1500496us) inbound_call.cc:173] Queueing success response
Metrics: {}
I20260926 22:06:21.320964 10305 rpc-test-base.h:595] status: Timed out: Sleep RPC to unix:/tmp/dist-test-task4eaUur/test-tmp/rpc-test-3965fde28cc24a4d8e858d7d8009b5be.sock timed out after 1.000s (SENT), seconds elapsed: 1.00199
W20260926 22:06:21.322409 10726 messenger.cc:357] Unable to handle RPC call: Not implemented: call requires unsupported application feature flags: 99, 1
W20260926 22:06:21.323905 10726 messenger.cc:357] Unable to handle RPC call: Not implemented: call requires unsupported application feature flags: 99, 1
W20260926 22:06:21.540601 10726 connection.cc:196] Error closing socket: Network error: TlsSocket::Close: Broken pipe
W20260926 22:06:21.821025 10731 rpcz_store.cc:267] Call kudu.rpc.GenericCalculatorService.Sleep from unix:<unnamed> (request call id 13) took 1501 ms (client timeout 1000 ms). Trace:
W20260926 22:06:21.821323 10731 rpcz_store.cc:269] 0926 22:06:20.320111 (+     0us) service_pool.cc:170] Inserting onto call queue
0926 22:06:20.320313 (+   202us) service_pool.cc:227] Handling call
0926 22:06:21.820972 (+1500659us) inbound_call.cc:173] Queueing success response
Metrics: {}
W20260926 22:06:21.821851 10726 connection.cc:441] server connection from unix:<unnamed> torn down before Call kudu.rpc.GenericCalculatorService.Sleep from unix:<unnamed> (request call id 13) could send its response
[       OK ] Parameters/TestRpc.TestCancellation/SSL_UnixSocket (3164 ms)
[ RUN      ] Parameters/TestRpc.TestCancellationMultiThreads/SSL_UnixSocket
I20260926 22:06:21.855499 10755 acceptor_pool.cc:254] collecting diagnostics on the listening RPC socket unix:/tmp/dist-test-task4eaUur/test-tmp/rpc-test-63db074edb51491b9a294056d401d663.sock every 8 connection(s)
I20260926 22:06:21.856308 10756 acceptor_pool.cc:254] collecting diagnostics on the listening RPC socket unix:/tmp/dist-test-task4eaUur/test-tmp/rpc-test-63db074edb51491b9a294056d401d663.sock every 8 connection(s)
I20260926 22:06:21.859378 10305 rpc-test.cc:1808] Connecting to unix:/tmp/dist-test-task4eaUur/test-tmp/rpc-test-63db074edb51491b9a294056d401d663.sock
I20260926 22:06:22.014803 10769 test_util.cc:268] Using random seed: 185461994
I20260926 22:06:22.015817 10770 test_util.cc:268] Using random seed: 185463088
I20260926 22:06:22.017781 10771 test_util.cc:268] Using random seed: 185464942
I20260926 22:06:22.019157 10772 test_util.cc:268] Using random seed: 185466387
I20260926 22:06:22.020776 10773 test_util.cc:268] Using random seed: 185467891
I20260926 22:06:22.022172 10774 test_util.cc:268] Using random seed: 185469310
I20260926 22:06:22.024137 10775 test_util.cc:268] Using random seed: 185471273
I20260926 22:06:22.025566 10776 test_util.cc:268] Using random seed: 185472685
I20260926 22:06:22.027042 10777 test_util.cc:268] Using random seed: 185474178
I20260926 22:06:22.028388 10778 test_util.cc:268] Using random seed: 185475526
I20260926 22:06:22.030037 10779 test_util.cc:268] Using random seed: 185477158
I20260926 22:06:22.032047 10780 test_util.cc:268] Using random seed: 185479180
I20260926 22:06:22.033862 10781 test_util.cc:268] Using random seed: 185480949
I20260926 22:06:22.035611 10782 test_util.cc:268] Using random seed: 185482683
I20260926 22:06:22.037113 10783 test_util.cc:268] Using random seed: 185484221
I20260926 22:06:22.038829 10784 test_util.cc:268] Using random seed: 185485927
I20260926 22:06:22.040757 10785 test_util.cc:268] Using random seed: 185487810
I20260926 22:06:22.042497 10786 test_util.cc:268] Using random seed: 185489584
I20260926 22:06:22.044134 10787 test_util.cc:268] Using random seed: 185491242
I20260926 22:06:22.045881 10788 test_util.cc:268] Using random seed: 185492948
I20260926 22:06:22.047787 10789 test_util.cc:268] Using random seed: 185494893
I20260926 22:06:22.049312 10790 test_util.cc:268] Using random seed: 185496433
I20260926 22:06:22.051095 10791 test_util.cc:268] Using random seed: 185498162
I20260926 22:06:22.052651 10792 test_util.cc:268] Using random seed: 185499768
I20260926 22:06:22.054369 10793 test_util.cc:268] Using random seed: 185501475
I20260926 22:06:22.055979 10794 test_util.cc:268] Using random seed: 185503028
I20260926 22:06:22.057618 10795 test_util.cc:268] Using random seed: 185504741
I20260926 22:06:22.059187 10796 test_util.cc:268] Using random seed: 185506288
I20260926 22:06:22.060593 10797 test_util.cc:268] Using random seed: 185507723
I20260926 22:06:22.062093 10798 test_util.cc:268] Using random seed: 185509205
W20260926 22:06:41.212215 10752 connection.cc:196] Error closing socket: Network error: TlsSocket::Close: Broken pipe
[       OK ] Parameters/TestRpc.TestCancellationMultiThreads/SSL_UnixSocket (19399 ms)
[ RUN      ] Parameters/TestRpc.TestCallId/SSL_UnixSocket
I20260926 22:06:41.245270 10812 acceptor_pool.cc:254] collecting diagnostics on the listening RPC socket unix:/tmp/dist-test-task4eaUur/test-tmp/rpc-test-02196728bfc64312aed9db2770e46a08.sock every 8 connection(s)
I20260926 22:06:41.246063 10813 acceptor_pool.cc:254] collecting diagnostics on the listening RPC socket unix:/tmp/dist-test-task4eaUur/test-tmp/rpc-test-02196728bfc64312aed9db2770e46a08.sock every 8 connection(s)
[       OK ] Parameters/TestRpc.TestCallId/SSL_UnixSocket (68 ms)
[----------] 20 tests from Parameters/TestRpc (37890 ms total)

[----------] Global test environment tear-down
[==========] 21 tests from 2 test suites ran. (41013 ms total)
[  PASSED  ] 20 tests.
[  FAILED  ] 1 test, listed below:
[  FAILED  ] Parameters/TestRpc.TestCallWithChainCertAndRootCA/SSL_UnixSocket, where GetParam() = (true, true)

 1 FAILED TEST
I20260926 22:06:41.315461 10305 logging.cc:424] LogThrottler /data0/somelongdirectorytoavoidrpathissues/src/kudu/src/kudu/rpc/acceptor_pool.cc:285: suppressed but not reported on 3 messages since previous log ~33 seconds ago