Diagnosed failure

Parameters/TestRpc.TestCallWithChainCertAndChainCA/SSL_UnixSocket: /data0/somelongdirectorytoavoidrpathissues/src/kudu/src/kudu/rpc/rpc-test.cc:270: Failure
Failed
Bad status: Runtime error: could not verify certificate chain (error with cert: subject=CN = localhost, ST = sadfjas, C = AS, emailAddress = sdflkdsajf, O = lskdfjlsad, OU = sldfkja, issuer=C = AS, ST = ASDfkjdhf, L = lskdjf, O = saldfja, OU = skdjf, CN = localhost, emailAddress = sadjflkadsj): : certificate has expired
Google Test trace:
/data0/somelongdirectorytoavoidrpathissues/src/kudu/src/kudu/rpc/rpc-test.cc:267: Connecting to unix:/tmp/dist-test-task1HRXeA/test-tmp/rpc-test-b86574d5c9414a3d81c8c81c3e736175.sock
I20260924 21:11:22.856061 13534 test_util.cc:175] -----------------------------------------------
I20260924 21:11:22.856109 13534 test_util.cc:176] Had fatal failures, leaving test files at /tmp/dist-test-task1HRXeA/test-tmp/rpc-test.6.Parameters_TestRpc.TestCallWithChainCertAndChainCA_SSL_UnixSocket.1790284282747800-13534-0

Full log

Note: This is test shard 7 of 8.
[==========] Running 21 tests from 2 test suites.
[----------] Global test environment set-up.
[----------] 20 tests from Parameters/TestRpc
[ RUN      ] Parameters/TestRpc.TestMessengerCreateDestroy/SSL_UnixSocket
WARNING: Logging before InitGoogleLogging() is written to STDERR
I20260924 21:11:22.781553 13534 rpc-test.cc:169] started messenger TestCreateDestroy
[       OK ] Parameters/TestRpc.TestMessengerCreateDestroy/SSL_UnixSocket (32 ms)
[ RUN      ] Parameters/TestRpc.TestNegotiationDeadlock/SSL_UnixSocket
I20260924 21:11:22.817879 13555 acceptor_pool.cc:254] collecting diagnostics on the listening RPC socket unix:/tmp/dist-test-task1HRXeA/test-tmp/rpc-test-c23aa1fac9ad47a68a3d6adfe83d7cad.sock every 8 connection(s)
I20260924 21:11:22.817879 13554 acceptor_pool.cc:254] collecting diagnostics on the listening RPC socket unix:/tmp/dist-test-task1HRXeA/test-tmp/rpc-test-c23aa1fac9ad47a68a3d6adfe83d7cad.sock every 8 connection(s)
[       OK ] Parameters/TestRpc.TestNegotiationDeadlock/SSL_UnixSocket (41 ms)
[ RUN      ] Parameters/TestRpc.TestCallWithChainCertAndChainCA/SSL_UnixSocket
I20260924 21:11:22.852442 13570 acceptor_pool.cc:254] collecting diagnostics on the listening RPC socket unix:/tmp/dist-test-task1HRXeA/test-tmp/rpc-test-b86574d5c9414a3d81c8c81c3e736175.sock every 8 connection(s)
I20260924 21:11:22.852465 13571 acceptor_pool.cc:254] collecting diagnostics on the listening RPC socket unix:/tmp/dist-test-task1HRXeA/test-tmp/rpc-test-b86574d5c9414a3d81c8c81c3e736175.sock every 8 connection(s)
/data0/somelongdirectorytoavoidrpathissues/src/kudu/src/kudu/rpc/rpc-test.cc:270: Failure
Failed
Bad status: Runtime error: could not verify certificate chain (error with cert: subject=CN = localhost, ST = sadfjas, C = AS, emailAddress = sdflkdsajf, O = lskdfjlsad, OU = sldfkja, issuer=C = AS, ST = ASDfkjdhf, L = lskdjf, O = saldfja, OU = skdjf, CN = localhost, emailAddress = sadjflkadsj): : certificate has expired
Google Test trace:
/data0/somelongdirectorytoavoidrpathissues/src/kudu/src/kudu/rpc/rpc-test.cc:267: Connecting to unix:/tmp/dist-test-task1HRXeA/test-tmp/rpc-test-b86574d5c9414a3d81c8c81c3e736175.sock
I20260924 21:11:22.856061 13534 test_util.cc:175] -----------------------------------------------
I20260924 21:11:22.856109 13534 test_util.cc:176] Had fatal failures, leaving test files at /tmp/dist-test-task1HRXeA/test-tmp/rpc-test.6.Parameters_TestRpc.TestCallWithChainCertAndChainCA_SSL_UnixSocket.1790284282747800-13534-0
[  FAILED  ] Parameters/TestRpc.TestCallWithChainCertAndChainCA/SSL_UnixSocket, where GetParam() = (true, true) (32 ms)
[ RUN      ] Parameters/TestRpc.TestCallWithPasswordProtectedKey/SSL_UnixSocket
I20260924 21:11:22.872308 13595 acceptor_pool.cc:254] collecting diagnostics on the listening RPC socket unix:/tmp/dist-test-task1HRXeA/test-tmp/rpc-test-878eabdd07044ab6b1e0861a69d16431.sock every 8 connection(s)
I20260924 21:11:22.872334 13596 acceptor_pool.cc:254] collecting diagnostics on the listening RPC socket unix:/tmp/dist-test-task1HRXeA/test-tmp/rpc-test-878eabdd07044ab6b1e0861a69d16431.sock every 8 connection(s)
W20260924 21:11:22.882614 13592 connection.cc:196] Error closing socket: Network error: TlsSocket::Close: Broken pipe
[       OK ] Parameters/TestRpc.TestCallWithPasswordProtectedKey/SSL_UnixSocket (27 ms)
[ RUN      ] Parameters/TestRpc.TestCallToBadServer/SSL_UnixSocket
I20260924 21:11:22.889879 13534 rpc-test.cc:394] Status: Network error: Client connection negotiation failed: client connection to 0.0.0.0:0: connect: Connection refused (error 111)
I20260924 21:11:22.890067 13534 rpc-test.cc:394] Status: Network error: Client connection negotiation failed: client connection to 0.0.0.0:0: connect: Connection refused (error 111)
I20260924 21:11:22.890203 13534 rpc-test.cc:394] Status: Network error: Client connection negotiation failed: client connection to 0.0.0.0:0: connect: Connection refused (error 111)
I20260924 21:11:22.890333 13534 rpc-test.cc:394] Status: Network error: Client connection negotiation failed: client connection to 0.0.0.0:0: connect: Connection refused (error 111)
I20260924 21:11:22.890462 13534 rpc-test.cc:394] Status: Network error: Client connection negotiation failed: client connection to 0.0.0.0:0: connect: Connection refused (error 111)
[       OK ] Parameters/TestRpc.TestCallToBadServer/SSL_UnixSocket (7 ms)
[ RUN      ] Parameters/TestRpc.TestWrongService/SSL_UnixSocket
I20260924 21:11:22.897068 13630 acceptor_pool.cc:254] collecting diagnostics on the listening RPC socket unix:/tmp/dist-test-task1HRXeA/test-tmp/rpc-test-92d26bddfdbd464c90a72a24d278aca1.sock every 8 connection(s)
I20260924 21:11:22.897113 13631 acceptor_pool.cc:254] collecting diagnostics on the listening RPC socket unix:/tmp/dist-test-task1HRXeA/test-tmp/rpc-test-92d26bddfdbd464c90a72a24d278aca1.sock every 8 connection(s)
I20260924 21:11:22.930084 13627 messenger.cc:345] service WrongServiceName not registered on TestServer
W20260924 21:11:22.930721 13627 connection.cc:196] Error closing socket: Network error: TlsSocket::Close: Broken pipe
[       OK ] Parameters/TestRpc.TestWrongService/SSL_UnixSocket (40 ms)
[ RUN      ] Parameters/TestRpc.TestConnectionKeepalive/SSL_UnixSocket
I20260924 21:11:22.945415 13653 acceptor_pool.cc:254] collecting diagnostics on the listening RPC socket unix:/tmp/dist-test-task1HRXeA/test-tmp/rpc-test-aa8c30e0c2194982959deba88ffbf790.sock every 8 connection(s)
I20260924 21:11:22.945463 13654 acceptor_pool.cc:254] collecting diagnostics on the listening RPC socket unix:/tmp/dist-test-task1HRXeA/test-tmp/rpc-test-aa8c30e0c2194982959deba88ffbf790.sock every 8 connection(s)
I20260924 21:11:22.945587 13534 rpc-test.cc:488] Connecting to unix:/tmp/dist-test-task1HRXeA/test-tmp/rpc-test-aa8c30e0c2194982959deba88ffbf790.sock
W20260924 21:11:23.433395 13666 connection.cc:196] Error closing socket: Network error: TlsSocket::Close: Broken pipe
[       OK ] Parameters/TestRpc.TestConnectionKeepalive/SSL_UnixSocket (1038 ms)
[ RUN      ] Parameters/TestRpc.TestClientConnectionMetrics/SSL_UnixSocket
I20260924 21:11:23.984972 13678 acceptor_pool.cc:254] collecting diagnostics on the listening RPC socket unix:/tmp/dist-test-task1HRXeA/test-tmp/rpc-test-1a9b9a3c7902462a9617076ecab39d2d.sock every 8 connection(s)
I20260924 21:11:23.985113 13534 rpc-test.cc:569] Connecting to unix:/tmp/dist-test-task1HRXeA/test-tmp/rpc-test-1a9b9a3c7902462a9617076ecab39d2d.sock
I20260924 21:11:23.984987 13679 acceptor_pool.cc:254] collecting diagnostics on the listening RPC socket unix:/tmp/dist-test-task1HRXeA/test-tmp/rpc-test-1a9b9a3c7902462a9617076ecab39d2d.sock every 8 connection(s)
W20260924 21:11:31.874886 13675 connection.cc:196] Error closing socket: Network error: TlsSocket::Close: Broken pipe
[       OK ] Parameters/TestRpc.TestClientConnectionMetrics/SSL_UnixSocket (7905 ms)
[ RUN      ] Parameters/TestRpc.TestCredentialsPolicy/SSL_UnixSocket
I20260924 21:11:31.881330 13701 acceptor_pool.cc:254] collecting diagnostics on the listening RPC socket unix:/tmp/dist-test-task1HRXeA/test-tmp/rpc-test-8036483144a34f28807ead4768348c05.sock every 8 connection(s)
I20260924 21:11:31.881379 13702 acceptor_pool.cc:254] collecting diagnostics on the listening RPC socket unix:/tmp/dist-test-task1HRXeA/test-tmp/rpc-test-8036483144a34f28807ead4768348c05.sock every 8 connection(s)
I20260924 21:11:31.881513 13534 rpc-test.cc:700] Connecting to unix:/tmp/dist-test-task1HRXeA/test-tmp/rpc-test-8036483144a34f28807ead4768348c05.sock
W20260924 21:11:31.897606 13700 connection.cc:196] Error closing socket: Network error: TlsSocket::Close: Broken pipe
[       OK ] Parameters/TestRpc.TestCredentialsPolicy/SSL_UnixSocket (25 ms)
[ RUN      ] Parameters/TestRpc.TestCallLongerThanKeepalive/SSL_UnixSocket
I20260924 21:11:31.920235 13726 acceptor_pool.cc:254] collecting diagnostics on the listening RPC socket unix:/tmp/dist-test-task1HRXeA/test-tmp/rpc-test-74aeed370a814382a65626ef9240446d.sock every 8 connection(s)
I20260924 21:11:31.920264 13727 acceptor_pool.cc:254] collecting diagnostics on the listening RPC socket unix:/tmp/dist-test-task1HRXeA/test-tmp/rpc-test-74aeed370a814382a65626ef9240446d.sock every 8 connection(s)
I20260924 21:11:31.931099 13730 rpc-test-base.h:222] got call: sleep_micros: 3000000 deferred: true
I20260924 21:11:34.931813 13730 rpcz_store.cc:275] Call kudu.rpc.GenericCalculatorService.Sleep from unix:<unnamed> (request call id 0) took 3000 ms. Trace:
I20260924 21:11:34.931908 13730 rpcz_store.cc:276] 0924 21:11:31.931051 (+     0us) service_pool.cc:170] Inserting onto call queue
0924 21:11:31.931083 (+    32us) service_pool.cc:227] Handling call
0924 21:11:34.931797 (+3000714us) inbound_call.cc:173] Queueing success response
Metrics: {}
[       OK ] Parameters/TestRpc.TestCallLongerThanKeepalive/SSL_UnixSocket (3032 ms)
[ RUN      ] Parameters/TestRpc.TestRpcSidecar/SSL_UnixSocket
I20260924 21:11:34.947461 13751 acceptor_pool.cc:254] collecting diagnostics on the listening RPC socket unix:/tmp/dist-test-task1HRXeA/test-tmp/rpc-test-52a1a79962ff4bee98dced913160109c.sock every 8 connection(s)
I20260924 21:11:34.947476 13752 acceptor_pool.cc:254] collecting diagnostics on the listening RPC socket unix:/tmp/dist-test-task1HRXeA/test-tmp/rpc-test-52a1a79962ff4bee98dced913160109c.sock every 8 connection(s)
W20260924 21:11:34.982563 13748 connection.cc:196] Error closing socket: Network error: TlsSocket::Close: Broken pipe
[       OK ] Parameters/TestRpc.TestRpcSidecar/SSL_UnixSocket (49 ms)
[ RUN      ] Parameters/TestRpc.TestRpcSidecarLimits/SSL_UnixSocket
I20260924 21:11:36.535854 13776 acceptor_pool.cc:254] collecting diagnostics on the listening RPC socket unix:/tmp/dist-test-task1HRXeA/test-tmp/rpc-test-a6b7ecf71b2c4ef2b3a90996b53fcb67.sock every 8 connection(s)
I20260924 21:11:36.535876 13777 acceptor_pool.cc:254] collecting diagnostics on the listening RPC socket unix:/tmp/dist-test-task1HRXeA/test-tmp/rpc-test-a6b7ecf71b2c4ef2b3a90996b53fcb67.sock every 8 connection(s)
W20260924 21:11:36.557933 13534 serialization.cc:72] Serialized kudu.rpc_test.PushStringsRequestPB (2147483654 bytes) is larger than the maximum configured RPC message size (52428800 bytes). Sending anyway, but peer may reject the data.
W20260924 21:11:36.560819 13773 connection.cc:535] server connection from unix:<unnamed> recv error: Network error: RPC frame had a length of 2147483714, but we only support messages up to 52428800 bytes long.
W20260924 21:11:36.560884 13773 connection.cc:158] shutting down server connection from unix:<unnamed> with pending inbound data: 4/2147483714 bytes received; last active 0 ns ago: status Network error: RPC frame had a length of 2147483714, but we only support messages up to 52428800 bytes long.
W20260924 21:11:36.561049 13789 connection.cc:196] Error closing socket: Network error: TlsSocket::Close: Broken pipe
I20260924 21:11:36.573362 13801 acceptor_pool.cc:254] collecting diagnostics on the listening RPC socket unix:/tmp/dist-test-task1HRXeA/test-tmp/rpc-test-a6b7ecf71b2c4ef2b3a90996b53fcb67.sock every 8 connection(s)
I20260924 21:11:36.573362 13802 acceptor_pool.cc:254] collecting diagnostics on the listening RPC socket unix:/tmp/dist-test-task1HRXeA/test-tmp/rpc-test-a6b7ecf71b2c4ef2b3a90996b53fcb67.sock every 8 connection(s)
W20260924 21:11:41.038883 13798 connection.cc:577] server connection from unix:<unnamed>: received bad data: 'Corruption: Invalid packet: message had a length of 2147483710, but we only support messages up to 2147483647 bytes
'
W20260924 21:11:41.039183 13814 connection.cc:196] Error closing socket: Network error: TlsSocket::Close: Broken pipe
[       OK ] Parameters/TestRpc.TestRpcSidecarLimits/SSL_UnixSocket (6057 ms)
[ RUN      ] Parameters/TestRpc.TestCallTimeoutDoesntAffectNegotiation/SSL_UnixSocket
I20260924 21:11:41.080917 13826 acceptor_pool.cc:254] collecting diagnostics on the listening RPC socket unix:/tmp/dist-test-task1HRXeA/test-tmp/rpc-test-52a3ba4522c042f39a4ecb33b02ab46d.sock every 8 connection(s)
I20260924 21:11:41.080928 13827 acceptor_pool.cc:254] collecting diagnostics on the listening RPC socket unix:/tmp/dist-test-task1HRXeA/test-tmp/rpc-test-52a3ba4522c042f39a4ecb33b02ab46d.sock every 8 connection(s)
W20260924 21:11:41.100890 13822 negotiation.cc:266] Injecting 500ms delay in negotiation
I20260924 21:11:41.151125 13534 rpc-test-base.h:595] status: Timed out: connection negotiation to unix:/tmp/dist-test-task1HRXeA/test-tmp/rpc-test-52a3ba4522c042f39a4ecb33b02ab46d.sock for RPC Sleep timed out after 0.050s (ON_OUTBOUND_QUEUE), seconds elapsed: 0.0505681
[       OK ] Parameters/TestRpc.TestCallTimeoutDoesntAffectNegotiation/SSL_UnixSocket (564 ms)
[ RUN      ] Parameters/TestRpc.TestRpcHandlerLatencyMetric/SSL_UnixSocket
I20260924 21:11:41.620739 13851 acceptor_pool.cc:254] collecting diagnostics on the listening RPC socket unix:/tmp/dist-test-task1HRXeA/test-tmp/rpc-test-b6a95121afec4d66bc268d8c3a79ed70.sock every 8 connection(s)
I20260924 21:11:41.620770 13852 acceptor_pool.cc:254] collecting diagnostics on the listening RPC socket unix:/tmp/dist-test-task1HRXeA/test-tmp/rpc-test-b6a95121afec4d66bc268d8c3a79ed70.sock every 8 connection(s)
I20260924 21:11:41.655593 13534 rpc-test.cc:1236] Sleep() min lat: 20294
I20260924 21:11:41.655678 13534 rpc-test.cc:1237] Sleep() mean lat: 20294
I20260924 21:11:41.655705 13534 rpc-test.cc:1238] Sleep() max lat: 20294
I20260924 21:11:41.655720 13534 rpc-test.cc:1239] Sleep() #calls: 1
[       OK ] Parameters/TestRpc.TestRpcHandlerLatencyMetric/SSL_UnixSocket (51 ms)
[ RUN      ] Parameters/TestRpc.TimedOutOnResponseMetricServiceQueue/SSL_UnixSocket
I20260924 21:11:41.666059 13877 acceptor_pool.cc:254] collecting diagnostics on the listening RPC socket unix:/tmp/dist-test-task1HRXeA/test-tmp/rpc-test-77be3427440e43ebb5e5ed3693a0497b.sock every 8 connection(s)
I20260924 21:11:41.666096 13878 acceptor_pool.cc:254] collecting diagnostics on the listening RPC socket unix:/tmp/dist-test-task1HRXeA/test-tmp/rpc-test-77be3427440e43ebb5e5ed3693a0497b.sock every 8 connection(s)
W20260924 21:11:41.719250 13879 rpcz_store.cc:267] Call kudu.rpc_test.CalculatorService.Sleep from unix:<unnamed> (request call id 2) took 20 ms (client timeout 20 ms). Trace:
W20260924 21:11:41.719349 13879 rpcz_store.cc:269] 0924 21:11:41.699036 (+     0us) service_pool.cc:170] Inserting onto call queue
0924 21:11:41.719223 (+ 20187us) service_pool.cc:214] Skipping call since client already timed out
0924 21:11:41.719235 (+    12us) inbound_call.cc:173] Queueing failure response
Metrics: {}
[       OK ] Parameters/TestRpc.TimedOutOnResponseMetricServiceQueue/SSL_UnixSocket (63 ms)
[ RUN      ] Parameters/TestRpc.RpcPendingConnectionsMetric/SSL_UnixSocket
I20260924 21:11:41.722398 13900 acceptor_pool.cc:254] collecting diagnostics on the listening RPC socket 0.0.0.0:33299 every 8 connection(s)
I20260924 21:11:41.722458 13901 acceptor_pool.cc:254] collecting diagnostics on the listening RPC socket 0.0.0.0:33299 every 8 connection(s)
W20260924 21:11:41.722977 13896 negotiation.cc:337] Failed RPC negotiation. Trace:
0924 21:11:41.722808 (+     0us) reactor.cc:625] Submitting negotiation task for server connection from 127.0.0.1:34780 (local address 127.0.0.1:33299)
0924 21:11:41.722847 (+    39us) server_negotiation.cc:206] Beginning negotiation
0924 21:11:41.722849 (+     2us) server_negotiation.cc:399] Waiting for connection header
0924 21:11:41.722929 (+    80us) negotiation.cc:327] Negotiation complete: Network error: Server connection negotiation failed: server connection from 127.0.0.1:34780: BlockingRecv error: recv got EOF from 127.0.0.1:34780 (error 108)
Metrics: {"server-negotiator.queue_time_us":12}
[       OK ] Parameters/TestRpc.RpcPendingConnectionsMetric/SSL_UnixSocket (12 ms)
[ RUN      ] Parameters/TestRpc.TestRpcContextClientDeadline/SSL_UnixSocket
I20260924 21:11:41.753685 13916 acceptor_pool.cc:254] collecting diagnostics on the listening RPC socket unix:/tmp/dist-test-task1HRXeA/test-tmp/rpc-test-fa694699d2644ad686c12bd7985e6735.sock every 8 connection(s)
I20260924 21:11:41.753711 13917 acceptor_pool.cc:254] collecting diagnostics on the listening RPC socket unix:/tmp/dist-test-task1HRXeA/test-tmp/rpc-test-fa694699d2644ad686c12bd7985e6735.sock every 8 connection(s)
[       OK ] Parameters/TestRpc.TestRpcContextClientDeadline/SSL_UnixSocket (67 ms)
[ RUN      ] Parameters/TestRpc.TestApplicationFeatureFlagUnsupportedServer/SSL_UnixSocket
I20260924 21:11:41.815775 13941 acceptor_pool.cc:254] collecting diagnostics on the listening RPC socket unix:/tmp/dist-test-task1HRXeA/test-tmp/rpc-test-f8cbf9b2e6f447fa891ce22f8561ee24.sock every 8 connection(s)
I20260924 21:11:41.815831 13942 acceptor_pool.cc:254] collecting diagnostics on the listening RPC socket unix:/tmp/dist-test-task1HRXeA/test-tmp/rpc-test-f8cbf9b2e6f447fa891ce22f8561ee24.sock every 8 connection(s)
W20260924 21:11:41.843912 13938 connection.cc:196] Error closing socket: Network error: TlsSocket::Close: Broken pipe
[       OK ] Parameters/TestRpc.TestApplicationFeatureFlagUnsupportedServer/SSL_UnixSocket (43 ms)
[ RUN      ] Parameters/TestRpc.TestCancellationAsync/SSL_UnixSocket
I20260924 21:11:41.853197 13966 acceptor_pool.cc:254] collecting diagnostics on the listening RPC socket unix:/tmp/dist-test-task1HRXeA/test-tmp/rpc-test-6ebb5659e7684d269d37defafe3bb194.sock every 8 connection(s)
I20260924 21:11:41.853248 13967 acceptor_pool.cc:254] collecting diagnostics on the listening RPC socket unix:/tmp/dist-test-task1HRXeA/test-tmp/rpc-test-6ebb5659e7684d269d37defafe3bb194.sock every 8 connection(s)
I20260924 21:11:41.853380 13534 rpc-test.cc:1716] Connecting to unix:/tmp/dist-test-task1HRXeA/test-tmp/rpc-test-6ebb5659e7684d269d37defafe3bb194.sock
I20260924 21:11:41.867587 13534 test_util.cc:268] Using random seed: 198974017
I20260924 21:11:41.883108 13970 rpc-test-base.h:240] got call: sleep_micros: 500 pattern: 4294967295 num_repetitions: 2097152 sidecar_idx: 0
I20260924 21:11:41.894829 13970 rpc-test-base.h:240] got call: sleep_micros: 500 pattern: 4294967295 num_repetitions: 2097152 sidecar_idx: 0
I20260924 21:11:41.907155 13970 rpc-test-base.h:240] got call: sleep_micros: 500 pattern: 4294967295 num_repetitions: 2097152 sidecar_idx: 0
I20260924 21:11:41.919294 13970 rpc-test-base.h:240] got call: sleep_micros: 500 pattern: 4294967295 num_repetitions: 2097152 sidecar_idx: 0
I20260924 21:11:41.931313 13970 rpc-test-base.h:240] got call: sleep_micros: 500 pattern: 4294967295 num_repetitions: 2097152 sidecar_idx: 0
I20260924 21:11:41.943698 13970 rpc-test-base.h:240] got call: sleep_micros: 500 pattern: 4294967295 num_repetitions: 2097152 sidecar_idx: 0
I20260924 21:11:41.954697 13970 rpc-test-base.h:240] got call: sleep_micros: 500 pattern: 4294967295 num_repetitions: 2097152 sidecar_idx: 0
I20260924 21:11:41.964965 13970 rpc-test-base.h:240] got call: sleep_micros: 500 pattern: 4294967295 num_repetitions: 2097152 sidecar_idx: 0
W20260924 21:11:41.966361 13963 connection.cc:196] Error closing socket: Network error: TlsSocket::Close: Broken pipe
W20260924 21:11:41.967955 13963 connection.cc:441] server connection from unix:<unnamed> torn down before Call kudu.rpc.GenericCalculatorService.SleepWithSidecar from unix:<unnamed> (request call id 9) could send its response
[       OK ] Parameters/TestRpc.TestCancellationAsync/SSL_UnixSocket (124 ms)
[ RUN      ] Parameters/TestRpc.TestPerformanceBySocketType/SSL_UnixSocket
I20260924 21:11:41.989243 13991 acceptor_pool.cc:254] collecting diagnostics on the listening RPC socket unix:/tmp/dist-test-task1HRXeA/test-tmp/rpc-test-a545c46ab0c64a2ca157cf737baa4883.sock every 8 connection(s)
I20260924 21:11:41.989281 13992 acceptor_pool.cc:254] collecting diagnostics on the listening RPC socket unix:/tmp/dist-test-task1HRXeA/test-tmp/rpc-test-a545c46ab0c64a2ca157cf737baa4883.sock every 8 connection(s)
I20260924 21:11:41.989426 13534 rpc-test.cc:1846] Connecting to unix:/tmp/dist-test-task1HRXeA/test-tmp/rpc-test-a545c46ab0c64a2ca157cf737baa4883.sock
I20260924 21:11:43.249444 13534 rpc-test.cc:1859] Sending 1024MB via ssl-enabled unix socket: real 1.240s	user 1.393s	sys 0.822s
I20260924 21:11:44.555778 13534 rpc-test.cc:1859] Sending 1024MB via ssl-enabled unix socket: real 1.306s	user 1.475s	sys 0.866s
I20260924 21:11:45.788162 13534 rpc-test.cc:1859] Sending 1024MB via ssl-enabled unix socket: real 1.232s	user 1.354s	sys 0.864s
I20260924 21:11:46.977744 13534 rpc-test.cc:1859] Sending 1024MB via ssl-enabled unix socket: real 1.189s	user 1.323s	sys 0.826s
I20260924 21:11:48.210794 13534 rpc-test.cc:1859] Sending 1024MB via ssl-enabled unix socket: real 1.233s	user 1.382s	sys 0.829s
W20260924 21:11:48.211508 13988 connection.cc:196] Error closing socket: Network error: TlsSocket::Close: Broken pipe
[       OK ] Parameters/TestRpc.TestPerformanceBySocketType/SSL_UnixSocket (6243 ms)
[----------] 20 tests from Parameters/TestRpc (25461 ms total)

[----------] 1 test from Parameters/TestRpcSocketTxRxQueue
[ RUN      ] Parameters/TestRpcSocketTxRxQueue.AcceptorRxQueueSizeMetric/0
I20260924 21:11:48.238641 14016 acceptor_pool.cc:254] collecting diagnostics on the listening RPC socket 0.0.0.0:41775 every 1 connection(s)
I20260924 21:11:48.238690 14017 acceptor_pool.cc:254] collecting diagnostics on the listening RPC socket 0.0.0.0:41775 every 1 connection(s)
W20260924 21:11:48.239197 14012 negotiation.cc:337] Failed RPC negotiation. Trace:
0924 21:11:48.239072 (+     0us) reactor.cc:625] Submitting negotiation task for server connection from 127.0.0.1:47482 (local address 127.0.0.1:41775)
0924 21:11:48.239112 (+    40us) server_negotiation.cc:206] Beginning negotiation
0924 21:11:48.239114 (+     2us) server_negotiation.cc:399] Waiting for connection header
0924 21:11:48.239168 (+    54us) negotiation.cc:327] Negotiation complete: Network error: Server connection negotiation failed: server connection from 127.0.0.1:47482: BlockingRecv error: recv got EOF from 127.0.0.1:47482 (error 108)
Metrics: {"server-negotiator.queue_time_us":14}
[       OK ] Parameters/TestRpcSocketTxRxQueue.AcceptorRxQueueSizeMetric/0 (28 ms)
[----------] 1 test from Parameters/TestRpcSocketTxRxQueue (28 ms total)

[----------] Global test environment tear-down
[==========] 21 tests from 2 test suites ran. (25491 ms total)
[  PASSED  ] 20 tests.
[  FAILED  ] 1 test, listed below:
[  FAILED  ] Parameters/TestRpc.TestCallWithChainCertAndChainCA/SSL_UnixSocket, where GetParam() = (true, true)

 1 FAILED TEST