Diagnosed failure

Parameters/TestRpc.TestCallWithChainCertAndChainCA/SSL_UnixSocket: /data0/somelongdirectorytoavoidrpathissues/src/kudu/src/kudu/rpc/rpc-test.cc:270: Failure
Failed
Bad status: Runtime error: could not verify certificate chain (error with cert: subject=CN = localhost, ST = sadfjas, C = AS, emailAddress = sdflkdsajf, O = lskdfjlsad, OU = sldfkja, issuer=C = AS, ST = ASDfkjdhf, L = lskdjf, O = saldfja, OU = skdjf, CN = localhost, emailAddress = sadjflkadsj): : certificate has expired
Google Test trace:
/data0/somelongdirectorytoavoidrpathissues/src/kudu/src/kudu/rpc/rpc-test.cc:267: Connecting to unix:/tmp/dist-test-taskWVgKZc/test-tmp/rpc-test-e081af20aac043ee9e0e7d64879bae18.sock
I20260924 09:58:04.222023 13077 test_util.cc:175] -----------------------------------------------
I20260924 09:58:04.222113 13077 test_util.cc:176] Had fatal failures, leaving test files at /tmp/dist-test-taskWVgKZc/test-tmp/rpc-test.6.Parameters_TestRpc.TestCallWithChainCertAndChainCA_SSL_UnixSocket.1790243884086125-13077-0

Full log

Note: This is test shard 7 of 8.
[==========] Running 21 tests from 2 test suites.
[----------] Global test environment set-up.
[----------] 20 tests from Parameters/TestRpc
[ RUN      ] Parameters/TestRpc.TestMessengerCreateDestroy/SSL_UnixSocket
WARNING: Logging before InitGoogleLogging() is written to STDERR
I20260924 09:58:04.150714 13077 rpc-test.cc:169] started messenger TestCreateDestroy
[       OK ] Parameters/TestRpc.TestMessengerCreateDestroy/SSL_UnixSocket (47 ms)
[ RUN      ] Parameters/TestRpc.TestNegotiationDeadlock/SSL_UnixSocket
I20260924 09:58:04.170783 13097 acceptor_pool.cc:254] collecting diagnostics on the listening RPC socket unix:/tmp/dist-test-taskWVgKZc/test-tmp/rpc-test-94cb746991c9469daa22703326967b54.sock every 8 connection(s)
I20260924 09:58:04.171061 13098 acceptor_pool.cc:254] collecting diagnostics on the listening RPC socket unix:/tmp/dist-test-taskWVgKZc/test-tmp/rpc-test-94cb746991c9469daa22703326967b54.sock every 8 connection(s)
[       OK ] Parameters/TestRpc.TestNegotiationDeadlock/SSL_UnixSocket (35 ms)
[ RUN      ] Parameters/TestRpc.TestCallWithChainCertAndChainCA/SSL_UnixSocket
I20260924 09:58:04.210613 13113 acceptor_pool.cc:254] collecting diagnostics on the listening RPC socket unix:/tmp/dist-test-taskWVgKZc/test-tmp/rpc-test-e081af20aac043ee9e0e7d64879bae18.sock every 8 connection(s)
I20260924 09:58:04.210963 13114 acceptor_pool.cc:254] collecting diagnostics on the listening RPC socket unix:/tmp/dist-test-taskWVgKZc/test-tmp/rpc-test-e081af20aac043ee9e0e7d64879bae18.sock every 8 connection(s)
/data0/somelongdirectorytoavoidrpathissues/src/kudu/src/kudu/rpc/rpc-test.cc:270: Failure
Failed
Bad status: Runtime error: could not verify certificate chain (error with cert: subject=CN = localhost, ST = sadfjas, C = AS, emailAddress = sdflkdsajf, O = lskdfjlsad, OU = sldfkja, issuer=C = AS, ST = ASDfkjdhf, L = lskdjf, O = saldfja, OU = skdjf, CN = localhost, emailAddress = sadjflkadsj): : certificate has expired
Google Test trace:
/data0/somelongdirectorytoavoidrpathissues/src/kudu/src/kudu/rpc/rpc-test.cc:267: Connecting to unix:/tmp/dist-test-taskWVgKZc/test-tmp/rpc-test-e081af20aac043ee9e0e7d64879bae18.sock
I20260924 09:58:04.222023 13077 test_util.cc:175] -----------------------------------------------
I20260924 09:58:04.222113 13077 test_util.cc:176] Had fatal failures, leaving test files at /tmp/dist-test-taskWVgKZc/test-tmp/rpc-test.6.Parameters_TestRpc.TestCallWithChainCertAndChainCA_SSL_UnixSocket.1790243884086125-13077-0
[  FAILED  ] Parameters/TestRpc.TestCallWithChainCertAndChainCA/SSL_UnixSocket, where GetParam() = (true, true) (32 ms)
[ RUN      ] Parameters/TestRpc.TestCallWithPasswordProtectedKey/SSL_UnixSocket
I20260924 09:58:04.234308 13138 acceptor_pool.cc:254] collecting diagnostics on the listening RPC socket unix:/tmp/dist-test-taskWVgKZc/test-tmp/rpc-test-7398763dafb143968330688c1935eb83.sock every 8 connection(s)
I20260924 09:58:04.234565 13139 acceptor_pool.cc:254] collecting diagnostics on the listening RPC socket unix:/tmp/dist-test-taskWVgKZc/test-tmp/rpc-test-7398763dafb143968330688c1935eb83.sock every 8 connection(s)
W20260924 09:58:04.264454 13135 connection.cc:196] Error closing socket: Network error: TlsSocket::Close: Broken pipe
[       OK ] Parameters/TestRpc.TestCallWithPasswordProtectedKey/SSL_UnixSocket (46 ms)
[ RUN      ] Parameters/TestRpc.TestCallToBadServer/SSL_UnixSocket
I20260924 09:58:04.293740 13077 rpc-test.cc:394] Status: Network error: Client connection negotiation failed: client connection to 0.0.0.0:0: connect: Connection refused (error 111)
I20260924 09:58:04.294646 13077 rpc-test.cc:394] Status: Network error: Client connection negotiation failed: client connection to 0.0.0.0:0: connect: Connection refused (error 111)
I20260924 09:58:04.295276 13077 rpc-test.cc:394] Status: Network error: Client connection negotiation failed: client connection to 0.0.0.0:0: connect: Connection refused (error 111)
I20260924 09:58:04.295889 13077 rpc-test.cc:394] Status: Network error: Client connection negotiation failed: client connection to 0.0.0.0:0: connect: Connection refused (error 111)
I20260924 09:58:04.296536 13077 rpc-test.cc:394] Status: Network error: Client connection negotiation failed: client connection to 0.0.0.0:0: connect: Connection refused (error 111)
[       OK ] Parameters/TestRpc.TestCallToBadServer/SSL_UnixSocket (29 ms)
[ RUN      ] Parameters/TestRpc.TestWrongService/SSL_UnixSocket
I20260924 09:58:04.317106 13173 acceptor_pool.cc:254] collecting diagnostics on the listening RPC socket unix:/tmp/dist-test-taskWVgKZc/test-tmp/rpc-test-e4485930dc184d4ca4901c0560d5613a.sock every 8 connection(s)
I20260924 09:58:04.317365 13174 acceptor_pool.cc:254] collecting diagnostics on the listening RPC socket unix:/tmp/dist-test-taskWVgKZc/test-tmp/rpc-test-e4485930dc184d4ca4901c0560d5613a.sock every 8 connection(s)
I20260924 09:58:04.346572 13170 messenger.cc:345] service WrongServiceName not registered on TestServer
[       OK ] Parameters/TestRpc.TestWrongService/SSL_UnixSocket (53 ms)
[ RUN      ] Parameters/TestRpc.TestConnectionKeepalive/SSL_UnixSocket
I20260924 09:58:04.362403 13196 acceptor_pool.cc:254] collecting diagnostics on the listening RPC socket unix:/tmp/dist-test-taskWVgKZc/test-tmp/rpc-test-e240c6a1dc434b2f84bf66328721f47f.sock every 8 connection(s)
I20260924 09:58:04.362633 13197 acceptor_pool.cc:254] collecting diagnostics on the listening RPC socket unix:/tmp/dist-test-taskWVgKZc/test-tmp/rpc-test-e240c6a1dc434b2f84bf66328721f47f.sock every 8 connection(s)
I20260924 09:58:04.363564 13077 rpc-test.cc:488] Connecting to unix:/tmp/dist-test-taskWVgKZc/test-tmp/rpc-test-e240c6a1dc434b2f84bf66328721f47f.sock
W20260924 09:58:04.854436 13209 connection.cc:196] Error closing socket: Network error: TlsSocket::Close: Broken pipe
[       OK ] Parameters/TestRpc.TestConnectionKeepalive/SSL_UnixSocket (1041 ms)
[ RUN      ] Parameters/TestRpc.TestClientConnectionMetrics/SSL_UnixSocket
I20260924 09:58:05.419366 13221 acceptor_pool.cc:254] collecting diagnostics on the listening RPC socket unix:/tmp/dist-test-taskWVgKZc/test-tmp/rpc-test-9b1fc8076dbe4b3090494898b2dd1f2f.sock every 8 connection(s)
I20260924 09:58:05.419636 13222 acceptor_pool.cc:254] collecting diagnostics on the listening RPC socket unix:/tmp/dist-test-taskWVgKZc/test-tmp/rpc-test-9b1fc8076dbe4b3090494898b2dd1f2f.sock every 8 connection(s)
I20260924 09:58:05.420634 13077 rpc-test.cc:569] Connecting to unix:/tmp/dist-test-taskWVgKZc/test-tmp/rpc-test-9b1fc8076dbe4b3090494898b2dd1f2f.sock
[       OK ] Parameters/TestRpc.TestClientConnectionMetrics/SSL_UnixSocket (21925 ms)
[ RUN      ] Parameters/TestRpc.TestCredentialsPolicy/SSL_UnixSocket
I20260924 09:58:27.331629 13244 acceptor_pool.cc:254] collecting diagnostics on the listening RPC socket unix:/tmp/dist-test-taskWVgKZc/test-tmp/rpc-test-341852e1aa274a95a8e99a9b754b286a.sock every 8 connection(s)
I20260924 09:58:27.331842 13245 acceptor_pool.cc:254] collecting diagnostics on the listening RPC socket unix:/tmp/dist-test-taskWVgKZc/test-tmp/rpc-test-341852e1aa274a95a8e99a9b754b286a.sock every 8 connection(s)
I20260924 09:58:27.332876 13077 rpc-test.cc:700] Connecting to unix:/tmp/dist-test-taskWVgKZc/test-tmp/rpc-test-341852e1aa274a95a8e99a9b754b286a.sock
W20260924 09:58:27.358507 13243 connection.cc:196] Error closing socket: Network error: TlsSocket::Close: Broken pipe
[       OK ] Parameters/TestRpc.TestCredentialsPolicy/SSL_UnixSocket (50 ms)
[ RUN      ] Parameters/TestRpc.TestCallLongerThanKeepalive/SSL_UnixSocket
I20260924 09:58:27.388454 13269 acceptor_pool.cc:254] collecting diagnostics on the listening RPC socket unix:/tmp/dist-test-taskWVgKZc/test-tmp/rpc-test-7150f5af424c48bb92d77307c53e99d6.sock every 8 connection(s)
I20260924 09:58:27.388646 13270 acceptor_pool.cc:254] collecting diagnostics on the listening RPC socket unix:/tmp/dist-test-taskWVgKZc/test-tmp/rpc-test-7150f5af424c48bb92d77307c53e99d6.sock every 8 connection(s)
I20260924 09:58:27.401878 13273 rpc-test-base.h:222] got call: sleep_micros: 3000000 deferred: true
I20260924 09:58:30.403505 13273 rpcz_store.cc:275] Call kudu.rpc.GenericCalculatorService.Sleep from unix:<unnamed> (request call id 0) took 3001 ms. Trace:
I20260924 09:58:30.403707 13273 rpcz_store.cc:276] 0924 09:58:27.401771 (+     0us) service_pool.cc:170] Inserting onto call queue
0924 09:58:27.401833 (+    62us) service_pool.cc:227] Handling call
0924 09:58:30.403457 (+3001624us) inbound_call.cc:173] Queueing success response
Metrics: {}
[       OK ] Parameters/TestRpc.TestCallLongerThanKeepalive/SSL_UnixSocket (3040 ms)
[ RUN      ] Parameters/TestRpc.TestRpcSidecar/SSL_UnixSocket
I20260924 09:58:30.431013 13294 acceptor_pool.cc:254] collecting diagnostics on the listening RPC socket unix:/tmp/dist-test-taskWVgKZc/test-tmp/rpc-test-9ad9d2289b664d82ace4031da7c7a17f.sock every 8 connection(s)
I20260924 09:58:30.431270 13295 acceptor_pool.cc:254] collecting diagnostics on the listening RPC socket unix:/tmp/dist-test-taskWVgKZc/test-tmp/rpc-test-9ad9d2289b664d82ace4031da7c7a17f.sock every 8 connection(s)
W20260924 09:58:30.551306 13291 connection.cc:196] Error closing socket: Network error: TlsSocket::Close: Broken pipe
[       OK ] Parameters/TestRpc.TestRpcSidecar/SSL_UnixSocket (145 ms)
[ RUN      ] Parameters/TestRpc.TestRpcSidecarLimits/SSL_UnixSocket
I20260924 09:58:32.556087 13319 acceptor_pool.cc:254] collecting diagnostics on the listening RPC socket unix:/tmp/dist-test-taskWVgKZc/test-tmp/rpc-test-3b10a39b264d4791b6dd3156a3bf4723.sock every 8 connection(s)
I20260924 09:58:32.556425 13320 acceptor_pool.cc:254] collecting diagnostics on the listening RPC socket unix:/tmp/dist-test-taskWVgKZc/test-tmp/rpc-test-3b10a39b264d4791b6dd3156a3bf4723.sock every 8 connection(s)
W20260924 09:58:32.574909 13077 serialization.cc:72] Serialized kudu.rpc_test.PushStringsRequestPB (2147483654 bytes) is larger than the maximum configured RPC message size (52428800 bytes). Sending anyway, but peer may reject the data.
W20260924 09:58:32.580929 13316 connection.cc:535] server connection from unix:<unnamed> recv error: Network error: RPC frame had a length of 2147483714, but we only support messages up to 52428800 bytes long.
W20260924 09:58:32.581063 13316 connection.cc:158] shutting down server connection from unix:<unnamed> with pending inbound data: 4/2147483714 bytes received; last active 0 ns ago: status Network error: RPC frame had a length of 2147483714, but we only support messages up to 52428800 bytes long.
W20260924 09:58:32.581579 13332 connection.cc:196] Error closing socket: Network error: TlsSocket::Close: Broken pipe
I20260924 09:58:32.599658 13344 acceptor_pool.cc:254] collecting diagnostics on the listening RPC socket unix:/tmp/dist-test-taskWVgKZc/test-tmp/rpc-test-3b10a39b264d4791b6dd3156a3bf4723.sock every 8 connection(s)
I20260924 09:58:32.599898 13345 acceptor_pool.cc:254] collecting diagnostics on the listening RPC socket unix:/tmp/dist-test-taskWVgKZc/test-tmp/rpc-test-3b10a39b264d4791b6dd3156a3bf4723.sock every 8 connection(s)
W20260924 09:58:38.116402 13341 connection.cc:577] server connection from unix:<unnamed>: received bad data: 'Corruption: Invalid packet: message had a length of 2147483710, but we only support messages up to 2147483647 bytes
'
W20260924 09:58:38.117022 13357 connection.cc:196] Error closing socket: Network error: TlsSocket::Close: Broken pipe
[       OK ] Parameters/TestRpc.TestRpcSidecarLimits/SSL_UnixSocket (8052 ms)
[ RUN      ] Parameters/TestRpc.TestCallTimeoutDoesntAffectNegotiation/SSL_UnixSocket
I20260924 09:58:38.626529 13369 acceptor_pool.cc:254] collecting diagnostics on the listening RPC socket unix:/tmp/dist-test-taskWVgKZc/test-tmp/rpc-test-fbd4514e333f4bf2b4c32263ae162716.sock every 8 connection(s)
I20260924 09:58:38.626902 13370 acceptor_pool.cc:254] collecting diagnostics on the listening RPC socket unix:/tmp/dist-test-taskWVgKZc/test-tmp/rpc-test-fbd4514e333f4bf2b4c32263ae162716.sock every 8 connection(s)
W20260924 09:58:38.637984 13365 negotiation.cc:266] Injecting 500ms delay in negotiation
I20260924 09:58:38.688550 13077 rpc-test-base.h:595] status: Timed out: connection negotiation to unix:/tmp/dist-test-taskWVgKZc/test-tmp/rpc-test-fbd4514e333f4bf2b4c32263ae162716.sock for RPC Sleep timed out after 0.050s (ON_OUTBOUND_QUEUE), seconds elapsed: 0.0511785
[       OK ] Parameters/TestRpc.TestCallTimeoutDoesntAffectNegotiation/SSL_UnixSocket (540 ms)
[ RUN      ] Parameters/TestRpc.TestRpcHandlerLatencyMetric/SSL_UnixSocket
I20260924 09:58:39.173072 13394 acceptor_pool.cc:254] collecting diagnostics on the listening RPC socket unix:/tmp/dist-test-taskWVgKZc/test-tmp/rpc-test-49194387a1ea4fd0a6371b07035326eb.sock every 8 connection(s)
I20260924 09:58:39.173321 13395 acceptor_pool.cc:254] collecting diagnostics on the listening RPC socket unix:/tmp/dist-test-taskWVgKZc/test-tmp/rpc-test-49194387a1ea4fd0a6371b07035326eb.sock every 8 connection(s)
I20260924 09:58:39.214417 13077 rpc-test.cc:1236] Sleep() min lat: 20627
I20260924 09:58:39.214514 13077 rpc-test.cc:1237] Sleep() mean lat: 20627
I20260924 09:58:39.214553 13077 rpc-test.cc:1238] Sleep() max lat: 20627
I20260924 09:58:39.214571 13077 rpc-test.cc:1239] Sleep() #calls: 1
[       OK ] Parameters/TestRpc.TestRpcHandlerLatencyMetric/SSL_UnixSocket (71 ms)
[ RUN      ] Parameters/TestRpc.TimedOutOnResponseMetricServiceQueue/SSL_UnixSocket
I20260924 09:58:39.235857 13420 acceptor_pool.cc:254] collecting diagnostics on the listening RPC socket unix:/tmp/dist-test-taskWVgKZc/test-tmp/rpc-test-5c88536cd37448cc8ad0568e134cd3c9.sock every 8 connection(s)
I20260924 09:58:39.236095 13421 acceptor_pool.cc:254] collecting diagnostics on the listening RPC socket unix:/tmp/dist-test-taskWVgKZc/test-tmp/rpc-test-5c88536cd37448cc8ad0568e134cd3c9.sock every 8 connection(s)
W20260924 09:58:39.293793 13422 rpcz_store.cc:267] Call kudu.rpc_test.CalculatorService.Sleep from unix:<unnamed> (request call id 2) took 20 ms (client timeout 20 ms). Trace:
W20260924 09:58:39.294001 13422 rpcz_store.cc:269] 0924 09:58:39.273270 (+     0us) service_pool.cc:170] Inserting onto call queue
0924 09:58:39.293705 (+ 20435us) service_pool.cc:214] Skipping call since client already timed out
0924 09:58:39.293756 (+    51us) inbound_call.cc:173] Queueing failure response
Metrics: {}
[       OK ] Parameters/TestRpc.TimedOutOnResponseMetricServiceQueue/SSL_UnixSocket (78 ms)
[ RUN      ] Parameters/TestRpc.RpcPendingConnectionsMetric/SSL_UnixSocket
I20260924 09:58:39.302914 13443 acceptor_pool.cc:254] collecting diagnostics on the listening RPC socket 0.0.0.0:40087 every 8 connection(s)
I20260924 09:58:39.303138 13444 acceptor_pool.cc:254] collecting diagnostics on the listening RPC socket 0.0.0.0:40087 every 8 connection(s)
W20260924 09:58:39.305097 13439 negotiation.cc:337] Failed RPC negotiation. Trace:
0924 09:58:39.304498 (+     0us) reactor.cc:625] Submitting negotiation task for server connection from 127.0.0.1:35896 (local address 127.0.0.1:40087)
0924 09:58:39.304671 (+   173us) server_negotiation.cc:206] Beginning negotiation
0924 09:58:39.304674 (+     3us) server_negotiation.cc:399] Waiting for connection header
0924 09:58:39.304815 (+   141us) negotiation.cc:327] Negotiation complete: Network error: Server connection negotiation failed: server connection from 127.0.0.1:35896: BlockingRecv error: recv got EOF from 127.0.0.1:35896 (error 108)
Metrics: {"server-negotiator.queue_time_us":43}
[       OK ] Parameters/TestRpc.RpcPendingConnectionsMetric/SSL_UnixSocket (19 ms)
[ RUN      ] Parameters/TestRpc.TestRpcContextClientDeadline/SSL_UnixSocket
I20260924 09:58:39.338768 13459 acceptor_pool.cc:254] collecting diagnostics on the listening RPC socket unix:/tmp/dist-test-taskWVgKZc/test-tmp/rpc-test-ccdb7ae1c56144278552db6e22a0eade.sock every 8 connection(s)
I20260924 09:58:39.338994 13460 acceptor_pool.cc:254] collecting diagnostics on the listening RPC socket unix:/tmp/dist-test-taskWVgKZc/test-tmp/rpc-test-ccdb7ae1c56144278552db6e22a0eade.sock every 8 connection(s)
[       OK ] Parameters/TestRpc.TestRpcContextClientDeadline/SSL_UnixSocket (73 ms)
[ RUN      ] Parameters/TestRpc.TestApplicationFeatureFlagUnsupportedServer/SSL_UnixSocket
I20260924 09:58:39.410759 13484 acceptor_pool.cc:254] collecting diagnostics on the listening RPC socket unix:/tmp/dist-test-taskWVgKZc/test-tmp/rpc-test-b7108701f8304c24964615948d0b0552.sock every 8 connection(s)
I20260924 09:58:39.411024 13485 acceptor_pool.cc:254] collecting diagnostics on the listening RPC socket unix:/tmp/dist-test-taskWVgKZc/test-tmp/rpc-test-b7108701f8304c24964615948d0b0552.sock every 8 connection(s)
W20260924 09:58:39.431998 13481 connection.cc:196] Error closing socket: Network error: TlsSocket::Close: Broken pipe
[       OK ] Parameters/TestRpc.TestApplicationFeatureFlagUnsupportedServer/SSL_UnixSocket (44 ms)
[ RUN      ] Parameters/TestRpc.TestCancellationAsync/SSL_UnixSocket
I20260924 09:58:39.446463 13509 acceptor_pool.cc:254] collecting diagnostics on the listening RPC socket unix:/tmp/dist-test-taskWVgKZc/test-tmp/rpc-test-6378ab7121de400f980503d0b30936b1.sock every 8 connection(s)
I20260924 09:58:39.446668 13510 acceptor_pool.cc:254] collecting diagnostics on the listening RPC socket unix:/tmp/dist-test-taskWVgKZc/test-tmp/rpc-test-6378ab7121de400f980503d0b30936b1.sock every 8 connection(s)
I20260924 09:58:39.447520 13077 rpc-test.cc:1716] Connecting to unix:/tmp/dist-test-taskWVgKZc/test-tmp/rpc-test-6378ab7121de400f980503d0b30936b1.sock
I20260924 09:58:39.466302 13077 test_util.cc:268] Using random seed: -1528721618
I20260924 09:58:39.510468 13513 rpc-test-base.h:240] got call: sleep_micros: 500 pattern: 4294967295 num_repetitions: 2097152 sidecar_idx: 0
I20260924 09:58:39.538162 13512 rpc-test-base.h:240] got call: sleep_micros: 500 pattern: 4294967295 num_repetitions: 2097152 sidecar_idx: 0
I20260924 09:58:39.567312 13513 rpc-test-base.h:240] got call: sleep_micros: 500 pattern: 4294967295 num_repetitions: 2097152 sidecar_idx: 0
I20260924 09:58:39.596388 13511 rpc-test-base.h:240] got call: sleep_micros: 500 pattern: 4294967295 num_repetitions: 2097152 sidecar_idx: 0
I20260924 09:58:39.625782 13513 rpc-test-base.h:240] got call: sleep_micros: 500 pattern: 4294967295 num_repetitions: 2097152 sidecar_idx: 0
I20260924 09:58:39.654835 13512 rpc-test-base.h:240] got call: sleep_micros: 500 pattern: 4294967295 num_repetitions: 2097152 sidecar_idx: 0
I20260924 09:58:39.683598 13513 rpc-test-base.h:240] got call: sleep_micros: 500 pattern: 4294967295 num_repetitions: 2097152 sidecar_idx: 0
W20260924 09:58:39.686121 13506 connection.cc:196] Error closing socket: Network error: TlsSocket::Close: Broken pipe
W20260924 09:58:39.700978 13506 connection.cc:441] server connection from unix:<unnamed> torn down before Call kudu.rpc.GenericCalculatorService.SleepWithSidecar from unix:<unnamed> (request call id 8) could send its response
W20260924 09:58:39.717721 13506 connection.cc:441] server connection from unix:<unnamed> torn down before Call kudu.rpc.GenericCalculatorService.SleepWithSidecar from unix:<unnamed> (request call id 9) could send its response
[       OK ] Parameters/TestRpc.TestCancellationAsync/SSL_UnixSocket (284 ms)
[ RUN      ] Parameters/TestRpc.TestPerformanceBySocketType/SSL_UnixSocket
I20260924 09:58:39.778817 13534 acceptor_pool.cc:254] collecting diagnostics on the listening RPC socket unix:/tmp/dist-test-taskWVgKZc/test-tmp/rpc-test-63f4d0a6623542e78f4e696be8e97e4b.sock every 8 connection(s)
I20260924 09:58:39.779024 13535 acceptor_pool.cc:254] collecting diagnostics on the listening RPC socket unix:/tmp/dist-test-taskWVgKZc/test-tmp/rpc-test-63f4d0a6623542e78f4e696be8e97e4b.sock every 8 connection(s)
I20260924 09:58:39.779855 13077 rpc-test.cc:1846] Connecting to unix:/tmp/dist-test-taskWVgKZc/test-tmp/rpc-test-63f4d0a6623542e78f4e696be8e97e4b.sock
I20260924 09:58:42.836905 13077 rpc-test.cc:1859] Sending 1024MB via ssl-enabled unix socket: real 3.042s	user 2.855s	sys 2.310s
I20260924 09:58:45.996731 13077 rpc-test.cc:1859] Sending 1024MB via ssl-enabled unix socket: real 3.160s	user 3.118s	sys 2.235s
I20260924 09:58:49.117316 13077 rpc-test.cc:1859] Sending 1024MB via ssl-enabled unix socket: real 3.120s	user 3.073s	sys 2.205s
I20260924 09:58:52.158336 13077 rpc-test.cc:1859] Sending 1024MB via ssl-enabled unix socket: real 3.041s	user 2.959s	sys 2.170s
I20260924 09:58:55.277850 13077 rpc-test.cc:1859] Sending 1024MB via ssl-enabled unix socket: real 3.119s	user 3.167s	sys 2.127s
W20260924 09:58:55.280571 13531 connection.cc:196] Error closing socket: Network error: TlsSocket::Close: Broken pipe
[       OK ] Parameters/TestRpc.TestPerformanceBySocketType/SSL_UnixSocket (15567 ms)
[----------] 20 tests from Parameters/TestRpc (51182 ms total)

[----------] 1 test from Parameters/TestRpcSocketTxRxQueue
[ RUN      ] Parameters/TestRpcSocketTxRxQueue.AcceptorRxQueueSizeMetric/0
I20260924 09:58:55.297582 13559 acceptor_pool.cc:254] collecting diagnostics on the listening RPC socket 0.0.0.0:39211 every 1 connection(s)
I20260924 09:58:55.297875 13560 acceptor_pool.cc:254] collecting diagnostics on the listening RPC socket 0.0.0.0:39211 every 1 connection(s)
W20260924 09:58:55.299448 13555 negotiation.cc:337] Failed RPC negotiation. Trace:
0924 09:58:55.299092 (+     0us) reactor.cc:625] Submitting negotiation task for server connection from 127.0.0.1:34418 (local address 127.0.0.1:39211)
0924 09:58:55.299234 (+   142us) server_negotiation.cc:206] Beginning negotiation
0924 09:58:55.299238 (+     4us) server_negotiation.cc:399] Waiting for connection header
0924 09:58:55.299348 (+   110us) negotiation.cc:327] Negotiation complete: Network error: Server connection negotiation failed: server connection from 127.0.0.1:34418: BlockingRecv error: recv got EOF from 127.0.0.1:34418 (error 108)
Metrics: {"server-negotiator.queue_time_us":46}
[       OK ] Parameters/TestRpcSocketTxRxQueue.AcceptorRxQueueSizeMetric/0 (14 ms)
[----------] 1 test from Parameters/TestRpcSocketTxRxQueue (14 ms total)

[----------] Global test environment tear-down
[==========] 21 tests from 2 test suites ran. (51197 ms total)
[  PASSED  ] 20 tests.
[  FAILED  ] 1 test, listed below:
[  FAILED  ] Parameters/TestRpc.TestCallWithChainCertAndChainCA/SSL_UnixSocket, where GetParam() = (true, true)

 1 FAILED TEST