Diagnosed failure

Parameters/TestRpc.TestCallWithChainCertAndChainCA/SSL_TCP: /data0/somelongdirectorytoavoidrpathissues/src/kudu/src/kudu/rpc/rpc-test.cc:270: Failure
Failed
Bad status: Runtime error: could not verify certificate chain (error with cert: subject=CN = localhost, ST = sadfjas, C = AS, emailAddress = sdflkdsajf, O = lskdfjlsad, OU = sldfkja, issuer=C = AS, ST = ASDfkjdhf, L = lskdjf, O = saldfja, OU = skdjf, CN = localhost, emailAddress = sadjflkadsj): : certificate has expired
Google Test trace:
/data0/somelongdirectorytoavoidrpathissues/src/kudu/src/kudu/rpc/rpc-test.cc:267: Connecting to 0.0.0.0:33263
I20260929 22:45:36.768076  2692 test_util.cc:175] -----------------------------------------------
I20260929 22:45:36.768138  2692 test_util.cc:176] Had fatal failures, leaving test files at /tmp/dist-test-taskZpxjZG/test-tmp/rpc-test.5.Parameters_TestRpc.TestCallWithChainCertAndChainCA_SSL_TCP.1790721936698958-2692-0

Full log

Note: This is test shard 6 of 8.
[==========] Running 21 tests from 2 test suites.
[----------] Global test environment set-up.
[----------] 20 tests from Parameters/TestRpc
[ RUN      ] Parameters/TestRpc.TestMessengerCreateDestroy/SSL_TCP
WARNING: Logging before InitGoogleLogging() is written to STDERR
I20260929 22:45:36.739262  2692 rpc-test.cc:169] started messenger TestCreateDestroy
[       OK ] Parameters/TestRpc.TestMessengerCreateDestroy/SSL_TCP (38 ms)
[ RUN      ] Parameters/TestRpc.TestNegotiationDeadlock/SSL_TCP
I20260929 22:45:36.747562  2712 acceptor_pool.cc:254] collecting diagnostics on the listening RPC socket 0.0.0.0:44957 every 8 connection(s)
I20260929 22:45:36.747586  2713 acceptor_pool.cc:254] collecting diagnostics on the listening RPC socket 0.0.0.0:44957 every 8 connection(s)
[       OK ] Parameters/TestRpc.TestNegotiationDeadlock/SSL_TCP (15 ms)
[ RUN      ] Parameters/TestRpc.TestCallWithChainCertAndChainCA/SSL_TCP
I20260929 22:45:36.763095  2728 acceptor_pool.cc:254] collecting diagnostics on the listening RPC socket 0.0.0.0:33263 every 8 connection(s)
I20260929 22:45:36.763157  2729 acceptor_pool.cc:254] collecting diagnostics on the listening RPC socket 0.0.0.0:33263 every 8 connection(s)
/data0/somelongdirectorytoavoidrpathissues/src/kudu/src/kudu/rpc/rpc-test.cc:270: Failure
Failed
Bad status: Runtime error: could not verify certificate chain (error with cert: subject=CN = localhost, ST = sadfjas, C = AS, emailAddress = sdflkdsajf, O = lskdfjlsad, OU = sldfkja, issuer=C = AS, ST = ASDfkjdhf, L = lskdjf, O = saldfja, OU = skdjf, CN = localhost, emailAddress = sadjflkadsj): : certificate has expired
Google Test trace:
/data0/somelongdirectorytoavoidrpathissues/src/kudu/src/kudu/rpc/rpc-test.cc:267: Connecting to 0.0.0.0:33263
I20260929 22:45:36.768076  2692 test_util.cc:175] -----------------------------------------------
I20260929 22:45:36.768138  2692 test_util.cc:176] Had fatal failures, leaving test files at /tmp/dist-test-taskZpxjZG/test-tmp/rpc-test.5.Parameters_TestRpc.TestCallWithChainCertAndChainCA_SSL_TCP.1790721936698958-2692-0
[  FAILED  ] Parameters/TestRpc.TestCallWithChainCertAndChainCA/SSL_TCP, where GetParam() = (true, false) (12 ms)
[ RUN      ] Parameters/TestRpc.TestCallWithPasswordProtectedKey/SSL_TCP
I20260929 22:45:36.779258  2754 acceptor_pool.cc:254] collecting diagnostics on the listening RPC socket 0.0.0.0:41659 every 8 connection(s)
I20260929 22:45:36.782415  2753 acceptor_pool.cc:254] collecting diagnostics on the listening RPC socket 0.0.0.0:41659 every 8 connection(s)
[       OK ] Parameters/TestRpc.TestCallWithPasswordProtectedKey/SSL_TCP (23 ms)
[ RUN      ] Parameters/TestRpc.TestCallToBadServer/SSL_TCP
I20260929 22:45:36.806178  2692 rpc-test.cc:394] Status: Network error: Client connection negotiation failed: client connection to 0.0.0.0:0: connect: Connection refused (error 111)
I20260929 22:45:36.806499  2692 rpc-test.cc:394] Status: Network error: Client connection negotiation failed: client connection to 0.0.0.0:0: connect: Connection refused (error 111)
I20260929 22:45:36.806670  2692 rpc-test.cc:394] Status: Network error: Client connection negotiation failed: client connection to 0.0.0.0:0: connect: Connection refused (error 111)
I20260929 22:45:36.806823  2692 rpc-test.cc:394] Status: Network error: Client connection negotiation failed: client connection to 0.0.0.0:0: connect: Connection refused (error 111)
I20260929 22:45:36.806970  2692 rpc-test.cc:394] Status: Network error: Client connection negotiation failed: client connection to 0.0.0.0:0: connect: Connection refused (error 111)
[       OK ] Parameters/TestRpc.TestCallToBadServer/SSL_TCP (16 ms)
[ RUN      ] Parameters/TestRpc.TestWrongService/SSL_TCP
I20260929 22:45:36.818477  2788 acceptor_pool.cc:254] collecting diagnostics on the listening RPC socket 0.0.0.0:43317 every 8 connection(s)
I20260929 22:45:36.818491  2789 acceptor_pool.cc:254] collecting diagnostics on the listening RPC socket 0.0.0.0:43317 every 8 connection(s)
I20260929 22:45:36.846874  2785 messenger.cc:345] service WrongServiceName not registered on TestServer
[       OK ] Parameters/TestRpc.TestWrongService/SSL_TCP (40 ms)
[ RUN      ] Parameters/TestRpc.TestConnectionKeepalive/SSL_TCP
I20260929 22:45:36.864210  2811 acceptor_pool.cc:254] collecting diagnostics on the listening RPC socket 0.0.0.0:38565 every 8 connection(s)
I20260929 22:45:36.864243  2812 acceptor_pool.cc:254] collecting diagnostics on the listening RPC socket 0.0.0.0:38565 every 8 connection(s)
I20260929 22:45:36.864362  2692 rpc-test.cc:488] Connecting to 0.0.0.0:38565
[       OK ] Parameters/TestRpc.TestConnectionKeepalive/SSL_TCP (1042 ms)
[ RUN      ] Parameters/TestRpc.TestClientConnectionMetrics/SSL_TCP
I20260929 22:45:37.910885  2836 acceptor_pool.cc:254] collecting diagnostics on the listening RPC socket 0.0.0.0:46289 every 8 connection(s)
I20260929 22:45:37.910943  2837 acceptor_pool.cc:254] collecting diagnostics on the listening RPC socket 0.0.0.0:46289 every 8 connection(s)
I20260929 22:45:37.911059  2692 rpc-test.cc:569] Connecting to 0.0.0.0:46289
[       OK ] Parameters/TestRpc.TestClientConnectionMetrics/SSL_TCP (7993 ms)
[ RUN      ] Parameters/TestRpc.TestCredentialsPolicy/SSL_TCP
I20260929 22:45:45.900364  2859 acceptor_pool.cc:254] collecting diagnostics on the listening RPC socket 0.0.0.0:44615 every 8 connection(s)
I20260929 22:45:45.900434  2860 acceptor_pool.cc:254] collecting diagnostics on the listening RPC socket 0.0.0.0:44615 every 8 connection(s)
I20260929 22:45:45.900614  2692 rpc-test.cc:700] Connecting to 0.0.0.0:44615
[       OK ] Parameters/TestRpc.TestCredentialsPolicy/SSL_TCP (43 ms)
[ RUN      ] Parameters/TestRpc.TestCallLongerThanKeepalive/SSL_TCP
I20260929 22:45:45.942116  2884 acceptor_pool.cc:254] collecting diagnostics on the listening RPC socket 0.0.0.0:46831 every 8 connection(s)
I20260929 22:45:45.942183  2885 acceptor_pool.cc:254] collecting diagnostics on the listening RPC socket 0.0.0.0:46831 every 8 connection(s)
I20260929 22:45:45.966421  2888 rpc-test-base.h:222] got call: sleep_micros: 3000000 deferred: true
I20260929 22:45:48.967149  2888 rpcz_store.cc:275] Call kudu.rpc.GenericCalculatorService.Sleep from 127.0.0.1:51118 (request call id 0) took 3000 ms. Trace:
I20260929 22:45:48.967254  2888 rpcz_store.cc:276] 0929 22:45:45.966367 (+     0us) service_pool.cc:170] Inserting onto call queue
0929 22:45:45.966397 (+    30us) service_pool.cc:227] Handling call
0929 22:45:48.967132 (+3000735us) inbound_call.cc:173] Queueing success response
Metrics: {}
[       OK ] Parameters/TestRpc.TestCallLongerThanKeepalive/SSL_TCP (3041 ms)
[ RUN      ] Parameters/TestRpc.TestRpcSidecar/SSL_TCP
I20260929 22:45:48.979600  2909 acceptor_pool.cc:254] collecting diagnostics on the listening RPC socket 0.0.0.0:41695 every 8 connection(s)
I20260929 22:45:48.979655  2910 acceptor_pool.cc:254] collecting diagnostics on the listening RPC socket 0.0.0.0:41695 every 8 connection(s)
[       OK ] Parameters/TestRpc.TestRpcSidecar/SSL_TCP (60 ms)
[ RUN      ] Parameters/TestRpc.TestRpcSidecarLimits/SSL_TCP
I20260929 22:45:50.717527  2934 acceptor_pool.cc:254] collecting diagnostics on the listening RPC socket 0.0.0.0:35057 every 8 connection(s)
I20260929 22:45:50.717528  2935 acceptor_pool.cc:254] collecting diagnostics on the listening RPC socket 0.0.0.0:35057 every 8 connection(s)
W20260929 22:45:50.729390  2692 serialization.cc:72] Serialized kudu.rpc_test.PushStringsRequestPB (2147483654 bytes) is larger than the maximum configured RPC message size (52428800 bytes). Sending anyway, but peer may reject the data.
W20260929 22:45:50.732494  2932 connection.cc:535] server connection from 127.0.0.1:54418 recv error: Network error: RPC frame had a length of 2147483714, but we only support messages up to 52428800 bytes long.
W20260929 22:45:50.732543  2932 connection.cc:158] shutting down server connection from 127.0.0.1:54418 with pending inbound data: 4/2147483714 bytes received; last active 0 ns ago: status Network error: RPC frame had a length of 2147483714, but we only support messages up to 52428800 bytes long.
W20260929 22:45:50.732726  2947 connection.cc:196] Error closing socket: Network error: TlsSocket::Close: Connection reset by peer
I20260929 22:45:50.756016  2960 acceptor_pool.cc:254] collecting diagnostics on the listening RPC socket 0.0.0.0:34371 every 8 connection(s)
I20260929 22:45:50.756055  2959 acceptor_pool.cc:254] collecting diagnostics on the listening RPC socket 0.0.0.0:34371 every 8 connection(s)
W20260929 22:45:55.186978  2957 connection.cc:577] server connection from 127.0.0.1:37772: received bad data: 'Corruption: Invalid packet: message had a length of 2147483710, but we only support messages up to 2147483647 bytes
'
[       OK ] Parameters/TestRpc.TestRpcSidecarLimits/SSL_TCP (6159 ms)
[ RUN      ] Parameters/TestRpc.TestCallTimeoutDoesntAffectNegotiation/SSL_TCP
I20260929 22:45:55.196208  2985 acceptor_pool.cc:254] collecting diagnostics on the listening RPC socket 0.0.0.0:41167 every 8 connection(s)
I20260929 22:45:55.196229  2984 acceptor_pool.cc:254] collecting diagnostics on the listening RPC socket 0.0.0.0:41167 every 8 connection(s)
W20260929 22:45:55.204602  2980 negotiation.cc:266] Injecting 500ms delay in negotiation
I20260929 22:45:55.254999  2692 rpc-test-base.h:595] status: Timed out: connection negotiation to 0.0.0.0:41167 for RPC Sleep timed out after 0.050s (ON_OUTBOUND_QUEUE), seconds elapsed: 0.0506837
[       OK ] Parameters/TestRpc.TestCallTimeoutDoesntAffectNegotiation/SSL_TCP (520 ms)
[ RUN      ] Parameters/TestRpc.TestRpcHandlerLatencyMetric/SSL_TCP
I20260929 22:45:55.726655  3009 acceptor_pool.cc:254] collecting diagnostics on the listening RPC socket 0.0.0.0:35729 every 8 connection(s)
I20260929 22:45:55.726675  3010 acceptor_pool.cc:254] collecting diagnostics on the listening RPC socket 0.0.0.0:35729 every 8 connection(s)
I20260929 22:45:55.770236  2692 rpc-test.cc:1236] Sleep() min lat: 20264
I20260929 22:45:55.770308  2692 rpc-test.cc:1237] Sleep() mean lat: 20264
I20260929 22:45:55.770331  2692 rpc-test.cc:1238] Sleep() max lat: 20264
I20260929 22:45:55.770344  2692 rpc-test.cc:1239] Sleep() #calls: 1
[       OK ] Parameters/TestRpc.TestRpcHandlerLatencyMetric/SSL_TCP (62 ms)
[ RUN      ] Parameters/TestRpc.TimedOutOnResponseMetricServiceQueue/SSL_TCP
I20260929 22:45:55.799525  3035 acceptor_pool.cc:254] collecting diagnostics on the listening RPC socket 0.0.0.0:44477 every 8 connection(s)
I20260929 22:45:55.799551  3036 acceptor_pool.cc:254] collecting diagnostics on the listening RPC socket 0.0.0.0:44477 every 8 connection(s)
W20260929 22:45:55.851720  3037 rpcz_store.cc:267] Call kudu.rpc_test.CalculatorService.Sleep from 127.0.0.1:41750 (request call id 2) took 20 ms (client timeout 20 ms). Trace:
W20260929 22:45:55.851826  3037 rpcz_store.cc:269] 0929 22:45:55.831516 (+     0us) service_pool.cc:170] Inserting onto call queue
0929 22:45:55.851696 (+ 20180us) service_pool.cc:214] Skipping call since client already timed out
0929 22:45:55.851705 (+     9us) inbound_call.cc:173] Queueing failure response
Metrics: {}
[       OK ] Parameters/TestRpc.TimedOutOnResponseMetricServiceQueue/SSL_TCP (81 ms)
[ RUN      ] Parameters/TestRpc.RpcPendingConnectionsMetric/SSL_TCP
I20260929 22:45:55.854782  3058 acceptor_pool.cc:254] collecting diagnostics on the listening RPC socket 0.0.0.0:37009 every 8 connection(s)
I20260929 22:45:55.854846  3059 acceptor_pool.cc:254] collecting diagnostics on the listening RPC socket 0.0.0.0:37009 every 8 connection(s)
W20260929 22:45:55.855373  3054 negotiation.cc:337] Failed RPC negotiation. Trace:
0929 22:45:55.855220 (+     0us) reactor.cc:625] Submitting negotiation task for server connection from 127.0.0.1:37998 (local address 127.0.0.1:37009)
0929 22:45:55.855262 (+    42us) server_negotiation.cc:206] Beginning negotiation
0929 22:45:55.855264 (+     2us) server_negotiation.cc:399] Waiting for connection header
0929 22:45:55.855324 (+    60us) negotiation.cc:327] Negotiation complete: Network error: Server connection negotiation failed: server connection from 127.0.0.1:37998: BlockingRecv error: recv got EOF from 127.0.0.1:37998 (error 108)
Metrics: {"server-negotiator.queue_time_us":16}
[       OK ] Parameters/TestRpc.RpcPendingConnectionsMetric/SSL_TCP (13 ms)
[ RUN      ] Parameters/TestRpc.TestRpcContextClientDeadline/SSL_TCP
I20260929 22:45:55.888361  3074 acceptor_pool.cc:254] collecting diagnostics on the listening RPC socket 0.0.0.0:38675 every 8 connection(s)
I20260929 22:45:55.888417  3075 acceptor_pool.cc:254] collecting diagnostics on the listening RPC socket 0.0.0.0:38675 every 8 connection(s)
[       OK ] Parameters/TestRpc.TestRpcContextClientDeadline/SSL_TCP (55 ms)
[ RUN      ] Parameters/TestRpc.TestApplicationFeatureFlagUnsupportedServer/SSL_TCP
I20260929 22:45:55.930330  3099 acceptor_pool.cc:254] collecting diagnostics on the listening RPC socket 0.0.0.0:41111 every 8 connection(s)
I20260929 22:45:55.930365  3100 acceptor_pool.cc:254] collecting diagnostics on the listening RPC socket 0.0.0.0:41111 every 8 connection(s)
[       OK ] Parameters/TestRpc.TestApplicationFeatureFlagUnsupportedServer/SSL_TCP (19 ms)
[ RUN      ] Parameters/TestRpc.TestCancellationAsync/SSL_TCP
I20260929 22:45:55.959733  3124 acceptor_pool.cc:254] collecting diagnostics on the listening RPC socket 0.0.0.0:43285 every 8 connection(s)
I20260929 22:45:55.959774  3125 acceptor_pool.cc:254] collecting diagnostics on the listening RPC socket 0.0.0.0:43285 every 8 connection(s)
I20260929 22:45:55.959895  2692 rpc-test.cc:1716] Connecting to 0.0.0.0:43285
I20260929 22:45:55.972586  2692 test_util.cc:268] Using random seed: -233585177
I20260929 22:45:55.988607  3128 rpc-test-base.h:240] got call: sleep_micros: 500 pattern: 4294967295 num_repetitions: 2097152 sidecar_idx: 0
I20260929 22:45:56.001144  3128 rpc-test-base.h:240] got call: sleep_micros: 500 pattern: 4294967295 num_repetitions: 2097152 sidecar_idx: 0
I20260929 22:45:56.013461  3128 rpc-test-base.h:240] got call: sleep_micros: 500 pattern: 4294967295 num_repetitions: 2097152 sidecar_idx: 0
I20260929 22:45:56.028512  3128 rpc-test-base.h:240] got call: sleep_micros: 500 pattern: 4294967295 num_repetitions: 2097152 sidecar_idx: 0
I20260929 22:45:56.045198  3128 rpc-test-base.h:240] got call: sleep_micros: 500 pattern: 4294967295 num_repetitions: 2097152 sidecar_idx: 0
I20260929 22:45:56.058132  3128 rpc-test-base.h:240] got call: sleep_micros: 500 pattern: 4294967295 num_repetitions: 2097152 sidecar_idx: 0
I20260929 22:45:56.069841  3128 rpc-test-base.h:240] got call: sleep_micros: 500 pattern: 4294967295 num_repetitions: 2097152 sidecar_idx: 0
I20260929 22:45:56.081555  3128 rpc-test-base.h:240] got call: sleep_micros: 500 pattern: 4294967295 num_repetitions: 2097152 sidecar_idx: 0
W20260929 22:45:56.084532  3121 connection.cc:441] server connection from 127.0.0.1:52862 torn down before Call kudu.rpc.GenericCalculatorService.SleepWithSidecar from 127.0.0.1:52862 (request call id 9) could send its response
[       OK ] Parameters/TestRpc.TestCancellationAsync/SSL_TCP (143 ms)
[ RUN      ] Parameters/TestRpc.TestPerformanceBySocketType/SSL_TCP
I20260929 22:45:56.105296  3149 acceptor_pool.cc:254] collecting diagnostics on the listening RPC socket 0.0.0.0:46579 every 8 connection(s)
I20260929 22:45:56.105327  3150 acceptor_pool.cc:254] collecting diagnostics on the listening RPC socket 0.0.0.0:46579 every 8 connection(s)
I20260929 22:45:56.105454  2692 rpc-test.cc:1846] Connecting to 0.0.0.0:46579
I20260929 22:45:57.672622  2692 rpc-test.cc:1859] Sending 1024MB via ssl-enabled tcp socket: real 1.548s	user 1.430s	sys 1.309s
I20260929 22:45:59.239710  2692 rpc-test.cc:1859] Sending 1024MB via ssl-enabled tcp socket: real 1.567s	user 1.471s	sys 1.302s
I20260929 22:46:00.824546  2692 rpc-test.cc:1859] Sending 1024MB via ssl-enabled tcp socket: real 1.585s	user 1.499s	sys 1.288s
I20260929 22:46:02.419577  2692 rpc-test.cc:1859] Sending 1024MB via ssl-enabled tcp socket: real 1.595s	user 1.509s	sys 1.301s
I20260929 22:46:03.926514  2692 rpc-test.cc:1859] Sending 1024MB via ssl-enabled tcp socket: real 1.507s	user 1.410s	sys 1.262s
[       OK ] Parameters/TestRpc.TestPerformanceBySocketType/SSL_TCP (7842 ms)
[----------] 20 tests from Parameters/TestRpc (27226 ms total)

[----------] 1 test from Parameters/TestRpcSocketTxRxQueue
[ RUN      ] Parameters/TestRpcSocketTxRxQueue.OverCapacity/0
W20260929 22:46:04.192092  3202 negotiation.cc:337] Failed RPC negotiation. Trace:
0929 22:46:03.933173 (+     0us) reactor.cc:625] Submitting negotiation task for client connection to 0.0.0.0:42233 (local address 127.0.0.1:45962)
0929 22:46:03.933210 (+    37us) negotiation.cc:107] Waiting for socket to connect
0929 22:46:03.933219 (+     9us) client_negotiation.cc:174] Beginning negotiation
0929 22:46:03.933263 (+    44us) client_negotiation.cc:252] Sending NEGOTIATE NegotiatePB request
0929 22:46:04.192035 (+258772us) negotiation.cc:327] Negotiation complete: Network error: Client connection negotiation failed: client connection to 0.0.0.0:42233: BlockingRecv error: recv error from unknown peer: Transport endpoint is not connected (error 107)
Metrics: {"client-negotiator.queue_time_us":16}
W20260929 22:46:04.192181  3166 negotiation.cc:337] Failed RPC negotiation. Trace:
0929 22:46:03.929646 (+     0us) reactor.cc:625] Submitting negotiation task for client connection to 0.0.0.0:42233 (local address 127.0.0.1:45922)
0929 22:46:03.929683 (+    37us) negotiation.cc:107] Waiting for socket to connect
0929 22:46:03.929693 (+    10us) client_negotiation.cc:174] Beginning negotiation
0929 22:46:03.929757 (+    64us) client_negotiation.cc:252] Sending NEGOTIATE NegotiatePB request
0929 22:46:04.191953 (+262196us) negotiation.cc:327] Negotiation complete: Network error: Client connection negotiation failed: client connection to 0.0.0.0:42233: BlockingRecv error: recv error from unknown peer: Transport endpoint is not connected (error 107)
Metrics: {"client-negotiator.queue_time_us":17}
W20260929 22:46:04.192095  3172 negotiation.cc:337] Failed RPC negotiation. Trace:
0929 22:46:03.930628 (+     0us) reactor.cc:625] Submitting negotiation task for client connection to 0.0.0.0:42233 (local address 127.0.0.1:45924)
0929 22:46:03.930666 (+    38us) negotiation.cc:107] Waiting for socket to connect
0929 22:46:03.930676 (+    10us) client_negotiation.cc:174] Beginning negotiation
0929 22:46:03.930723 (+    47us) client_negotiation.cc:252] Sending NEGOTIATE NegotiatePB request
0929 22:46:04.191953 (+261230us) negotiation.cc:327] Negotiation complete: Network error: Client connection negotiation failed: client connection to 0.0.0.0:42233: BlockingRecv error: recv error from unknown peer: Transport endpoint is not connected (error 107)
Metrics: {"client-negotiator.queue_time_us":14}
W20260929 22:46:04.192426  3182 negotiation.cc:337] Failed RPC negotiation. Trace:
0929 22:46:03.931521 (+     0us) reactor.cc:625] Submitting negotiation task for client connection to 0.0.0.0:42233 (local address 127.0.0.1:45940)
0929 22:46:03.931572 (+    51us) negotiation.cc:107] Waiting for socket to connect
0929 22:46:03.931581 (+     9us) client_negotiation.cc:174] Beginning negotiation
0929 22:46:03.931630 (+    49us) client_negotiation.cc:252] Sending NEGOTIATE NegotiatePB request
0929 22:46:04.191953 (+260323us) negotiation.cc:327] Negotiation complete: Network error: Client connection negotiation failed: client connection to 0.0.0.0:42233: BlockingRecv error: recv error from unknown peer: Transport endpoint is not connected (error 107)
Metrics: {"client-negotiator.queue_time_us":28}
W20260929 22:46:04.192308  3193 negotiation.cc:337] Failed RPC negotiation. Trace:
0929 22:46:03.932343 (+     0us) reactor.cc:625] Submitting negotiation task for client connection to 0.0.0.0:42233 (local address 127.0.0.1:45954)
0929 22:46:03.932389 (+    46us) negotiation.cc:107] Waiting for socket to connect
0929 22:46:03.932397 (+     8us) client_negotiation.cc:174] Beginning negotiation
0929 22:46:03.932435 (+    38us) client_negotiation.cc:252] Sending NEGOTIATE NegotiatePB request
0929 22:46:04.191953 (+259518us) negotiation.cc:327] Negotiation complete: Network error: Client connection negotiation failed: client connection to 0.0.0.0:42233: BlockingRecv error: recv error from unknown peer: Transport endpoint is not connected (error 107)
Metrics: {"client-negotiator.queue_time_us":27}
W20260929 22:46:04.192095  3211 negotiation.cc:337] Failed RPC negotiation. Trace:
0929 22:46:03.933915 (+     0us) reactor.cc:625] Submitting negotiation task for client connection to 0.0.0.0:42233 (local address 127.0.0.1:45966)
0929 22:46:03.933978 (+    63us) negotiation.cc:107] Waiting for socket to connect
0929 22:46:03.933988 (+    10us) client_negotiation.cc:174] Beginning negotiation
0929 22:46:03.934025 (+    37us) client_negotiation.cc:252] Sending NEGOTIATE NegotiatePB request
0929 22:46:04.192053 (+258028us) negotiation.cc:327] Negotiation complete: Network error: Client connection negotiation failed: client connection to 0.0.0.0:42233: BlockingRecv error: recv error from unknown peer: Transport endpoint is not connected (error 107)
Metrics: {"client-negotiator.queue_time_us":35}
[       OK ] Parameters/TestRpcSocketTxRxQueue.OverCapacity/0 (1022 ms)
[----------] 1 test from Parameters/TestRpcSocketTxRxQueue (1022 ms total)

[----------] Global test environment tear-down
[==========] 21 tests from 2 test suites ran. (28249 ms total)
[  PASSED  ] 20 tests.
[  FAILED  ] 1 test, listed below:
[  FAILED  ] Parameters/TestRpc.TestCallWithChainCertAndChainCA/SSL_TCP, where GetParam() = (true, false)

 1 FAILED TEST