Diagnosed failure

Parameters/TestRpc.TestCallWithChainCertAndChainCA/SSL_UnixSocket: /data0/somelongdirectorytoavoidrpathissues/src/kudu/src/kudu/rpc/rpc-test.cc:270: Failure
Failed
Bad status: Runtime error: could not verify certificate chain (error with cert: subject=CN = localhost, ST = sadfjas, C = AS, emailAddress = sdflkdsajf, O = lskdfjlsad, OU = sldfkja, issuer=C = AS, ST = ASDfkjdhf, L = lskdjf, O = saldfja, OU = skdjf, CN = localhost, emailAddress = sadjflkadsj): : certificate has expired
Google Test trace:
/data0/somelongdirectorytoavoidrpathissues/src/kudu/src/kudu/rpc/rpc-test.cc:267: Connecting to unix:/tmp/dist-test-taskS7b718/test-tmp/rpc-test-0b0c427eb43f4d8f91f8589ce77b4e19.sock
I20260928 02:37:02.103830   774 test_util.cc:175] -----------------------------------------------
I20260928 02:37:02.103904   774 test_util.cc:176] Had fatal failures, leaving test files at /tmp/dist-test-taskS7b718/test-tmp/rpc-test.6.Parameters_TestRpc.TestCallWithChainCertAndChainCA_SSL_UnixSocket.1790563022037962-774-0

Full log

Note: This is test shard 7 of 8.
[==========] Running 21 tests from 2 test suites.
[----------] Global test environment set-up.
[----------] 20 tests from Parameters/TestRpc
[ RUN      ] Parameters/TestRpc.TestMessengerCreateDestroy/SSL_UnixSocket
WARNING: Logging before InitGoogleLogging() is written to STDERR
I20260928 02:37:02.058197   774 rpc-test.cc:169] started messenger TestCreateDestroy
[       OK ] Parameters/TestRpc.TestMessengerCreateDestroy/SSL_UnixSocket (18 ms)
[ RUN      ] Parameters/TestRpc.TestNegotiationDeadlock/SSL_UnixSocket
I20260928 02:37:02.071285   794 acceptor_pool.cc:254] collecting diagnostics on the listening RPC socket unix:/tmp/dist-test-taskS7b718/test-tmp/rpc-test-16a8a4e455204903b9b660b23395b2ed.sock every 8 connection(s)
I20260928 02:37:02.071311   795 acceptor_pool.cc:254] collecting diagnostics on the listening RPC socket unix:/tmp/dist-test-taskS7b718/test-tmp/rpc-test-16a8a4e455204903b9b660b23395b2ed.sock every 8 connection(s)
[       OK ] Parameters/TestRpc.TestNegotiationDeadlock/SSL_UnixSocket (19 ms)
[ RUN      ] Parameters/TestRpc.TestCallWithChainCertAndChainCA/SSL_UnixSocket
I20260928 02:37:02.099546   810 acceptor_pool.cc:254] collecting diagnostics on the listening RPC socket unix:/tmp/dist-test-taskS7b718/test-tmp/rpc-test-0b0c427eb43f4d8f91f8589ce77b4e19.sock every 8 connection(s)
I20260928 02:37:02.099563   811 acceptor_pool.cc:254] collecting diagnostics on the listening RPC socket unix:/tmp/dist-test-taskS7b718/test-tmp/rpc-test-0b0c427eb43f4d8f91f8589ce77b4e19.sock every 8 connection(s)
/data0/somelongdirectorytoavoidrpathissues/src/kudu/src/kudu/rpc/rpc-test.cc:270: Failure
Failed
Bad status: Runtime error: could not verify certificate chain (error with cert: subject=CN = localhost, ST = sadfjas, C = AS, emailAddress = sdflkdsajf, O = lskdfjlsad, OU = sldfkja, issuer=C = AS, ST = ASDfkjdhf, L = lskdjf, O = saldfja, OU = skdjf, CN = localhost, emailAddress = sadjflkadsj): : certificate has expired
Google Test trace:
/data0/somelongdirectorytoavoidrpathissues/src/kudu/src/kudu/rpc/rpc-test.cc:267: Connecting to unix:/tmp/dist-test-taskS7b718/test-tmp/rpc-test-0b0c427eb43f4d8f91f8589ce77b4e19.sock
I20260928 02:37:02.103830   774 test_util.cc:175] -----------------------------------------------
I20260928 02:37:02.103904   774 test_util.cc:176] Had fatal failures, leaving test files at /tmp/dist-test-taskS7b718/test-tmp/rpc-test.6.Parameters_TestRpc.TestCallWithChainCertAndChainCA_SSL_UnixSocket.1790563022037962-774-0
[  FAILED  ] Parameters/TestRpc.TestCallWithChainCertAndChainCA/SSL_UnixSocket, where GetParam() = (true, true) (25 ms)
[ RUN      ] Parameters/TestRpc.TestCallWithPasswordProtectedKey/SSL_UnixSocket
I20260928 02:37:02.122972   835 acceptor_pool.cc:254] collecting diagnostics on the listening RPC socket unix:/tmp/dist-test-taskS7b718/test-tmp/rpc-test-168906b73fe549e5b2118213c60b7645.sock every 8 connection(s)
I20260928 02:37:02.123013   836 acceptor_pool.cc:254] collecting diagnostics on the listening RPC socket unix:/tmp/dist-test-taskS7b718/test-tmp/rpc-test-168906b73fe549e5b2118213c60b7645.sock every 8 connection(s)
W20260928 02:37:02.134648   832 connection.cc:196] Error closing socket: Network error: TlsSocket::Close: Broken pipe
[       OK ] Parameters/TestRpc.TestCallWithPasswordProtectedKey/SSL_UnixSocket (31 ms)
[ RUN      ] Parameters/TestRpc.TestCallToBadServer/SSL_UnixSocket
I20260928 02:37:02.145915   774 rpc-test.cc:394] Status: Network error: Client connection negotiation failed: client connection to 0.0.0.0:0: connect: Connection refused (error 111)
I20260928 02:37:02.146227   774 rpc-test.cc:394] Status: Network error: Client connection negotiation failed: client connection to 0.0.0.0:0: connect: Connection refused (error 111)
I20260928 02:37:02.146497   774 rpc-test.cc:394] Status: Network error: Client connection negotiation failed: client connection to 0.0.0.0:0: connect: Connection refused (error 111)
I20260928 02:37:02.146728   774 rpc-test.cc:394] Status: Network error: Client connection negotiation failed: client connection to 0.0.0.0:0: connect: Connection refused (error 111)
I20260928 02:37:02.146934   774 rpc-test.cc:394] Status: Network error: Client connection negotiation failed: client connection to 0.0.0.0:0: connect: Connection refused (error 111)
[       OK ] Parameters/TestRpc.TestCallToBadServer/SSL_UnixSocket (11 ms)
[ RUN      ] Parameters/TestRpc.TestWrongService/SSL_UnixSocket
I20260928 02:37:02.168365   870 acceptor_pool.cc:254] collecting diagnostics on the listening RPC socket unix:/tmp/dist-test-taskS7b718/test-tmp/rpc-test-26dfdbbaff9945a68f3f08af749d67b0.sock every 8 connection(s)
I20260928 02:37:02.168395   871 acceptor_pool.cc:254] collecting diagnostics on the listening RPC socket unix:/tmp/dist-test-taskS7b718/test-tmp/rpc-test-26dfdbbaff9945a68f3f08af749d67b0.sock every 8 connection(s)
I20260928 02:37:02.192000   867 messenger.cc:345] service WrongServiceName not registered on TestServer
[       OK ] Parameters/TestRpc.TestWrongService/SSL_UnixSocket (46 ms)
[ RUN      ] Parameters/TestRpc.TestConnectionKeepalive/SSL_UnixSocket
I20260928 02:37:02.202282   893 acceptor_pool.cc:254] collecting diagnostics on the listening RPC socket unix:/tmp/dist-test-taskS7b718/test-tmp/rpc-test-95e63577e637441f81564ab99eab9717.sock every 8 connection(s)
I20260928 02:37:02.202335   894 acceptor_pool.cc:254] collecting diagnostics on the listening RPC socket unix:/tmp/dist-test-taskS7b718/test-tmp/rpc-test-95e63577e637441f81564ab99eab9717.sock every 8 connection(s)
I20260928 02:37:02.202515   774 rpc-test.cc:488] Connecting to unix:/tmp/dist-test-taskS7b718/test-tmp/rpc-test-95e63577e637441f81564ab99eab9717.sock
W20260928 02:37:02.695832   906 connection.cc:196] Error closing socket: Network error: TlsSocket::Close: Broken pipe
[       OK ] Parameters/TestRpc.TestConnectionKeepalive/SSL_UnixSocket (1054 ms)
[ RUN      ] Parameters/TestRpc.TestClientConnectionMetrics/SSL_UnixSocket
I20260928 02:37:03.255790   918 acceptor_pool.cc:254] collecting diagnostics on the listening RPC socket unix:/tmp/dist-test-taskS7b718/test-tmp/rpc-test-f185170f52cc4d8cba22d0745db507fe.sock every 8 connection(s)
I20260928 02:37:03.255837   919 acceptor_pool.cc:254] collecting diagnostics on the listening RPC socket unix:/tmp/dist-test-taskS7b718/test-tmp/rpc-test-f185170f52cc4d8cba22d0745db507fe.sock every 8 connection(s)
I20260928 02:37:03.256042   774 rpc-test.cc:569] Connecting to unix:/tmp/dist-test-taskS7b718/test-tmp/rpc-test-f185170f52cc4d8cba22d0745db507fe.sock
W20260928 02:37:11.814828   915 connection.cc:196] Error closing socket: Network error: TlsSocket::Close: Broken pipe
[       OK ] Parameters/TestRpc.TestClientConnectionMetrics/SSL_UnixSocket (8567 ms)
[ RUN      ] Parameters/TestRpc.TestCredentialsPolicy/SSL_UnixSocket
I20260928 02:37:11.828331   941 acceptor_pool.cc:254] collecting diagnostics on the listening RPC socket unix:/tmp/dist-test-taskS7b718/test-tmp/rpc-test-185f5f0fbf9e46e391e9d8ff2eb48baf.sock every 8 connection(s)
I20260928 02:37:11.828361   942 acceptor_pool.cc:254] collecting diagnostics on the listening RPC socket unix:/tmp/dist-test-taskS7b718/test-tmp/rpc-test-185f5f0fbf9e46e391e9d8ff2eb48baf.sock every 8 connection(s)
I20260928 02:37:11.828509   774 rpc-test.cc:700] Connecting to unix:/tmp/dist-test-taskS7b718/test-tmp/rpc-test-185f5f0fbf9e46e391e9d8ff2eb48baf.sock
W20260928 02:37:11.844491   940 connection.cc:196] Error closing socket: Network error: TlsSocket::Close: Broken pipe
[       OK ] Parameters/TestRpc.TestCredentialsPolicy/SSL_UnixSocket (33 ms)
[ RUN      ] Parameters/TestRpc.TestCallLongerThanKeepalive/SSL_UnixSocket
I20260928 02:37:11.865481   966 acceptor_pool.cc:254] collecting diagnostics on the listening RPC socket unix:/tmp/dist-test-taskS7b718/test-tmp/rpc-test-ccea556375f7468b99035a83ae70ef25.sock every 8 connection(s)
I20260928 02:37:11.865525   967 acceptor_pool.cc:254] collecting diagnostics on the listening RPC socket unix:/tmp/dist-test-taskS7b718/test-tmp/rpc-test-ccea556375f7468b99035a83ae70ef25.sock every 8 connection(s)
I20260928 02:37:11.875181   970 rpc-test-base.h:222] got call: sleep_micros: 3000000 deferred: true
I20260928 02:37:14.875888   970 rpcz_store.cc:275] Call kudu.rpc.GenericCalculatorService.Sleep from unix:<unnamed> (request call id 0) took 3000 ms. Trace:
I20260928 02:37:14.876005   970 rpcz_store.cc:276] 0928 02:37:11.875120 (+     0us) service_pool.cc:170] Inserting onto call queue
0928 02:37:11.875159 (+    39us) service_pool.cc:227] Handling call
0928 02:37:14.875871 (+3000712us) inbound_call.cc:173] Queueing success response
Metrics: {}
W20260928 02:37:14.877017   963 connection.cc:196] Error closing socket: Network error: TlsSocket::Close: Broken pipe
[       OK ] Parameters/TestRpc.TestCallLongerThanKeepalive/SSL_UnixSocket (3029 ms)
[ RUN      ] Parameters/TestRpc.TestRpcSidecar/SSL_UnixSocket
I20260928 02:37:14.903921   991 acceptor_pool.cc:254] collecting diagnostics on the listening RPC socket unix:/tmp/dist-test-taskS7b718/test-tmp/rpc-test-865098b6921045fbb1810682a9afca0e.sock every 8 connection(s)
I20260928 02:37:14.903962   992 acceptor_pool.cc:254] collecting diagnostics on the listening RPC socket unix:/tmp/dist-test-taskS7b718/test-tmp/rpc-test-865098b6921045fbb1810682a9afca0e.sock every 8 connection(s)
W20260928 02:37:14.945150   988 connection.cc:196] Error closing socket: Network error: TlsSocket::Close: Broken pipe
[       OK ] Parameters/TestRpc.TestRpcSidecar/SSL_UnixSocket (67 ms)
[ RUN      ] Parameters/TestRpc.TestRpcSidecarLimits/SSL_UnixSocket
I20260928 02:37:16.624745  1016 acceptor_pool.cc:254] collecting diagnostics on the listening RPC socket unix:/tmp/dist-test-taskS7b718/test-tmp/rpc-test-3443028f694b44ecafd718dba4ef7d97.sock every 8 connection(s)
I20260928 02:37:16.624804  1017 acceptor_pool.cc:254] collecting diagnostics on the listening RPC socket unix:/tmp/dist-test-taskS7b718/test-tmp/rpc-test-3443028f694b44ecafd718dba4ef7d97.sock every 8 connection(s)
W20260928 02:37:16.639680   774 serialization.cc:72] Serialized kudu.rpc_test.PushStringsRequestPB (2147483654 bytes) is larger than the maximum configured RPC message size (52428800 bytes). Sending anyway, but peer may reject the data.
W20260928 02:37:16.642961  1013 connection.cc:535] server connection from unix:<unnamed> recv error: Network error: RPC frame had a length of 2147483714, but we only support messages up to 52428800 bytes long.
W20260928 02:37:16.643038  1013 connection.cc:158] shutting down server connection from unix:<unnamed> with pending inbound data: 4/2147483714 bytes received; last active 0 ns ago: status Network error: RPC frame had a length of 2147483714, but we only support messages up to 52428800 bytes long.
W20260928 02:37:16.643225  1029 connection.cc:196] Error closing socket: Network error: TlsSocket::Close: Broken pipe
I20260928 02:37:16.662971  1041 acceptor_pool.cc:254] collecting diagnostics on the listening RPC socket unix:/tmp/dist-test-taskS7b718/test-tmp/rpc-test-3443028f694b44ecafd718dba4ef7d97.sock every 8 connection(s)
I20260928 02:37:16.663007  1042 acceptor_pool.cc:254] collecting diagnostics on the listening RPC socket unix:/tmp/dist-test-taskS7b718/test-tmp/rpc-test-3443028f694b44ecafd718dba4ef7d97.sock every 8 connection(s)
W20260928 02:37:21.356041  1038 connection.cc:577] server connection from unix:<unnamed>: received bad data: 'Corruption: Invalid packet: message had a length of 2147483710, but we only support messages up to 2147483647 bytes
'
W20260928 02:37:21.356422  1054 connection.cc:196] Error closing socket: Network error: TlsSocket::Close: Broken pipe
[       OK ] Parameters/TestRpc.TestRpcSidecarLimits/SSL_UnixSocket (6411 ms)
[ RUN      ] Parameters/TestRpc.TestCallTimeoutDoesntAffectNegotiation/SSL_UnixSocket
I20260928 02:37:21.373588  1066 acceptor_pool.cc:254] collecting diagnostics on the listening RPC socket unix:/tmp/dist-test-taskS7b718/test-tmp/rpc-test-8fc0ce94d8cf4e50bb9ac457043ca4c5.sock every 8 connection(s)
I20260928 02:37:21.373653  1067 acceptor_pool.cc:254] collecting diagnostics on the listening RPC socket unix:/tmp/dist-test-taskS7b718/test-tmp/rpc-test-8fc0ce94d8cf4e50bb9ac457043ca4c5.sock every 8 connection(s)
W20260928 02:37:21.379948  1062 negotiation.cc:266] Injecting 500ms delay in negotiation
I20260928 02:37:21.430238   774 rpc-test-base.h:595] status: Timed out: connection negotiation to unix:/tmp/dist-test-taskS7b718/test-tmp/rpc-test-8fc0ce94d8cf4e50bb9ac457043ca4c5.sock for RPC Sleep timed out after 0.050s (ON_OUTBOUND_QUEUE), seconds elapsed: 0.0505821
[       OK ] Parameters/TestRpc.TestCallTimeoutDoesntAffectNegotiation/SSL_UnixSocket (531 ms)
[ RUN      ] Parameters/TestRpc.TestRpcHandlerLatencyMetric/SSL_UnixSocket
I20260928 02:37:21.908186  1091 acceptor_pool.cc:254] collecting diagnostics on the listening RPC socket unix:/tmp/dist-test-taskS7b718/test-tmp/rpc-test-3a1b351df3db4a90a997ee1f7de6211b.sock every 8 connection(s)
I20260928 02:37:21.908205  1092 acceptor_pool.cc:254] collecting diagnostics on the listening RPC socket unix:/tmp/dist-test-taskS7b718/test-tmp/rpc-test-3a1b351df3db4a90a997ee1f7de6211b.sock every 8 connection(s)
I20260928 02:37:21.958243   774 rpc-test.cc:1236] Sleep() min lat: 20305
I20260928 02:37:21.958324   774 rpc-test.cc:1237] Sleep() mean lat: 20305
I20260928 02:37:21.958351   774 rpc-test.cc:1238] Sleep() max lat: 20305
I20260928 02:37:21.958364   774 rpc-test.cc:1239] Sleep() #calls: 1
W20260928 02:37:21.959018  1088 connection.cc:196] Error closing socket: Network error: TlsSocket::Close: Broken pipe
[       OK ] Parameters/TestRpc.TestRpcHandlerLatencyMetric/SSL_UnixSocket (70 ms)
[ RUN      ] Parameters/TestRpc.TimedOutOnResponseMetricServiceQueue/SSL_UnixSocket
I20260928 02:37:21.983232  1117 acceptor_pool.cc:254] collecting diagnostics on the listening RPC socket unix:/tmp/dist-test-taskS7b718/test-tmp/rpc-test-a3bd390e1ddc4efaa6d6ec21d306538b.sock every 8 connection(s)
I20260928 02:37:21.983259  1118 acceptor_pool.cc:254] collecting diagnostics on the listening RPC socket unix:/tmp/dist-test-taskS7b718/test-tmp/rpc-test-a3bd390e1ddc4efaa6d6ec21d306538b.sock every 8 connection(s)
W20260928 02:37:22.032234  1119 rpcz_store.cc:267] Call kudu.rpc_test.CalculatorService.Sleep from unix:<unnamed> (request call id 2) took 20 ms (client timeout 20 ms). Trace:
W20260928 02:37:22.032357  1119 rpcz_store.cc:269] 0928 02:37:22.011930 (+     0us) service_pool.cc:170] Inserting onto call queue
0928 02:37:22.032207 (+ 20277us) service_pool.cc:214] Skipping call since client already timed out
0928 02:37:22.032216 (+     9us) inbound_call.cc:173] Queueing failure response
Metrics: {}
W20260928 02:37:22.033046  1114 connection.cc:196] Error closing socket: Network error: TlsSocket::Close: Broken pipe
[       OK ] Parameters/TestRpc.TimedOutOnResponseMetricServiceQueue/SSL_UnixSocket (73 ms)
[ RUN      ] Parameters/TestRpc.RpcPendingConnectionsMetric/SSL_UnixSocket
I20260928 02:37:22.035954  1140 acceptor_pool.cc:254] collecting diagnostics on the listening RPC socket 0.0.0.0:43921 every 8 connection(s)
I20260928 02:37:22.036033  1141 acceptor_pool.cc:254] collecting diagnostics on the listening RPC socket 0.0.0.0:43921 every 8 connection(s)
W20260928 02:37:22.046433  1136 negotiation.cc:337] Failed RPC negotiation. Trace:
0928 02:37:22.045677 (+     0us) reactor.cc:625] Submitting negotiation task for server connection from 127.0.0.1:58796 (local address 127.0.0.1:43921)
0928 02:37:22.046191 (+   514us) server_negotiation.cc:206] Beginning negotiation
0928 02:37:22.046193 (+     2us) server_negotiation.cc:399] Waiting for connection header
0928 02:37:22.046345 (+   152us) negotiation.cc:327] Negotiation complete: Network error: Server connection negotiation failed: server connection from 127.0.0.1:58796: BlockingRecv error: recv got EOF from 127.0.0.1:58796 (error 108)
Metrics: {"server-negotiator.queue_time_us":448}
[       OK ] Parameters/TestRpc.RpcPendingConnectionsMetric/SSL_UnixSocket (22 ms)
[ RUN      ] Parameters/TestRpc.TestRpcContextClientDeadline/SSL_UnixSocket
I20260928 02:37:22.074970  1156 acceptor_pool.cc:254] collecting diagnostics on the listening RPC socket unix:/tmp/dist-test-taskS7b718/test-tmp/rpc-test-e09977ed962f426d84229d3655a28695.sock every 8 connection(s)
I20260928 02:37:22.075008  1157 acceptor_pool.cc:254] collecting diagnostics on the listening RPC socket unix:/tmp/dist-test-taskS7b718/test-tmp/rpc-test-e09977ed962f426d84229d3655a28695.sock every 8 connection(s)
[       OK ] Parameters/TestRpc.TestRpcContextClientDeadline/SSL_UnixSocket (49 ms)
[ RUN      ] Parameters/TestRpc.TestApplicationFeatureFlagUnsupportedServer/SSL_UnixSocket
I20260928 02:37:22.129307  1182 acceptor_pool.cc:254] collecting diagnostics on the listening RPC socket unix:/tmp/dist-test-taskS7b718/test-tmp/rpc-test-173f4caa117148a68386a5ca6d4163af.sock every 8 connection(s)
I20260928 02:37:22.129307  1181 acceptor_pool.cc:254] collecting diagnostics on the listening RPC socket unix:/tmp/dist-test-taskS7b718/test-tmp/rpc-test-173f4caa117148a68386a5ca6d4163af.sock every 8 connection(s)
W20260928 02:37:22.149116  1178 connection.cc:196] Error closing socket: Network error: TlsSocket::Close: Broken pipe
[       OK ] Parameters/TestRpc.TestApplicationFeatureFlagUnsupportedServer/SSL_UnixSocket (43 ms)
[ RUN      ] Parameters/TestRpc.TestCancellationAsync/SSL_UnixSocket
I20260928 02:37:22.160496  1206 acceptor_pool.cc:254] collecting diagnostics on the listening RPC socket unix:/tmp/dist-test-taskS7b718/test-tmp/rpc-test-4da01bd54f624539b10bf9b9039b9d02.sock every 8 connection(s)
I20260928 02:37:22.160539  1207 acceptor_pool.cc:254] collecting diagnostics on the listening RPC socket unix:/tmp/dist-test-taskS7b718/test-tmp/rpc-test-4da01bd54f624539b10bf9b9039b9d02.sock every 8 connection(s)
I20260928 02:37:22.160756   774 rpc-test.cc:1716] Connecting to unix:/tmp/dist-test-taskS7b718/test-tmp/rpc-test-4da01bd54f624539b10bf9b9039b9d02.sock
I20260928 02:37:22.167738   774 test_util.cc:268] Using random seed: -233600073
I20260928 02:37:22.181605  1210 rpc-test-base.h:240] got call: sleep_micros: 500 pattern: 4294967295 num_repetitions: 2097152 sidecar_idx: 0
I20260928 02:37:22.193238  1210 rpc-test-base.h:240] got call: sleep_micros: 500 pattern: 4294967295 num_repetitions: 2097152 sidecar_idx: 0
I20260928 02:37:22.204519  1210 rpc-test-base.h:240] got call: sleep_micros: 500 pattern: 4294967295 num_repetitions: 2097152 sidecar_idx: 0
I20260928 02:37:22.215170  1210 rpc-test-base.h:240] got call: sleep_micros: 500 pattern: 4294967295 num_repetitions: 2097152 sidecar_idx: 0
I20260928 02:37:22.225651  1210 rpc-test-base.h:240] got call: sleep_micros: 500 pattern: 4294967295 num_repetitions: 2097152 sidecar_idx: 0
I20260928 02:37:22.236410  1210 rpc-test-base.h:240] got call: sleep_micros: 500 pattern: 4294967295 num_repetitions: 2097152 sidecar_idx: 0
I20260928 02:37:22.246938  1210 rpc-test-base.h:240] got call: sleep_micros: 500 pattern: 4294967295 num_repetitions: 2097152 sidecar_idx: 0
I20260928 02:37:22.258515  1210 rpc-test-base.h:240] got call: sleep_micros: 500 pattern: 4294967295 num_repetitions: 2097152 sidecar_idx: 0
W20260928 02:37:22.260136  1203 connection.cc:196] Error closing socket: Network error: TlsSocket::Close: Broken pipe
W20260928 02:37:22.261929  1203 connection.cc:441] server connection from unix:<unnamed> torn down before Call kudu.rpc.GenericCalculatorService.SleepWithSidecar from unix:<unnamed> (request call id 9) could send its response
[       OK ] Parameters/TestRpc.TestCancellationAsync/SSL_UnixSocket (112 ms)
[ RUN      ] Parameters/TestRpc.TestPerformanceBySocketType/SSL_UnixSocket
I20260928 02:37:22.274389  1231 acceptor_pool.cc:254] collecting diagnostics on the listening RPC socket unix:/tmp/dist-test-taskS7b718/test-tmp/rpc-test-ae6903a7f5164bea9f121e19ecce4e4c.sock every 8 connection(s)
I20260928 02:37:22.274416  1232 acceptor_pool.cc:254] collecting diagnostics on the listening RPC socket unix:/tmp/dist-test-taskS7b718/test-tmp/rpc-test-ae6903a7f5164bea9f121e19ecce4e4c.sock every 8 connection(s)
I20260928 02:37:22.274592   774 rpc-test.cc:1846] Connecting to unix:/tmp/dist-test-taskS7b718/test-tmp/rpc-test-ae6903a7f5164bea9f121e19ecce4e4c.sock
I20260928 02:37:23.569315   774 rpc-test.cc:1859] Sending 1024MB via ssl-enabled unix socket: real 1.284s	user 1.433s	sys 0.866s
I20260928 02:37:24.881238   774 rpc-test.cc:1859] Sending 1024MB via ssl-enabled unix socket: real 1.312s	user 1.417s	sys 0.934s
I20260928 02:37:26.159842   774 rpc-test.cc:1859] Sending 1024MB via ssl-enabled unix socket: real 1.279s	user 1.352s	sys 0.933s
I20260928 02:37:27.462946   774 rpc-test.cc:1859] Sending 1024MB via ssl-enabled unix socket: real 1.303s	user 1.317s	sys 0.999s
I20260928 02:37:28.729975   774 rpc-test.cc:1859] Sending 1024MB via ssl-enabled unix socket: real 1.267s	user 1.353s	sys 0.918s
W20260928 02:37:28.730726  1228 connection.cc:196] Error closing socket: Network error: TlsSocket::Close: Broken pipe
[       OK ] Parameters/TestRpc.TestPerformanceBySocketType/SSL_UnixSocket (6468 ms)
[----------] 20 tests from Parameters/TestRpc (26691 ms total)

[----------] 1 test from Parameters/TestRpcSocketTxRxQueue
[ RUN      ] Parameters/TestRpcSocketTxRxQueue.AcceptorRxQueueSizeMetric/0
I20260928 02:37:28.736608  1256 acceptor_pool.cc:254] collecting diagnostics on the listening RPC socket 0.0.0.0:34903 every 1 connection(s)
I20260928 02:37:28.736658  1257 acceptor_pool.cc:254] collecting diagnostics on the listening RPC socket 0.0.0.0:34903 every 1 connection(s)
W20260928 02:37:28.737241  1252 negotiation.cc:337] Failed RPC negotiation. Trace:
0928 02:37:28.737071 (+     0us) reactor.cc:625] Submitting negotiation task for server connection from 127.0.0.1:59376 (local address 127.0.0.1:34903)
0928 02:37:28.737140 (+    69us) server_negotiation.cc:206] Beginning negotiation
0928 02:37:28.737142 (+     2us) server_negotiation.cc:399] Waiting for connection header
0928 02:37:28.737214 (+    72us) negotiation.cc:327] Negotiation complete: Network error: Server connection negotiation failed: server connection from 127.0.0.1:59376: BlockingRecv error: recv got EOF from 127.0.0.1:59376 (error 108)
Metrics: {"server-negotiator.queue_time_us":38}
[       OK ] Parameters/TestRpcSocketTxRxQueue.AcceptorRxQueueSizeMetric/0 (7 ms)
[----------] 1 test from Parameters/TestRpcSocketTxRxQueue (7 ms total)

[----------] Global test environment tear-down
[==========] 21 tests from 2 test suites ran. (26699 ms total)
[  PASSED  ] 20 tests.
[  FAILED  ] 1 test, listed below:
[  FAILED  ] Parameters/TestRpc.TestCallWithChainCertAndChainCA/SSL_UnixSocket, where GetParam() = (true, true)

 1 FAILED TEST