Diagnosed failure

Parameters/TestRpc.TestCallWithChainCertAndRootCA/SSL_TCP: /data0/somelongdirectorytoavoidrpathissues/src/kudu/src/kudu/rpc/rpc-test.cc:303: Failure
Failed
Bad status: Runtime error: could not verify certificate chain (error with cert: subject=CN = localhost, ST = sadfjas, C = AS, emailAddress = sdflkdsajf, O = lskdfjlsad, OU = sldfkja, issuer=C = AS, ST = ASDfkjdhf, L = lskdjf, O = saldfja, OU = skdjf, CN = localhost, emailAddress = sadjflkadsj): : certificate has expired
Google Test trace:
/data0/somelongdirectorytoavoidrpathissues/src/kudu/src/kudu/rpc/rpc-test.cc:300: Connecting to 0.0.0.0:36901
I20260926 22:06:00.506315  5791 test_util.cc:175] -----------------------------------------------
I20260926 22:06:00.506680  5791 test_util.cc:176] Had fatal failures, leaving test files at /tmp/dist-test-task1aCsbF/test-tmp/rpc-test.1.Parameters_TestRpc.TestCallWithChainCertAndRootCA_SSL_TCP.1790460359017420-5791-0

Full log

Note: This is test shard 2 of 8.
[==========] Running 21 tests from 2 test suites.
[----------] Global test environment set-up.
[----------] 1 test from TestRpc
[ RUN      ] TestRpc.TestMethodsByName
[       OK ] TestRpc.TestMethodsByName (7 ms)
[----------] 1 test from TestRpc (8 ms total)

[----------] 20 tests from Parameters/TestRpc
[ RUN      ] Parameters/TestRpc.TestAcceptorPoolStartStop/SSL_TCP
WARNING: Logging before InitGoogleLogging() is written to STDERR
I20260926 22:05:59.129361  5806 acceptor_pool.cc:254] collecting diagnostics on the listening RPC socket 0.0.0.0:46081 every 8 connection(s)
I20260926 22:05:59.131038  5807 acceptor_pool.cc:254] collecting diagnostics on the listening RPC socket 0.0.0.0:46081 every 8 connection(s)
I20260926 22:06:00.241039  5818 acceptor_pool.cc:254] collecting diagnostics on the listening RPC socket 0.0.0.0:38471 every 8 connection(s)
I20260926 22:06:00.242434  5819 acceptor_pool.cc:254] collecting diagnostics on the listening RPC socket 0.0.0.0:38471 every 8 connection(s)
I20260926 22:06:00.271816  5829 acceptor_pool.cc:254] collecting diagnostics on the listening RPC socket 0.0.0.0:39367 every 8 connection(s)
I20260926 22:06:00.273334  5830 acceptor_pool.cc:254] collecting diagnostics on the listening RPC socket 0.0.0.0:39367 every 8 connection(s)
I20260926 22:06:00.306321  5840 acceptor_pool.cc:254] collecting diagnostics on the listening RPC socket 0.0.0.0:35829 every 8 connection(s)
I20260926 22:06:00.307063  5841 acceptor_pool.cc:254] collecting diagnostics on the listening RPC socket 0.0.0.0:35829 every 8 connection(s)
I20260926 22:06:00.329083  5851 acceptor_pool.cc:254] collecting diagnostics on the listening RPC socket 0.0.0.0:38575 every 8 connection(s)
I20260926 22:06:00.329813  5852 acceptor_pool.cc:254] collecting diagnostics on the listening RPC socket 0.0.0.0:38575 every 8 connection(s)
[       OK ] Parameters/TestRpc.TestAcceptorPoolStartStop/SSL_TCP (1251 ms)
[ RUN      ] Parameters/TestRpc.TestCall/SSL_TCP
I20260926 22:06:00.370529  5864 acceptor_pool.cc:254] collecting diagnostics on the listening RPC socket 0.0.0.0:44825 every 8 connection(s)
I20260926 22:06:00.372726  5865 acceptor_pool.cc:254] collecting diagnostics on the listening RPC socket 0.0.0.0:44825 every 8 connection(s)
I20260926 22:06:00.378101  5791 rpc-test.cc:234] Connecting to 0.0.0.0:44825
[       OK ] Parameters/TestRpc.TestCall/SSL_TCP (125 ms)
[ RUN      ] Parameters/TestRpc.TestCallWithChainCertAndRootCA/SSL_TCP
I20260926 22:06:00.480661  5889 acceptor_pool.cc:254] collecting diagnostics on the listening RPC socket 0.0.0.0:36901 every 8 connection(s)
I20260926 22:06:00.481411  5890 acceptor_pool.cc:254] collecting diagnostics on the listening RPC socket 0.0.0.0:36901 every 8 connection(s)
/data0/somelongdirectorytoavoidrpathissues/src/kudu/src/kudu/rpc/rpc-test.cc:303: Failure
Failed
Bad status: Runtime error: could not verify certificate chain (error with cert: subject=CN = localhost, ST = sadfjas, C = AS, emailAddress = sdflkdsajf, O = lskdfjlsad, OU = sldfkja, issuer=C = AS, ST = ASDfkjdhf, L = lskdjf, O = saldfja, OU = skdjf, CN = localhost, emailAddress = sadjflkadsj): : certificate has expired
Google Test trace:
/data0/somelongdirectorytoavoidrpathissues/src/kudu/src/kudu/rpc/rpc-test.cc:300: Connecting to 0.0.0.0:36901
I20260926 22:06:00.506315  5791 test_util.cc:175] -----------------------------------------------
I20260926 22:06:00.506680  5791 test_util.cc:176] Had fatal failures, leaving test files at /tmp/dist-test-task1aCsbF/test-tmp/rpc-test.1.Parameters_TestRpc.TestCallWithChainCertAndRootCA_SSL_TCP.1790460359017420-5791-0
[  FAILED  ] Parameters/TestRpc.TestCallWithChainCertAndRootCA/SSL_TCP, where GetParam() = (true, false) (47 ms)
[ RUN      ] Parameters/TestRpc.TestCallWithBadPasswordProtectedKey/SSL_TCP
[       OK ] Parameters/TestRpc.TestCallWithBadPasswordProtectedKey/SSL_TCP (34 ms)
[ RUN      ] Parameters/TestRpc.TestInvalidMethodCall/SSL_TCP
I20260926 22:06:00.576426  5926 acceptor_pool.cc:254] collecting diagnostics on the listening RPC socket 0.0.0.0:33567 every 8 connection(s)
I20260926 22:06:00.577359  5927 acceptor_pool.cc:254] collecting diagnostics on the listening RPC socket 0.0.0.0:33567 every 8 connection(s)
I20260926 22:06:00.581300  5791 rpc-test.cc:406] Connecting to 0.0.0.0:33567
[       OK ] Parameters/TestRpc.TestInvalidMethodCall/SSL_TCP (89 ms)
[ RUN      ] Parameters/TestRpc.TestHighFDs/SSL_TCP
I20260926 22:06:00.854591  5951 acceptor_pool.cc:254] collecting diagnostics on the listening RPC socket 0.0.0.0:37267 every 8 connection(s)
I20260926 22:06:00.855392  5952 acceptor_pool.cc:254] collecting diagnostics on the listening RPC socket 0.0.0.0:37267 every 8 connection(s)
[       OK ] Parameters/TestRpc.TestHighFDs/SSL_TCP (284 ms)
[ RUN      ] Parameters/TestRpc.TestConnectionAlwaysKeepalive/SSL_TCP
I20260926 22:06:00.942994  5974 acceptor_pool.cc:254] collecting diagnostics on the listening RPC socket 0.0.0.0:42259 every 8 connection(s)
I20260926 22:06:00.943753  5975 acceptor_pool.cc:254] collecting diagnostics on the listening RPC socket 0.0.0.0:42259 every 8 connection(s)
I20260926 22:06:00.947876  5791 rpc-test.cc:532] Connecting to 0.0.0.0:42259
[       OK ] Parameters/TestRpc.TestConnectionAlwaysKeepalive/SSL_TCP (3078 ms)
[ RUN      ] Parameters/TestRpc.TestReopenOutboundConnections/SSL_TCP
I20260926 22:06:04.021093  5997 acceptor_pool.cc:254] collecting diagnostics on the listening RPC socket 0.0.0.0:32847 every 8 connection(s)
I20260926 22:06:04.021894  5998 acceptor_pool.cc:254] collecting diagnostics on the listening RPC socket 0.0.0.0:32847 every 8 connection(s)
I20260926 22:06:04.025750  5791 rpc-test.cc:658] Connecting to 0.0.0.0:32847
[       OK ] Parameters/TestRpc.TestReopenOutboundConnections/SSL_TCP (474 ms)
[ RUN      ] Parameters/TestRpc.TestConnectionNetworkPlane/SSL_TCP
I20260926 22:06:04.502585  6020 acceptor_pool.cc:254] collecting diagnostics on the listening RPC socket 0.0.0.0:35515 every 8 connection(s)
I20260926 22:06:04.503319  6021 acceptor_pool.cc:254] collecting diagnostics on the listening RPC socket 0.0.0.0:35515 every 8 connection(s)
I20260926 22:06:04.506834  5791 rpc-test.cc:772] Connecting to 0.0.0.0:35515
[       OK ] Parameters/TestRpc.TestConnectionNetworkPlane/SSL_TCP (93 ms)
[ RUN      ] Parameters/TestRpc.TestTCPKeepalive/SSL_TCP
I20260926 22:06:04.583312  6045 acceptor_pool.cc:254] collecting diagnostics on the listening RPC socket 0.0.0.0:35397 every 8 connection(s)
I20260926 22:06:04.584306  6046 acceptor_pool.cc:254] collecting diagnostics on the listening RPC socket 0.0.0.0:35397 every 8 connection(s)
I20260926 22:06:04.614574  6049 rpc-test-base.h:222] got call: sleep_micros: 8000000 deferred: true
I20260926 22:06:12.619097  6049 rpcz_store.cc:275] Call kudu.rpc.GenericCalculatorService.Sleep from 127.0.0.1:53958 (request call id 0) took 8004 ms. Trace:
I20260926 22:06:12.619555  6049 rpcz_store.cc:276] 0926 22:06:04.614253 (+     0us) service_pool.cc:170] Inserting onto call queue
0926 22:06:04.614403 (+   150us) service_pool.cc:227] Handling call
0926 22:06:12.618915 (+8004512us) inbound_call.cc:173] Queueing success response
Metrics: {}
[       OK ] Parameters/TestRpc.TestTCPKeepalive/SSL_TCP (8073 ms)
[ RUN      ] Parameters/TestRpc.TestMaxSmallSidecars/SSL_TCP
I20260926 22:06:12.676574  6071 acceptor_pool.cc:254] collecting diagnostics on the listening RPC socket 0.0.0.0:45561 every 8 connection(s)
I20260926 22:06:12.677335  6072 acceptor_pool.cc:254] collecting diagnostics on the listening RPC socket 0.0.0.0:45561 every 8 connection(s)
[       OK ] Parameters/TestRpc.TestMaxSmallSidecars/SSL_TCP (232 ms)
[ RUN      ] Parameters/TestRpc.TestCallTimeout/SSL_TCP
I20260926 22:06:12.887223  6096 acceptor_pool.cc:254] collecting diagnostics on the listening RPC socket 0.0.0.0:45771 every 8 connection(s)
I20260926 22:06:12.887975  6097 acceptor_pool.cc:254] collecting diagnostics on the listening RPC socket 0.0.0.0:45771 every 8 connection(s)
I20260926 22:06:12.914182  5791 rpc-test-base.h:595] status: Timed out: connection negotiation to 0.0.0.0:45771 for RPC Sleep timed out after 0.000s (ON_OUTBOUND_QUEUE), seconds elapsed: 0.00292511
I20260926 22:06:12.923789  6100 rpc-test-base.h:222] got call: sleep_micros: 700000
I20260926 22:06:13.115576  5791 rpc-test-base.h:595] status: Timed out: Sleep RPC to 0.0.0.0:45771 timed out after 0.200s (SENT), seconds elapsed: 0.200981
I20260926 22:06:13.117601  6099 rpc-test-base.h:222] got call: sleep_micros: 2000000
W20260926 22:06:13.624727  6100 rpcz_store.cc:267] Call kudu.rpc.GenericCalculatorService.Sleep from 127.0.0.1:48826 (request call id 1) took 701 ms (client timeout 200 ms). Trace:
W20260926 22:06:13.625074  6100 rpcz_store.cc:269] 0926 22:06:12.923480 (+     0us) service_pool.cc:170] Inserting onto call queue
0926 22:06:12.923686 (+   206us) service_pool.cc:227] Handling call
0926 22:06:13.624657 (+700971us) inbound_call.cc:173] Queueing success response
Metrics: {}
I20260926 22:06:14.617769  5791 rpc-test-base.h:595] status: Timed out: Sleep RPC to 0.0.0.0:45771 timed out after 1.500s (SENT), seconds elapsed: 1.50173
W20260926 22:06:15.118281  6099 rpcz_store.cc:267] Call kudu.rpc.GenericCalculatorService.Sleep from 127.0.0.1:48826 (request call id 2) took 2001 ms (client timeout 1500 ms). Trace:
W20260926 22:06:15.118608  6099 rpcz_store.cc:269] 0926 22:06:13.117220 (+     0us) service_pool.cc:170] Inserting onto call queue
0926 22:06:13.117423 (+   203us) service_pool.cc:227] Handling call
0926 22:06:15.118221 (+2000798us) inbound_call.cc:173] Queueing success response
Metrics: {}
W20260926 22:06:15.119334  6095 connection.cc:441] server connection from 127.0.0.1:48826 torn down before Call kudu.rpc.GenericCalculatorService.Sleep from 127.0.0.1:48826 (request call id 2) could send its response
[       OK ] Parameters/TestRpc.TestCallTimeout/SSL_TCP (2256 ms)
[ RUN      ] Parameters/TestRpc.TestServerShutsDown/SSL_TCP
I20260926 22:06:15.127640  5791 rpc-test.cc:1125] Connecting to 0.0.0.0:40195
W20260926 22:06:15.138581  6113 negotiation.cc:337] Failed RPC negotiation. Trace:
0926 22:06:15.136729 (+     0us) reactor.cc:625] Submitting negotiation task for client connection to 0.0.0.0:40195 (local address 127.0.0.1:45250)
0926 22:06:15.137342 (+   613us) negotiation.cc:107] Waiting for socket to connect
0926 22:06:15.137383 (+    41us) client_negotiation.cc:174] Beginning negotiation
0926 22:06:15.137689 (+   306us) client_negotiation.cc:252] Sending NEGOTIATE NegotiatePB request
0926 22:06:15.137952 (+   263us) negotiation.cc:327] Negotiation complete: Network error: Client connection negotiation failed: client connection to 0.0.0.0:40195: BlockingWrite error: write error: Broken pipe (error 32)
Metrics: {"client-negotiator.queue_time_us":176}
[       OK ] Parameters/TestRpc.TestServerShutsDown/SSL_TCP (15 ms)
[ RUN      ] Parameters/TestRpc.TimedOutOnResponseMetric/SSL_TCP
I20260926 22:06:15.161934  6130 acceptor_pool.cc:254] collecting diagnostics on the listening RPC socket 0.0.0.0:36305 every 8 connection(s)
I20260926 22:06:15.162672  6131 acceptor_pool.cc:254] collecting diagnostics on the listening RPC socket 0.0.0.0:36305 every 8 connection(s)
W20260926 22:06:15.416493  6134 rpcz_store.cc:267] Call kudu.rpc_test.CalculatorService.Sleep from 127.0.0.1:60832 (request call id 3) took 50 ms (client timeout 25 ms). Trace:
W20260926 22:06:15.416920  6134 rpcz_store.cc:269] 0926 22:06:15.365688 (+     0us) service_pool.cc:170] Inserting onto call queue
0926 22:06:15.365877 (+   189us) service_pool.cc:227] Handling call
0926 22:06:15.416372 (+ 50495us) inbound_call.cc:173] Queueing success response
Related trace 'test_child':
Metrics: {"test_sleep_us":50000,"child_traces":[["test_child",{"related_trace_metric":1}]]}
W20260926 22:06:15.476668  6134 rpcz_store.cc:267] Call kudu.rpc_test.CalculatorService.Sleep from 127.0.0.1:60832 (request call id 4) took 50 ms (client timeout 50 ms). Trace:
W20260926 22:06:15.477119  6134 rpcz_store.cc:269] 0926 22:06:15.425912 (+     0us) service_pool.cc:170] Inserting onto call queue
0926 22:06:15.426082 (+   170us) service_pool.cc:227] Handling call
0926 22:06:15.476571 (+ 50489us) inbound_call.cc:173] Queueing success response
Related trace 'test_child':
Metrics: {"test_sleep_us":50000,"child_traces":[["test_child",{"related_trace_metric":1}]]}
[       OK ] Parameters/TestRpc.TimedOutOnResponseMetric/SSL_TCP (345 ms)
[ RUN      ] Parameters/TestRpc.AcceptorDispatchingTimesMetric/SSL_TCP
I20260926 22:06:15.500733  6155 acceptor_pool.cc:254] collecting diagnostics on the listening RPC socket 0.0.0.0:33563 every 8 connection(s)
I20260926 22:06:15.501609  6156 acceptor_pool.cc:254] collecting diagnostics on the listening RPC socket 0.0.0.0:33563 every 8 connection(s)
W20260926 22:06:15.507480  6151 negotiation.cc:337] Failed RPC negotiation. Trace:
0926 22:06:15.506207 (+     0us) reactor.cc:625] Submitting negotiation task for server connection from 127.0.0.1:42138 (local address 127.0.0.1:33563)
0926 22:06:15.506649 (+   442us) server_negotiation.cc:206] Beginning negotiation
0926 22:06:15.506668 (+    19us) server_negotiation.cc:399] Waiting for connection header
0926 22:06:15.506939 (+   271us) negotiation.cc:327] Negotiation complete: Network error: Server connection negotiation failed: server connection from 127.0.0.1:42138: BlockingRecv error: recv got EOF from 127.0.0.1:42138 (error 108)
Metrics: {"server-negotiator.queue_time_us":118}
[       OK ] Parameters/TestRpc.AcceptorDispatchingTimesMetric/SSL_TCP (26 ms)
[ RUN      ] Parameters/TestRpc.TestRpcCallbackDestroysMessenger/SSL_TCP
[       OK ] Parameters/TestRpc.TestRpcCallbackDestroysMessenger/SSL_TCP (34 ms)
[ RUN      ] Parameters/TestRpc.TestApplicationFeatureFlag/SSL_TCP
I20260926 22:06:15.567889  6180 acceptor_pool.cc:254] collecting diagnostics on the listening RPC socket 0.0.0.0:37335 every 8 connection(s)
I20260926 22:06:15.568625  6181 acceptor_pool.cc:254] collecting diagnostics on the listening RPC socket 0.0.0.0:37335 every 8 connection(s)
W20260926 22:06:15.606783  6179 messenger.cc:357] Unable to handle RPC call: Not implemented: call requires unsupported application feature flags: 99
[       OK ] Parameters/TestRpc.TestApplicationFeatureFlag/SSL_TCP (69 ms)
[ RUN      ] Parameters/TestRpc.TestCancellation/SSL_TCP
I20260926 22:06:15.645078  6205 acceptor_pool.cc:254] collecting diagnostics on the listening RPC socket 0.0.0.0:38387 every 8 connection(s)
I20260926 22:06:15.645758  6206 acceptor_pool.cc:254] collecting diagnostics on the listening RPC socket 0.0.0.0:38387 every 8 connection(s)
I20260926 22:06:15.649086  5791 rpc-test.cc:1648] Connecting to 0.0.0.0:38387
I20260926 22:06:15.775831  5791 rpc-test-base.h:595] status: Aborted: Sleep RPC to 0.0.0.0:38387 is cancelled in state READY, seconds elapsed: 0.00063037
I20260926 22:06:15.932497  5791 rpc-test-base.h:595] status: Aborted: Sleep RPC to 0.0.0.0:38387 is cancelled in state SENT, seconds elapsed: 0.00116
I20260926 22:06:15.984288  6208 rpc-test-base.h:222] got call: sleep_micros: 510000
I20260926 22:06:16.115111  5791 rpc-test-base.h:595] status: Aborted: Sleep RPC to 0.0.0.0:38387 is cancelled in state SENT, seconds elapsed: 0.0012556
I20260926 22:06:16.169618  6207 rpc-test-base.h:222] got call: sleep_micros: 510000
I20260926 22:06:16.296579  5791 rpc-test-base.h:595] status: Aborted: Sleep RPC to 0.0.0.0:38387 is cancelled in state SENT, seconds elapsed: 0.0010232
W20260926 22:06:16.341271  6209 rpcz_store.cc:267] Call kudu.rpc.GenericCalculatorService.Sleep from 127.0.0.1:41402 (request call id 11) took 17 ms (client timeout 10 ms). Trace:
W20260926 22:06:16.341634  6209 rpcz_store.cc:269] 0926 22:06:16.324147 (+     0us) service_pool.cc:170] Inserting onto call queue
0926 22:06:16.340994 (+ 16847us) service_pool.cc:214] Skipping call since client already timed out
0926 22:06:16.341097 (+   103us) inbound_call.cc:173] Queueing failure response
Metrics: {}
I20260926 22:06:16.342217  6209 rpc-test-base.h:222] got call: sleep_micros: 1500000
W20260926 22:06:16.495287  6208 rpcz_store.cc:267] Call kudu.rpc.GenericCalculatorService.Sleep from 127.0.0.1:41402 (request call id 3) took 511 ms (client timeout 10 ms). Trace:
W20260926 22:06:16.495683  6208 rpcz_store.cc:269] 0926 22:06:15.983852 (+     0us) service_pool.cc:170] Inserting onto call queue
0926 22:06:15.984146 (+   294us) service_pool.cc:227] Handling call
0926 22:06:16.495211 (+511065us) inbound_call.cc:173] Queueing success response
Metrics: {}
W20260926 22:06:16.680559  6207 rpcz_store.cc:267] Call kudu.rpc.GenericCalculatorService.Sleep from 127.0.0.1:41402 (request call id 7) took 511 ms (client timeout 10 ms). Trace:
W20260926 22:06:16.681033  6207 rpcz_store.cc:269] 0926 22:06:16.169258 (+     0us) service_pool.cc:170] Inserting onto call queue
0926 22:06:16.169511 (+   253us) service_pool.cc:227] Handling call
0926 22:06:16.680485 (+510974us) inbound_call.cc:173] Queueing success response
Metrics: {}
I20260926 22:06:17.298907  5791 rpc-test-base.h:595] status: Timed out: Sleep RPC to 0.0.0.0:38387 timed out after 1.000s (SENT), seconds elapsed: 1.0019
I20260926 22:06:17.300583  6207 rpc-test-base.h:222] got call: sleep_micros: 1500000
W20260926 22:06:17.842777  6209 rpcz_store.cc:267] Call kudu.rpc.GenericCalculatorService.Sleep from 127.0.0.1:41402 (request call id 12) took 1518 ms (client timeout 1000 ms). Trace:
W20260926 22:06:17.843120  6209 rpcz_store.cc:269] 0926 22:06:16.324525 (+     0us) service_pool.cc:170] Inserting onto call queue
0926 22:06:16.342172 (+ 17647us) service_pool.cc:227] Handling call
0926 22:06:17.842720 (+1500548us) inbound_call.cc:173] Queueing success response
Metrics: {}
I20260926 22:06:18.301924  5791 rpc-test-base.h:595] status: Timed out: Sleep RPC to 0.0.0.0:38387 timed out after 1.000s (SENT), seconds elapsed: 1.00262
W20260926 22:06:18.303637  6204 messenger.cc:357] Unable to handle RPC call: Not implemented: call requires unsupported application feature flags: 99, 1
W20260926 22:06:18.305476  6204 messenger.cc:357] Unable to handle RPC call: Not implemented: call requires unsupported application feature flags: 99, 1
W20260926 22:06:18.801254  6207 rpcz_store.cc:267] Call kudu.rpc.GenericCalculatorService.Sleep from 127.0.0.1:41402 (request call id 13) took 1501 ms (client timeout 1000 ms). Trace:
W20260926 22:06:18.801651  6207 rpcz_store.cc:269] 0926 22:06:17.300344 (+     0us) service_pool.cc:170] Inserting onto call queue
0926 22:06:17.300518 (+   174us) service_pool.cc:227] Handling call
0926 22:06:18.801178 (+1500660us) inbound_call.cc:173] Queueing success response
Metrics: {}
W20260926 22:06:18.802469  6204 connection.cc:441] server connection from 127.0.0.1:41402 torn down before Call kudu.rpc.GenericCalculatorService.Sleep from 127.0.0.1:41402 (request call id 13) could send its response
[       OK ] Parameters/TestRpc.TestCancellation/SSL_TCP (3192 ms)
[ RUN      ] Parameters/TestRpc.TestCancellationMultiThreads/SSL_TCP
I20260926 22:06:18.844403  6230 acceptor_pool.cc:254] collecting diagnostics on the listening RPC socket 0.0.0.0:42651 every 8 connection(s)
I20260926 22:06:18.845016  6231 acceptor_pool.cc:254] collecting diagnostics on the listening RPC socket 0.0.0.0:42651 every 8 connection(s)
I20260926 22:06:18.849560  5791 rpc-test.cc:1808] Connecting to 0.0.0.0:42651
I20260926 22:06:19.013821  6244 test_util.cc:268] Using random seed: 182461082
I20260926 22:06:19.015079  6245 test_util.cc:268] Using random seed: 182462341
I20260926 22:06:19.017014  6246 test_util.cc:268] Using random seed: 182464281
I20260926 22:06:19.018970  6247 test_util.cc:268] Using random seed: 182466175
I20260926 22:06:19.021710  6248 test_util.cc:268] Using random seed: 182468693
I20260926 22:06:19.024143  6249 test_util.cc:268] Using random seed: 182471199
I20260926 22:06:19.026160  6250 test_util.cc:268] Using random seed: 182473270
I20260926 22:06:19.028596  6251 test_util.cc:268] Using random seed: 182475393
I20260926 22:06:19.030377  6252 test_util.cc:268] Using random seed: 182477495
I20260926 22:06:19.032256  6253 test_util.cc:268] Using random seed: 182479310
I20260926 22:06:19.034215  6254 test_util.cc:268] Using random seed: 182481296
I20260926 22:06:19.035856  6255 test_util.cc:268] Using random seed: 182482960
I20260926 22:06:19.038491  6256 test_util.cc:268] Using random seed: 182485581
I20260926 22:06:19.040565  6257 test_util.cc:268] Using random seed: 182487602
I20260926 22:06:19.042346  6258 test_util.cc:268] Using random seed: 182489426
I20260926 22:06:19.044108  6259 test_util.cc:268] Using random seed: 182491206
I20260926 22:06:19.047283  6260 test_util.cc:268] Using random seed: 182494359
I20260926 22:06:19.049727  6261 test_util.cc:268] Using random seed: 182496778
I20260926 22:06:19.051975  6262 test_util.cc:268] Using random seed: 182499040
I20260926 22:06:19.054184  6263 test_util.cc:268] Using random seed: 182501150
I20260926 22:06:19.057034  6264 test_util.cc:268] Using random seed: 182504126
I20260926 22:06:19.059063  6265 test_util.cc:268] Using random seed: 182506150
I20260926 22:06:19.061654  6266 test_util.cc:268] Using random seed: 182508761
I20260926 22:06:19.067230  6268 test_util.cc:268] Using random seed: 182514250
I20260926 22:06:19.065032  6267 test_util.cc:268] Using random seed: 182511938
I20260926 22:06:19.073770  6270 test_util.cc:268] Using random seed: 182520869
I20260926 22:06:19.074579  6269 test_util.cc:268] Using random seed: 182521574
I20260926 22:06:19.076321  6271 test_util.cc:268] Using random seed: 182523295
I20260926 22:06:19.084794  6272 test_util.cc:268] Using random seed: 182531795
I20260926 22:06:19.096824  6273 test_util.cc:268] Using random seed: 182543906
[       OK ] Parameters/TestRpc.TestCancellationMultiThreads/SSL_TCP (19155 ms)
[ RUN      ] Parameters/TestRpc.TestCallId/SSL_TCP
I20260926 22:06:37.992429  6287 acceptor_pool.cc:254] collecting diagnostics on the listening RPC socket 0.0.0.0:35419 every 8 connection(s)
I20260926 22:06:37.993209  6288 acceptor_pool.cc:254] collecting diagnostics on the listening RPC socket 0.0.0.0:35419 every 8 connection(s)
[       OK ] Parameters/TestRpc.TestCallId/SSL_TCP (95 ms)
[----------] 20 tests from Parameters/TestRpc (38979 ms total)

[----------] Global test environment tear-down
[==========] 21 tests from 2 test suites ran. (38988 ms total)
[  PASSED  ] 20 tests.
[  FAILED  ] 1 test, listed below:
[  FAILED  ] Parameters/TestRpc.TestCallWithChainCertAndRootCA/SSL_TCP, where GetParam() = (true, false)

 1 FAILED TEST