Diagnosed failure

Parameters/TestRpc.TestCallWithChainCertAndChainCA/SSL_TCP: /data0/somelongdirectorytoavoidrpathissues/src/kudu/src/kudu/rpc/rpc-test.cc:270: Failure
Failed
Bad status: Runtime error: could not verify certificate chain (error with cert: subject=CN = localhost, ST = sadfjas, C = AS, emailAddress = sdflkdsajf, O = lskdfjlsad, OU = sldfkja, issuer=C = AS, ST = ASDfkjdhf, L = lskdjf, O = saldfja, OU = skdjf, CN = localhost, emailAddress = sadjflkadsj): : certificate has expired
Google Test trace:
/data0/somelongdirectorytoavoidrpathissues/src/kudu/src/kudu/rpc/rpc-test.cc:267: Connecting to 0.0.0.0:35363
I20260925 19:01:08.963706  4949 test_util.cc:175] -----------------------------------------------
I20260925 19:01:08.963780  4949 test_util.cc:176] Had fatal failures, leaving test files at /tmp/dist-test-taskASCNil/test-tmp/rpc-test.5.Parameters_TestRpc.TestCallWithChainCertAndChainCA_SSL_TCP.1790362868888978-4949-0

Full log

Note: This is test shard 6 of 8.
[==========] Running 21 tests from 2 test suites.
[----------] Global test environment set-up.
[----------] 20 tests from Parameters/TestRpc
[ RUN      ] Parameters/TestRpc.TestMessengerCreateDestroy/SSL_TCP
WARNING: Logging before InitGoogleLogging() is written to STDERR
I20260925 19:01:08.923671  4949 rpc-test.cc:169] started messenger TestCreateDestroy
[       OK ] Parameters/TestRpc.TestMessengerCreateDestroy/SSL_TCP (33 ms)
[ RUN      ] Parameters/TestRpc.TestNegotiationDeadlock/SSL_TCP
I20260925 19:01:08.941854  4970 acceptor_pool.cc:254] collecting diagnostics on the listening RPC socket 0.0.0.0:38375 every 8 connection(s)
I20260925 19:01:08.941857  4969 acceptor_pool.cc:254] collecting diagnostics on the listening RPC socket 0.0.0.0:38375 every 8 connection(s)
[       OK ] Parameters/TestRpc.TestNegotiationDeadlock/SSL_TCP (24 ms)
[ RUN      ] Parameters/TestRpc.TestCallWithChainCertAndChainCA/SSL_TCP
I20260925 19:01:08.959034  4985 acceptor_pool.cc:254] collecting diagnostics on the listening RPC socket 0.0.0.0:35363 every 8 connection(s)
I20260925 19:01:08.959062  4986 acceptor_pool.cc:254] collecting diagnostics on the listening RPC socket 0.0.0.0:35363 every 8 connection(s)
/data0/somelongdirectorytoavoidrpathissues/src/kudu/src/kudu/rpc/rpc-test.cc:270: Failure
Failed
Bad status: Runtime error: could not verify certificate chain (error with cert: subject=CN = localhost, ST = sadfjas, C = AS, emailAddress = sdflkdsajf, O = lskdfjlsad, OU = sldfkja, issuer=C = AS, ST = ASDfkjdhf, L = lskdjf, O = saldfja, OU = skdjf, CN = localhost, emailAddress = sadjflkadsj): : certificate has expired
Google Test trace:
/data0/somelongdirectorytoavoidrpathissues/src/kudu/src/kudu/rpc/rpc-test.cc:267: Connecting to 0.0.0.0:35363
I20260925 19:01:08.963706  4949 test_util.cc:175] -----------------------------------------------
I20260925 19:01:08.963780  4949 test_util.cc:176] Had fatal failures, leaving test files at /tmp/dist-test-taskASCNil/test-tmp/rpc-test.5.Parameters_TestRpc.TestCallWithChainCertAndChainCA_SSL_TCP.1790362868888978-4949-0
[  FAILED  ] Parameters/TestRpc.TestCallWithChainCertAndChainCA/SSL_TCP, where GetParam() = (true, false) (14 ms)
[ RUN      ] Parameters/TestRpc.TestCallWithPasswordProtectedKey/SSL_TCP
I20260925 19:01:08.984505  5010 acceptor_pool.cc:254] collecting diagnostics on the listening RPC socket 0.0.0.0:43497 every 8 connection(s)
I20260925 19:01:08.984548  5011 acceptor_pool.cc:254] collecting diagnostics on the listening RPC socket 0.0.0.0:43497 every 8 connection(s)
[       OK ] Parameters/TestRpc.TestCallWithPasswordProtectedKey/SSL_TCP (33 ms)
[ RUN      ] Parameters/TestRpc.TestCallToBadServer/SSL_TCP
I20260925 19:01:09.007100  4949 rpc-test.cc:394] Status: Network error: Client connection negotiation failed: client connection to 0.0.0.0:0: connect: Connection refused (error 111)
I20260925 19:01:09.007413  4949 rpc-test.cc:394] Status: Network error: Client connection negotiation failed: client connection to 0.0.0.0:0: connect: Connection refused (error 111)
I20260925 19:01:09.007671  4949 rpc-test.cc:394] Status: Network error: Client connection negotiation failed: client connection to 0.0.0.0:0: connect: Connection refused (error 111)
I20260925 19:01:09.007984  4949 rpc-test.cc:394] Status: Network error: Client connection negotiation failed: client connection to 0.0.0.0:0: connect: Connection refused (error 111)
I20260925 19:01:09.008226  4949 rpc-test.cc:394] Status: Network error: Client connection negotiation failed: client connection to 0.0.0.0:0: connect: Connection refused (error 111)
[       OK ] Parameters/TestRpc.TestCallToBadServer/SSL_TCP (11 ms)
[ RUN      ] Parameters/TestRpc.TestWrongService/SSL_TCP
I20260925 19:01:09.024528  5045 acceptor_pool.cc:254] collecting diagnostics on the listening RPC socket 0.0.0.0:45971 every 8 connection(s)
I20260925 19:01:09.024560  5046 acceptor_pool.cc:254] collecting diagnostics on the listening RPC socket 0.0.0.0:45971 every 8 connection(s)
I20260925 19:01:09.044457  5042 messenger.cc:345] service WrongServiceName not registered on TestServer
[       OK ] Parameters/TestRpc.TestWrongService/SSL_TCP (37 ms)
[ RUN      ] Parameters/TestRpc.TestConnectionKeepalive/SSL_TCP
I20260925 19:01:09.068262  5069 acceptor_pool.cc:254] collecting diagnostics on the listening RPC socket 0.0.0.0:45229 every 8 connection(s)
I20260925 19:01:09.068264  5068 acceptor_pool.cc:254] collecting diagnostics on the listening RPC socket 0.0.0.0:45229 every 8 connection(s)
I20260925 19:01:09.068514  4949 rpc-test.cc:488] Connecting to 0.0.0.0:45229
[       OK ] Parameters/TestRpc.TestConnectionKeepalive/SSL_TCP (1061 ms)
[ RUN      ] Parameters/TestRpc.TestClientConnectionMetrics/SSL_TCP
I20260925 19:01:10.121718  5093 acceptor_pool.cc:254] collecting diagnostics on the listening RPC socket 0.0.0.0:34417 every 8 connection(s)
I20260925 19:01:10.121748  5094 acceptor_pool.cc:254] collecting diagnostics on the listening RPC socket 0.0.0.0:34417 every 8 connection(s)
I20260925 19:01:10.121899  4949 rpc-test.cc:569] Connecting to 0.0.0.0:34417
[       OK ] Parameters/TestRpc.TestClientConnectionMetrics/SSL_TCP (11676 ms)
[ RUN      ] Parameters/TestRpc.TestCredentialsPolicy/SSL_TCP
I20260925 19:01:21.800098  5116 acceptor_pool.cc:254] collecting diagnostics on the listening RPC socket 0.0.0.0:33211 every 8 connection(s)
I20260925 19:01:21.800133  5117 acceptor_pool.cc:254] collecting diagnostics on the listening RPC socket 0.0.0.0:33211 every 8 connection(s)
I20260925 19:01:21.800364  4949 rpc-test.cc:700] Connecting to 0.0.0.0:33211
[       OK ] Parameters/TestRpc.TestCredentialsPolicy/SSL_TCP (37 ms)
[ RUN      ] Parameters/TestRpc.TestCallLongerThanKeepalive/SSL_TCP
I20260925 19:01:21.837759  5141 acceptor_pool.cc:254] collecting diagnostics on the listening RPC socket 0.0.0.0:37549 every 8 connection(s)
I20260925 19:01:21.837795  5142 acceptor_pool.cc:254] collecting diagnostics on the listening RPC socket 0.0.0.0:37549 every 8 connection(s)
I20260925 19:01:21.859443  5145 rpc-test-base.h:222] got call: sleep_micros: 3000000 deferred: true
I20260925 19:01:24.860206  5145 rpcz_store.cc:275] Call kudu.rpc.GenericCalculatorService.Sleep from 127.0.0.1:43114 (request call id 0) took 3000 ms. Trace:
I20260925 19:01:24.860406  5145 rpcz_store.cc:276] 0925 19:01:21.859384 (+     0us) service_pool.cc:170] Inserting onto call queue
0925 19:01:21.859424 (+    40us) service_pool.cc:227] Handling call
0925 19:01:24.860189 (+3000765us) inbound_call.cc:173] Queueing success response
Metrics: {}
[       OK ] Parameters/TestRpc.TestCallLongerThanKeepalive/SSL_TCP (3040 ms)
[ RUN      ] Parameters/TestRpc.TestRpcSidecar/SSL_TCP
I20260925 19:01:24.876180  5166 acceptor_pool.cc:254] collecting diagnostics on the listening RPC socket 0.0.0.0:32831 every 8 connection(s)
I20260925 19:01:24.876360  5167 acceptor_pool.cc:254] collecting diagnostics on the listening RPC socket 0.0.0.0:32831 every 8 connection(s)
[       OK ] Parameters/TestRpc.TestRpcSidecar/SSL_TCP (57 ms)
[ RUN      ] Parameters/TestRpc.TestRpcSidecarLimits/SSL_TCP
I20260925 19:01:26.701108  5191 acceptor_pool.cc:254] collecting diagnostics on the listening RPC socket 0.0.0.0:40389 every 8 connection(s)
I20260925 19:01:26.701129  5192 acceptor_pool.cc:254] collecting diagnostics on the listening RPC socket 0.0.0.0:40389 every 8 connection(s)
W20260925 19:01:26.722836  4949 serialization.cc:72] Serialized kudu.rpc_test.PushStringsRequestPB (2147483654 bytes) is larger than the maximum configured RPC message size (52428800 bytes). Sending anyway, but peer may reject the data.
W20260925 19:01:26.726526  5190 connection.cc:535] server connection from 127.0.0.1:39050 recv error: Network error: RPC frame had a length of 2147483714, but we only support messages up to 52428800 bytes long.
W20260925 19:01:26.726634  5190 connection.cc:158] shutting down server connection from 127.0.0.1:39050 with pending inbound data: 4/2147483714 bytes received; last active 0 ns ago: status Network error: RPC frame had a length of 2147483714, but we only support messages up to 52428800 bytes long.
W20260925 19:01:26.726920  5204 connection.cc:196] Error closing socket: Network error: TlsSocket::Close: Connection reset by peer
I20260925 19:01:26.746977  5216 acceptor_pool.cc:254] collecting diagnostics on the listening RPC socket 0.0.0.0:40479 every 8 connection(s)
I20260925 19:01:26.747052  5217 acceptor_pool.cc:254] collecting diagnostics on the listening RPC socket 0.0.0.0:40479 every 8 connection(s)
W20260925 19:01:30.664973  5215 connection.cc:577] server connection from 127.0.0.1:41284: received bad data: 'Corruption: Invalid packet: message had a length of 2147483710, but we only support messages up to 2147483647 bytes
'
[       OK ] Parameters/TestRpc.TestRpcSidecarLimits/SSL_TCP (5746 ms)
[ RUN      ] Parameters/TestRpc.TestCallTimeoutDoesntAffectNegotiation/SSL_TCP
I20260925 19:01:30.679090  5241 acceptor_pool.cc:254] collecting diagnostics on the listening RPC socket 0.0.0.0:39421 every 8 connection(s)
I20260925 19:01:30.679090  5242 acceptor_pool.cc:254] collecting diagnostics on the listening RPC socket 0.0.0.0:39421 every 8 connection(s)
W20260925 19:01:30.690719  5237 negotiation.cc:266] Injecting 500ms delay in negotiation
I20260925 19:01:30.740988  4949 rpc-test-base.h:595] status: Timed out: connection negotiation to 0.0.0.0:39421 for RPC Sleep timed out after 0.050s (ON_OUTBOUND_QUEUE), seconds elapsed: 0.0507722
[       OK ] Parameters/TestRpc.TestCallTimeoutDoesntAffectNegotiation/SSL_TCP (528 ms)
[ RUN      ] Parameters/TestRpc.TestRpcHandlerLatencyMetric/SSL_TCP
I20260925 19:01:31.235599  5266 acceptor_pool.cc:254] collecting diagnostics on the listening RPC socket 0.0.0.0:37665 every 8 connection(s)
I20260925 19:01:31.235612  5267 acceptor_pool.cc:254] collecting diagnostics on the listening RPC socket 0.0.0.0:37665 every 8 connection(s)
I20260925 19:01:31.271108  4949 rpc-test.cc:1236] Sleep() min lat: 20270
I20260925 19:01:31.271190  4949 rpc-test.cc:1237] Sleep() mean lat: 20270
I20260925 19:01:31.271217  4949 rpc-test.cc:1238] Sleep() max lat: 20270
I20260925 19:01:31.271231  4949 rpc-test.cc:1239] Sleep() #calls: 1
[       OK ] Parameters/TestRpc.TestRpcHandlerLatencyMetric/SSL_TCP (76 ms)
[ RUN      ] Parameters/TestRpc.TimedOutOnResponseMetricServiceQueue/SSL_TCP
I20260925 19:01:31.287055  5293 acceptor_pool.cc:254] collecting diagnostics on the listening RPC socket 0.0.0.0:38279 every 8 connection(s)
I20260925 19:01:31.287204  5292 acceptor_pool.cc:254] collecting diagnostics on the listening RPC socket 0.0.0.0:38279 every 8 connection(s)
W20260925 19:01:31.347719  5294 rpcz_store.cc:267] Call kudu.rpc_test.CalculatorService.Sleep from 127.0.0.1:50184 (request call id 2) took 20 ms (client timeout 20 ms). Trace:
W20260925 19:01:31.347865  5294 rpcz_store.cc:269] 0925 19:01:31.327452 (+     0us) service_pool.cc:170] Inserting onto call queue
0925 19:01:31.347689 (+ 20237us) service_pool.cc:214] Skipping call since client already timed out
0925 19:01:31.347702 (+    13us) inbound_call.cc:173] Queueing failure response
Metrics: {}
[       OK ] Parameters/TestRpc.TimedOutOnResponseMetricServiceQueue/SSL_TCP (76 ms)
[ RUN      ] Parameters/TestRpc.RpcPendingConnectionsMetric/SSL_TCP
I20260925 19:01:31.351379  5315 acceptor_pool.cc:254] collecting diagnostics on the listening RPC socket 0.0.0.0:41765 every 8 connection(s)
I20260925 19:01:31.351444  5316 acceptor_pool.cc:254] collecting diagnostics on the listening RPC socket 0.0.0.0:41765 every 8 connection(s)
W20260925 19:01:31.352059  5311 negotiation.cc:337] Failed RPC negotiation. Trace:
0925 19:01:31.351888 (+     0us) reactor.cc:625] Submitting negotiation task for server connection from 127.0.0.1:39766 (local address 127.0.0.1:41765)
0925 19:01:31.351933 (+    45us) server_negotiation.cc:206] Beginning negotiation
0925 19:01:31.351935 (+     2us) server_negotiation.cc:399] Waiting for connection header
0925 19:01:31.352007 (+    72us) negotiation.cc:327] Negotiation complete: Network error: Server connection negotiation failed: server connection from 127.0.0.1:39766: BlockingRecv error: recv got EOF from 127.0.0.1:39766 (error 108)
Metrics: {"server-negotiator.queue_time_us":16}
[       OK ] Parameters/TestRpc.RpcPendingConnectionsMetric/SSL_TCP (13 ms)
[ RUN      ] Parameters/TestRpc.TestRpcContextClientDeadline/SSL_TCP
I20260925 19:01:31.373308  5331 acceptor_pool.cc:254] collecting diagnostics on the listening RPC socket 0.0.0.0:43555 every 8 connection(s)
I20260925 19:01:31.373327  5332 acceptor_pool.cc:254] collecting diagnostics on the listening RPC socket 0.0.0.0:43555 every 8 connection(s)
[       OK ] Parameters/TestRpc.TestRpcContextClientDeadline/SSL_TCP (54 ms)
[ RUN      ] Parameters/TestRpc.TestApplicationFeatureFlagUnsupportedServer/SSL_TCP
I20260925 19:01:31.429773  5356 acceptor_pool.cc:254] collecting diagnostics on the listening RPC socket 0.0.0.0:36927 every 8 connection(s)
I20260925 19:01:31.429788  5357 acceptor_pool.cc:254] collecting diagnostics on the listening RPC socket 0.0.0.0:36927 every 8 connection(s)
[       OK ] Parameters/TestRpc.TestApplicationFeatureFlagUnsupportedServer/SSL_TCP (35 ms)
[ RUN      ] Parameters/TestRpc.TestCancellationAsync/SSL_TCP
I20260925 19:01:31.469316  5381 acceptor_pool.cc:254] collecting diagnostics on the listening RPC socket 0.0.0.0:43485 every 8 connection(s)
I20260925 19:01:31.469352  5382 acceptor_pool.cc:254] collecting diagnostics on the listening RPC socket 0.0.0.0:43485 every 8 connection(s)
I20260925 19:01:31.469503  4949 rpc-test.cc:1716] Connecting to 0.0.0.0:43485
I20260925 19:01:31.483647  4949 test_util.cc:268] Using random seed: 1479178748
I20260925 19:01:31.500080  5384 rpc-test-base.h:240] got call: sleep_micros: 500 pattern: 4294967295 num_repetitions: 2097152 sidecar_idx: 0
I20260925 19:01:31.513172  5384 rpc-test-base.h:240] got call: sleep_micros: 500 pattern: 4294967295 num_repetitions: 2097152 sidecar_idx: 0
I20260925 19:01:31.527465  5384 rpc-test-base.h:240] got call: sleep_micros: 500 pattern: 4294967295 num_repetitions: 2097152 sidecar_idx: 0
I20260925 19:01:31.542143  5384 rpc-test-base.h:240] got call: sleep_micros: 500 pattern: 4294967295 num_repetitions: 2097152 sidecar_idx: 0
I20260925 19:01:31.556708  5384 rpc-test-base.h:240] got call: sleep_micros: 500 pattern: 4294967295 num_repetitions: 2097152 sidecar_idx: 0
I20260925 19:01:31.571168  5384 rpc-test-base.h:240] got call: sleep_micros: 500 pattern: 4294967295 num_repetitions: 2097152 sidecar_idx: 0
I20260925 19:01:31.585417  5384 rpc-test-base.h:240] got call: sleep_micros: 500 pattern: 4294967295 num_repetitions: 2097152 sidecar_idx: 0
I20260925 19:01:31.599892  5384 rpc-test-base.h:240] got call: sleep_micros: 500 pattern: 4294967295 num_repetitions: 2097152 sidecar_idx: 0
W20260925 19:01:31.603470  5379 connection.cc:441] server connection from 127.0.0.1:58112 torn down before Call kudu.rpc.GenericCalculatorService.SleepWithSidecar from 127.0.0.1:58112 (request call id 9) could send its response
[       OK ] Parameters/TestRpc.TestCancellationAsync/SSL_TCP (150 ms)
[ RUN      ] Parameters/TestRpc.TestPerformanceBySocketType/SSL_TCP
I20260925 19:01:31.646263  5406 acceptor_pool.cc:254] collecting diagnostics on the listening RPC socket 0.0.0.0:44443 every 8 connection(s)
I20260925 19:01:31.646327  5407 acceptor_pool.cc:254] collecting diagnostics on the listening RPC socket 0.0.0.0:44443 every 8 connection(s)
I20260925 19:01:31.646476  4949 rpc-test.cc:1846] Connecting to 0.0.0.0:44443
I20260925 19:01:33.363423  4949 rpc-test.cc:1859] Sending 1024MB via ssl-enabled tcp socket: real 1.703s	user 1.562s	sys 1.436s
I20260925 19:01:35.067553  4949 rpc-test.cc:1859] Sending 1024MB via ssl-enabled tcp socket: real 1.704s	user 1.562s	sys 1.457s
I20260925 19:01:36.793669  4949 rpc-test.cc:1859] Sending 1024MB via ssl-enabled tcp socket: real 1.726s	user 1.560s	sys 1.483s
I20260925 19:01:38.562309  4949 rpc-test.cc:1859] Sending 1024MB via ssl-enabled tcp socket: real 1.769s	user 1.573s	sys 1.529s
I20260925 19:01:40.300709  4949 rpc-test.cc:1859] Sending 1024MB via ssl-enabled tcp socket: real 1.738s	user 1.552s	sys 1.524s
[       OK ] Parameters/TestRpc.TestPerformanceBySocketType/SSL_TCP (8698 ms)
[----------] 20 tests from Parameters/TestRpc (31412 ms total)

[----------] 1 test from Parameters/TestRpcSocketTxRxQueue
[ RUN      ] Parameters/TestRpcSocketTxRxQueue.OverCapacity/0
W20260925 19:01:40.570272  5432 negotiation.cc:337] Failed RPC negotiation. Trace:
0925 19:01:40.306560 (+     0us) reactor.cc:625] Submitting negotiation task for client connection to 0.0.0.0:44409 (local address 127.0.0.1:56178)
0925 19:01:40.306606 (+    46us) negotiation.cc:107] Waiting for socket to connect
0925 19:01:40.306622 (+    16us) client_negotiation.cc:174] Beginning negotiation
0925 19:01:40.306674 (+    52us) client_negotiation.cc:252] Sending NEGOTIATE NegotiatePB request
0925 19:01:40.570098 (+263424us) negotiation.cc:327] Negotiation complete: Network error: Client connection negotiation failed: client connection to 0.0.0.0:44409: BlockingRecv error: recv error from unknown peer: Transport endpoint is not connected (error 107)
Metrics: {"client-negotiator.queue_time_us":17}
W20260925 19:01:40.570403  5459 negotiation.cc:337] Failed RPC negotiation. Trace:
0925 19:01:40.309331 (+     0us) reactor.cc:625] Submitting negotiation task for client connection to 0.0.0.0:44409 (local address 127.0.0.1:56210)
0925 19:01:40.309385 (+    54us) negotiation.cc:107] Waiting for socket to connect
0925 19:01:40.309394 (+     9us) client_negotiation.cc:174] Beginning negotiation
0925 19:01:40.309433 (+    39us) client_negotiation.cc:252] Sending NEGOTIATE NegotiatePB request
0925 19:01:40.570341 (+260908us) negotiation.cc:327] Negotiation complete: Network error: Client connection negotiation failed: client connection to 0.0.0.0:44409: BlockingRecv error: recv error from unknown peer: Transport endpoint is not connected (error 107)
Metrics: {"client-negotiator.queue_time_us":34}
W20260925 19:01:40.570271  5441 negotiation.cc:337] Failed RPC negotiation. Trace:
0925 19:01:40.307478 (+     0us) reactor.cc:625] Submitting negotiation task for client connection to 0.0.0.0:44409 (local address 127.0.0.1:56184)
0925 19:01:40.307534 (+    56us) negotiation.cc:107] Waiting for socket to connect
0925 19:01:40.307543 (+     9us) client_negotiation.cc:174] Beginning negotiation
0925 19:01:40.307587 (+    44us) client_negotiation.cc:252] Sending NEGOTIATE NegotiatePB request
0925 19:01:40.570095 (+262508us) negotiation.cc:327] Negotiation complete: Network error: Client connection negotiation failed: client connection to 0.0.0.0:44409: BlockingRecv error: recv error from unknown peer: Transport endpoint is not connected (error 107)
Metrics: {"client-negotiator.queue_time_us":34}
W20260925 19:01:40.570652  5468 negotiation.cc:337] Failed RPC negotiation. Trace:
0925 19:01:40.310188 (+     0us) reactor.cc:625] Submitting negotiation task for client connection to 0.0.0.0:44409 (local address 127.0.0.1:56226)
0925 19:01:40.310242 (+    54us) negotiation.cc:107] Waiting for socket to connect
0925 19:01:40.310251 (+     9us) client_negotiation.cc:174] Beginning negotiation
0925 19:01:40.310290 (+    39us) client_negotiation.cc:252] Sending NEGOTIATE NegotiatePB request
0925 19:01:40.570322 (+260032us) negotiation.cc:327] Negotiation complete: Network error: Client connection negotiation failed: client connection to 0.0.0.0:44409: BlockingRecv error: recv error from unknown peer: Transport endpoint is not connected (error 107)
Metrics: {"client-negotiator.queue_time_us":34}
W20260925 19:01:40.570415  5450 negotiation.cc:337] Failed RPC negotiation. Trace:
0925 19:01:40.308408 (+     0us) reactor.cc:625] Submitting negotiation task for client connection to 0.0.0.0:44409 (local address 127.0.0.1:56194)
0925 19:01:40.308463 (+    55us) negotiation.cc:107] Waiting for socket to connect
0925 19:01:40.308473 (+    10us) client_negotiation.cc:174] Beginning negotiation
0925 19:01:40.308512 (+    39us) client_negotiation.cc:252] Sending NEGOTIATE NegotiatePB request
0925 19:01:40.570301 (+261789us) negotiation.cc:327] Negotiation complete: Network error: Client connection negotiation failed: client connection to 0.0.0.0:44409: BlockingRecv error: recv error from unknown peer: Transport endpoint is not connected (error 107)
Metrics: {"client-negotiator.queue_time_us":33}
W20260925 19:01:40.570806  5423 negotiation.cc:337] Failed RPC negotiation. Trace:
0925 19:01:40.305507 (+     0us) reactor.cc:625] Submitting negotiation task for client connection to 0.0.0.0:44409 (local address 127.0.0.1:56170)
0925 19:01:40.305584 (+    77us) negotiation.cc:107] Waiting for socket to connect
0925 19:01:40.305598 (+    14us) client_negotiation.cc:174] Beginning negotiation
0925 19:01:40.305665 (+    67us) client_negotiation.cc:252] Sending NEGOTIATE NegotiatePB request
0925 19:01:40.570099 (+264434us) negotiation.cc:327] Negotiation complete: Network error: Client connection negotiation failed: client connection to 0.0.0.0:44409: BlockingRecv error: recv error from unknown peer: Transport endpoint is not connected (error 107)
Metrics: {"client-negotiator.queue_time_us":40}
[       OK ] Parameters/TestRpcSocketTxRxQueue.OverCapacity/0 (1024 ms)
[----------] 1 test from Parameters/TestRpcSocketTxRxQueue (1024 ms total)

[----------] Global test environment tear-down
[==========] 21 tests from 2 test suites ran. (32437 ms total)
[  PASSED  ] 20 tests.
[  FAILED  ] 1 test, listed below:
[  FAILED  ] Parameters/TestRpc.TestCallWithChainCertAndChainCA/SSL_TCP, where GetParam() = (true, false)

 1 FAILED TEST