Diagnosed failure

Parameters/TestRpc.TestCallWithChainCertAndChainCA/SSL_UnixSocket: /data0/somelongdirectorytoavoidrpathissues/src/kudu/src/kudu/rpc/rpc-test.cc:270: Failure
Failed
Bad status: Runtime error: could not verify certificate chain (error with cert: subject=CN = localhost, ST = sadfjas, C = AS, emailAddress = sdflkdsajf, O = lskdfjlsad, OU = sldfkja, issuer=C = AS, ST = ASDfkjdhf, L = lskdjf, O = saldfja, OU = skdjf, CN = localhost, emailAddress = sadjflkadsj): : certificate has expired
Google Test trace:
/data0/somelongdirectorytoavoidrpathissues/src/kudu/src/kudu/rpc/rpc-test.cc:267: Connecting to unix:/tmp/dist-test-taskCuJ1pZ/test-tmp/rpc-test-a71b55d964f54675b9a29bce0f234c50.sock
I20260926 07:25:38.334751 17349 test_util.cc:175] -----------------------------------------------
I20260926 07:25:38.334802 17349 test_util.cc:176] Had fatal failures, leaving test files at /tmp/dist-test-taskCuJ1pZ/test-tmp/rpc-test.6.Parameters_TestRpc.TestCallWithChainCertAndChainCA_SSL_UnixSocket.1790407538260434-17349-0

Full log

Note: This is test shard 7 of 8.
[==========] Running 21 tests from 2 test suites.
[----------] Global test environment set-up.
[----------] 20 tests from Parameters/TestRpc
[ RUN      ] Parameters/TestRpc.TestMessengerCreateDestroy/SSL_UnixSocket
WARNING: Logging before InitGoogleLogging() is written to STDERR
I20260926 07:25:38.284786 17349 rpc-test.cc:169] started messenger TestCreateDestroy
[       OK ] Parameters/TestRpc.TestMessengerCreateDestroy/SSL_UnixSocket (19 ms)
[ RUN      ] Parameters/TestRpc.TestNegotiationDeadlock/SSL_UnixSocket
I20260926 07:25:38.309650 17369 acceptor_pool.cc:254] collecting diagnostics on the listening RPC socket unix:/tmp/dist-test-taskCuJ1pZ/test-tmp/rpc-test-bee0a4e9c1e646b691ce0e788708a6ca.sock every 8 connection(s)
I20260926 07:25:38.309695 17370 acceptor_pool.cc:254] collecting diagnostics on the listening RPC socket unix:/tmp/dist-test-taskCuJ1pZ/test-tmp/rpc-test-bee0a4e9c1e646b691ce0e788708a6ca.sock every 8 connection(s)
[       OK ] Parameters/TestRpc.TestNegotiationDeadlock/SSL_UnixSocket (33 ms)
[ RUN      ] Parameters/TestRpc.TestCallWithChainCertAndChainCA/SSL_UnixSocket
I20260926 07:25:38.329846 17385 acceptor_pool.cc:254] collecting diagnostics on the listening RPC socket unix:/tmp/dist-test-taskCuJ1pZ/test-tmp/rpc-test-a71b55d964f54675b9a29bce0f234c50.sock every 8 connection(s)
I20260926 07:25:38.329896 17386 acceptor_pool.cc:254] collecting diagnostics on the listening RPC socket unix:/tmp/dist-test-taskCuJ1pZ/test-tmp/rpc-test-a71b55d964f54675b9a29bce0f234c50.sock every 8 connection(s)
/data0/somelongdirectorytoavoidrpathissues/src/kudu/src/kudu/rpc/rpc-test.cc:270: Failure
Failed
Bad status: Runtime error: could not verify certificate chain (error with cert: subject=CN = localhost, ST = sadfjas, C = AS, emailAddress = sdflkdsajf, O = lskdfjlsad, OU = sldfkja, issuer=C = AS, ST = ASDfkjdhf, L = lskdjf, O = saldfja, OU = skdjf, CN = localhost, emailAddress = sadjflkadsj): : certificate has expired
Google Test trace:
/data0/somelongdirectorytoavoidrpathissues/src/kudu/src/kudu/rpc/rpc-test.cc:267: Connecting to unix:/tmp/dist-test-taskCuJ1pZ/test-tmp/rpc-test-a71b55d964f54675b9a29bce0f234c50.sock
I20260926 07:25:38.334751 17349 test_util.cc:175] -----------------------------------------------
I20260926 07:25:38.334802 17349 test_util.cc:176] Had fatal failures, leaving test files at /tmp/dist-test-taskCuJ1pZ/test-tmp/rpc-test.6.Parameters_TestRpc.TestCallWithChainCertAndChainCA_SSL_UnixSocket.1790407538260434-17349-0
[  FAILED  ] Parameters/TestRpc.TestCallWithChainCertAndChainCA/SSL_UnixSocket, where GetParam() = (true, true) (14 ms)
[ RUN      ] Parameters/TestRpc.TestCallWithPasswordProtectedKey/SSL_UnixSocket
I20260926 07:25:38.345149 17410 acceptor_pool.cc:254] collecting diagnostics on the listening RPC socket unix:/tmp/dist-test-taskCuJ1pZ/test-tmp/rpc-test-1647e030925b4c24b7504ddba314473d.sock every 8 connection(s)
I20260926 07:25:38.345170 17411 acceptor_pool.cc:254] collecting diagnostics on the listening RPC socket unix:/tmp/dist-test-taskCuJ1pZ/test-tmp/rpc-test-1647e030925b4c24b7504ddba314473d.sock every 8 connection(s)
[       OK ] Parameters/TestRpc.TestCallWithPasswordProtectedKey/SSL_UnixSocket (25 ms)
[ RUN      ] Parameters/TestRpc.TestCallToBadServer/SSL_UnixSocket
I20260926 07:25:38.370568 17349 rpc-test.cc:394] Status: Network error: Client connection negotiation failed: client connection to 0.0.0.0:0: connect: Connection refused (error 111)
I20260926 07:25:38.371078 17349 rpc-test.cc:394] Status: Network error: Client connection negotiation failed: client connection to 0.0.0.0:0: connect: Connection refused (error 111)
I20260926 07:25:38.371588 17349 rpc-test.cc:394] Status: Network error: Client connection negotiation failed: client connection to 0.0.0.0:0: connect: Connection refused (error 111)
I20260926 07:25:38.371977 17349 rpc-test.cc:394] Status: Network error: Client connection negotiation failed: client connection to 0.0.0.0:0: connect: Connection refused (error 111)
I20260926 07:25:38.372373 17349 rpc-test.cc:394] Status: Network error: Client connection negotiation failed: client connection to 0.0.0.0:0: connect: Connection refused (error 111)
[       OK ] Parameters/TestRpc.TestCallToBadServer/SSL_UnixSocket (13 ms)
[ RUN      ] Parameters/TestRpc.TestWrongService/SSL_UnixSocket
I20260926 07:25:38.386768 17445 acceptor_pool.cc:254] collecting diagnostics on the listening RPC socket unix:/tmp/dist-test-taskCuJ1pZ/test-tmp/rpc-test-618e0ab1ca434fe897f11181f9085b32.sock every 8 connection(s)
I20260926 07:25:38.386802 17446 acceptor_pool.cc:254] collecting diagnostics on the listening RPC socket unix:/tmp/dist-test-taskCuJ1pZ/test-tmp/rpc-test-618e0ab1ca434fe897f11181f9085b32.sock every 8 connection(s)
I20260926 07:25:38.424674 17442 messenger.cc:345] service WrongServiceName not registered on TestServer
W20260926 07:25:38.425613 17442 connection.cc:196] Error closing socket: Network error: TlsSocket::Close: Broken pipe
[       OK ] Parameters/TestRpc.TestWrongService/SSL_UnixSocket (54 ms)
[ RUN      ] Parameters/TestRpc.TestConnectionKeepalive/SSL_UnixSocket
I20260926 07:25:38.436821 17468 acceptor_pool.cc:254] collecting diagnostics on the listening RPC socket unix:/tmp/dist-test-taskCuJ1pZ/test-tmp/rpc-test-9d73fc3eb74a40dca93a4d08ba7d85eb.sock every 8 connection(s)
I20260926 07:25:38.436877 17469 acceptor_pool.cc:254] collecting diagnostics on the listening RPC socket unix:/tmp/dist-test-taskCuJ1pZ/test-tmp/rpc-test-9d73fc3eb74a40dca93a4d08ba7d85eb.sock every 8 connection(s)
I20260926 07:25:38.437171 17349 rpc-test.cc:488] Connecting to unix:/tmp/dist-test-taskCuJ1pZ/test-tmp/rpc-test-9d73fc3eb74a40dca93a4d08ba7d85eb.sock
W20260926 07:25:38.928928 17481 connection.cc:196] Error closing socket: Network error: TlsSocket::Close: Broken pipe
[       OK ] Parameters/TestRpc.TestConnectionKeepalive/SSL_UnixSocket (1034 ms)
[ RUN      ] Parameters/TestRpc.TestClientConnectionMetrics/SSL_UnixSocket
I20260926 07:25:39.478590 17494 acceptor_pool.cc:254] collecting diagnostics on the listening RPC socket unix:/tmp/dist-test-taskCuJ1pZ/test-tmp/rpc-test-e1df48bd76ed46568bb1d70d9cdb9773.sock every 8 connection(s)
I20260926 07:25:39.478565 17493 acceptor_pool.cc:254] collecting diagnostics on the listening RPC socket unix:/tmp/dist-test-taskCuJ1pZ/test-tmp/rpc-test-e1df48bd76ed46568bb1d70d9cdb9773.sock every 8 connection(s)
I20260926 07:25:39.478897 17349 rpc-test.cc:569] Connecting to unix:/tmp/dist-test-taskCuJ1pZ/test-tmp/rpc-test-e1df48bd76ed46568bb1d70d9cdb9773.sock
W20260926 07:25:49.770594 17490 connection.cc:196] Error closing socket: Network error: TlsSocket::Close: Broken pipe
[       OK ] Parameters/TestRpc.TestClientConnectionMetrics/SSL_UnixSocket (10310 ms)
[ RUN      ] Parameters/TestRpc.TestCredentialsPolicy/SSL_UnixSocket
I20260926 07:25:49.786590 17516 acceptor_pool.cc:254] collecting diagnostics on the listening RPC socket unix:/tmp/dist-test-taskCuJ1pZ/test-tmp/rpc-test-459fc07e45c44725bbab726635d8bfdc.sock every 8 connection(s)
I20260926 07:25:49.786722 17517 acceptor_pool.cc:254] collecting diagnostics on the listening RPC socket unix:/tmp/dist-test-taskCuJ1pZ/test-tmp/rpc-test-459fc07e45c44725bbab726635d8bfdc.sock every 8 connection(s)
I20260926 07:25:49.786980 17349 rpc-test.cc:700] Connecting to unix:/tmp/dist-test-taskCuJ1pZ/test-tmp/rpc-test-459fc07e45c44725bbab726635d8bfdc.sock
W20260926 07:25:49.812858 17515 connection.cc:196] Error closing socket: Network error: TlsSocket::Close: Broken pipe
W20260926 07:25:49.817436 17515 connection.cc:196] Error closing socket: Network error: TlsSocket::Close: Broken pipe
[       OK ] Parameters/TestRpc.TestCredentialsPolicy/SSL_UnixSocket (46 ms)
[ RUN      ] Parameters/TestRpc.TestCallLongerThanKeepalive/SSL_UnixSocket
I20260926 07:25:49.841881 17541 acceptor_pool.cc:254] collecting diagnostics on the listening RPC socket unix:/tmp/dist-test-taskCuJ1pZ/test-tmp/rpc-test-7bc852de07b5466a9d1552f18b413743.sock every 8 connection(s)
I20260926 07:25:49.841912 17542 acceptor_pool.cc:254] collecting diagnostics on the listening RPC socket unix:/tmp/dist-test-taskCuJ1pZ/test-tmp/rpc-test-7bc852de07b5466a9d1552f18b413743.sock every 8 connection(s)
I20260926 07:25:49.860599 17545 rpc-test-base.h:222] got call: sleep_micros: 3000000 deferred: true
I20260926 07:25:52.861472 17545 rpcz_store.cc:275] Call kudu.rpc.GenericCalculatorService.Sleep from unix:<unnamed> (request call id 0) took 3001 ms. Trace:
I20260926 07:25:52.861608 17545 rpcz_store.cc:276] 0926 07:25:49.860486 (+     0us) service_pool.cc:170] Inserting onto call queue
0926 07:25:49.860566 (+    80us) service_pool.cc:227] Handling call
0926 07:25:52.861446 (+3000880us) inbound_call.cc:173] Queueing success response
Metrics: {}
[       OK ] Parameters/TestRpc.TestCallLongerThanKeepalive/SSL_UnixSocket (3046 ms)
[ RUN      ] Parameters/TestRpc.TestRpcSidecar/SSL_UnixSocket
I20260926 07:25:52.880000 17566 acceptor_pool.cc:254] collecting diagnostics on the listening RPC socket unix:/tmp/dist-test-taskCuJ1pZ/test-tmp/rpc-test-a0f6a26871ef4ab58d4eb196a4a7e6a4.sock every 8 connection(s)
I20260926 07:25:52.880041 17567 acceptor_pool.cc:254] collecting diagnostics on the listening RPC socket unix:/tmp/dist-test-taskCuJ1pZ/test-tmp/rpc-test-a0f6a26871ef4ab58d4eb196a4a7e6a4.sock every 8 connection(s)
W20260926 07:25:52.941269 17563 connection.cc:196] Error closing socket: Network error: TlsSocket::Close: Broken pipe
[       OK ] Parameters/TestRpc.TestRpcSidecar/SSL_UnixSocket (77 ms)
[ RUN      ] Parameters/TestRpc.TestRpcSidecarLimits/SSL_UnixSocket
I20260926 07:25:54.704252 17591 acceptor_pool.cc:254] collecting diagnostics on the listening RPC socket unix:/tmp/dist-test-taskCuJ1pZ/test-tmp/rpc-test-c50028bd02a9470db77c2edd88180c9c.sock every 8 connection(s)
I20260926 07:25:54.704313 17592 acceptor_pool.cc:254] collecting diagnostics on the listening RPC socket unix:/tmp/dist-test-taskCuJ1pZ/test-tmp/rpc-test-c50028bd02a9470db77c2edd88180c9c.sock every 8 connection(s)
W20260926 07:25:54.747778 17349 serialization.cc:72] Serialized kudu.rpc_test.PushStringsRequestPB (2147483654 bytes) is larger than the maximum configured RPC message size (52428800 bytes). Sending anyway, but peer may reject the data.
W20260926 07:25:54.752097 17588 connection.cc:535] server connection from unix:<unnamed> recv error: Network error: RPC frame had a length of 2147483714, but we only support messages up to 52428800 bytes long.
W20260926 07:25:54.752193 17588 connection.cc:158] shutting down server connection from unix:<unnamed> with pending inbound data: 4/2147483714 bytes received; last active 0 ns ago: status Network error: RPC frame had a length of 2147483714, but we only support messages up to 52428800 bytes long.
W20260926 07:25:54.752530 17604 connection.cc:196] Error closing socket: Network error: TlsSocket::Close: Broken pipe
I20260926 07:25:54.775647 17616 acceptor_pool.cc:254] collecting diagnostics on the listening RPC socket unix:/tmp/dist-test-taskCuJ1pZ/test-tmp/rpc-test-c50028bd02a9470db77c2edd88180c9c.sock every 8 connection(s)
I20260926 07:25:54.775647 17617 acceptor_pool.cc:254] collecting diagnostics on the listening RPC socket unix:/tmp/dist-test-taskCuJ1pZ/test-tmp/rpc-test-c50028bd02a9470db77c2edd88180c9c.sock every 8 connection(s)
W20260926 07:25:59.445734 17613 connection.cc:577] server connection from unix:<unnamed>: received bad data: 'Corruption: Invalid packet: message had a length of 2147483710, but we only support messages up to 2147483647 bytes
'
W20260926 07:25:59.446074 17629 connection.cc:196] Error closing socket: Network error: TlsSocket::Close: Broken pipe
[       OK ] Parameters/TestRpc.TestRpcSidecarLimits/SSL_UnixSocket (6505 ms)
[ RUN      ] Parameters/TestRpc.TestCallTimeoutDoesntAffectNegotiation/SSL_UnixSocket
I20260926 07:25:59.464061 17641 acceptor_pool.cc:254] collecting diagnostics on the listening RPC socket unix:/tmp/dist-test-taskCuJ1pZ/test-tmp/rpc-test-04e4435d89244401bd4aa41fb9f9fd6a.sock every 8 connection(s)
I20260926 07:25:59.464113 17642 acceptor_pool.cc:254] collecting diagnostics on the listening RPC socket unix:/tmp/dist-test-taskCuJ1pZ/test-tmp/rpc-test-04e4435d89244401bd4aa41fb9f9fd6a.sock every 8 connection(s)
W20260926 07:25:59.481220 17637 negotiation.cc:266] Injecting 500ms delay in negotiation
I20260926 07:25:59.531641 17349 rpc-test-base.h:595] status: Timed out: connection negotiation to unix:/tmp/dist-test-taskCuJ1pZ/test-tmp/rpc-test-04e4435d89244401bd4aa41fb9f9fd6a.sock for RPC Sleep timed out after 0.050s (ON_OUTBOUND_QUEUE), seconds elapsed: 0.0509266
W20260926 07:25:59.992468 17638 connection.cc:196] Error closing socket: Network error: TlsSocket::Close: Broken pipe
[       OK ] Parameters/TestRpc.TestCallTimeoutDoesntAffectNegotiation/SSL_UnixSocket (546 ms)
[ RUN      ] Parameters/TestRpc.TestRpcHandlerLatencyMetric/SSL_UnixSocket
I20260926 07:26:00.003424 17666 acceptor_pool.cc:254] collecting diagnostics on the listening RPC socket unix:/tmp/dist-test-taskCuJ1pZ/test-tmp/rpc-test-c9438c0f69b447849afcfbc2c29effd6.sock every 8 connection(s)
I20260926 07:26:00.003584 17667 acceptor_pool.cc:254] collecting diagnostics on the listening RPC socket unix:/tmp/dist-test-taskCuJ1pZ/test-tmp/rpc-test-c9438c0f69b447849afcfbc2c29effd6.sock every 8 connection(s)
I20260926 07:26:00.048121 17349 rpc-test.cc:1236] Sleep() min lat: 20482
I20260926 07:26:00.048202 17349 rpc-test.cc:1237] Sleep() mean lat: 20482
I20260926 07:26:00.048251 17349 rpc-test.cc:1238] Sleep() max lat: 20482
I20260926 07:26:00.048326 17349 rpc-test.cc:1239] Sleep() #calls: 1
W20260926 07:26:00.049216 17663 connection.cc:196] Error closing socket: Network error: TlsSocket::Close: Broken pipe
[       OK ] Parameters/TestRpc.TestRpcHandlerLatencyMetric/SSL_UnixSocket (55 ms)
[ RUN      ] Parameters/TestRpc.TimedOutOnResponseMetricServiceQueue/SSL_UnixSocket
I20260926 07:26:00.060300 17692 acceptor_pool.cc:254] collecting diagnostics on the listening RPC socket unix:/tmp/dist-test-taskCuJ1pZ/test-tmp/rpc-test-44183a4330b64346854dd886b67575c9.sock every 8 connection(s)
I20260926 07:26:00.060335 17693 acceptor_pool.cc:254] collecting diagnostics on the listening RPC socket unix:/tmp/dist-test-taskCuJ1pZ/test-tmp/rpc-test-44183a4330b64346854dd886b67575c9.sock every 8 connection(s)
W20260926 07:26:00.123490 17694 rpcz_store.cc:267] Call kudu.rpc_test.CalculatorService.Sleep from unix:<unnamed> (request call id 2) took 20 ms (client timeout 20 ms). Trace:
W20260926 07:26:00.123660 17694 rpcz_store.cc:269] 0926 07:26:00.102983 (+     0us) service_pool.cc:170] Inserting onto call queue
0926 07:26:00.123438 (+ 20455us) service_pool.cc:214] Skipping call since client already timed out
0926 07:26:00.123468 (+    30us) inbound_call.cc:173] Queueing failure response
Metrics: {}
W20260926 07:26:00.124392 17689 connection.cc:196] Error closing socket: Network error: TlsSocket::Close: Broken pipe
[       OK ] Parameters/TestRpc.TimedOutOnResponseMetricServiceQueue/SSL_UnixSocket (74 ms)
[ RUN      ] Parameters/TestRpc.RpcPendingConnectionsMetric/SSL_UnixSocket
I20260926 07:26:00.128127 17716 acceptor_pool.cc:254] collecting diagnostics on the listening RPC socket 0.0.0.0:44793 every 8 connection(s)
I20260926 07:26:00.128136 17715 acceptor_pool.cc:254] collecting diagnostics on the listening RPC socket 0.0.0.0:44793 every 8 connection(s)
W20260926 07:26:00.129235 17711 negotiation.cc:337] Failed RPC negotiation. Trace:
0926 07:26:00.128841 (+     0us) reactor.cc:625] Submitting negotiation task for server connection from 127.0.0.1:38338 (local address 127.0.0.1:44793)
0926 07:26:00.128954 (+   113us) server_negotiation.cc:206] Beginning negotiation
0926 07:26:00.128958 (+     4us) server_negotiation.cc:399] Waiting for connection header
0926 07:26:00.129042 (+    84us) negotiation.cc:327] Negotiation complete: Network error: Server connection negotiation failed: server connection from 127.0.0.1:38338: BlockingRecv error: recv got EOF from 127.0.0.1:38338 (error 108)
Metrics: {"server-negotiator.queue_time_us":49}
[       OK ] Parameters/TestRpc.RpcPendingConnectionsMetric/SSL_UnixSocket (14 ms)
[ RUN      ] Parameters/TestRpc.TestRpcContextClientDeadline/SSL_UnixSocket
I20260926 07:26:00.158179 17732 acceptor_pool.cc:254] collecting diagnostics on the listening RPC socket unix:/tmp/dist-test-taskCuJ1pZ/test-tmp/rpc-test-81bdbcf09e1040e78a8eccdd2ff0d1dc.sock every 8 connection(s)
I20260926 07:26:00.158181 17731 acceptor_pool.cc:254] collecting diagnostics on the listening RPC socket unix:/tmp/dist-test-taskCuJ1pZ/test-tmp/rpc-test-81bdbcf09e1040e78a8eccdd2ff0d1dc.sock every 8 connection(s)
W20260926 07:26:00.197629 17728 connection.cc:196] Error closing socket: Network error: TlsSocket::Close: Broken pipe
[       OK ] Parameters/TestRpc.TestRpcContextClientDeadline/SSL_UnixSocket (58 ms)
[ RUN      ] Parameters/TestRpc.TestApplicationFeatureFlagUnsupportedServer/SSL_UnixSocket
I20260926 07:26:00.209794 17756 acceptor_pool.cc:254] collecting diagnostics on the listening RPC socket unix:/tmp/dist-test-taskCuJ1pZ/test-tmp/rpc-test-bc83f2d2c2174d11a9ad151a932e0a68.sock every 8 connection(s)
I20260926 07:26:00.209834 17757 acceptor_pool.cc:254] collecting diagnostics on the listening RPC socket unix:/tmp/dist-test-taskCuJ1pZ/test-tmp/rpc-test-bc83f2d2c2174d11a9ad151a932e0a68.sock every 8 connection(s)
[       OK ] Parameters/TestRpc.TestApplicationFeatureFlagUnsupportedServer/SSL_UnixSocket (27 ms)
[ RUN      ] Parameters/TestRpc.TestCancellationAsync/SSL_UnixSocket
I20260926 07:26:00.241046 17782 acceptor_pool.cc:254] collecting diagnostics on the listening RPC socket unix:/tmp/dist-test-taskCuJ1pZ/test-tmp/rpc-test-97793acae73145d08f74cfad17a7589a.sock every 8 connection(s)
I20260926 07:26:00.241022 17781 acceptor_pool.cc:254] collecting diagnostics on the listening RPC socket unix:/tmp/dist-test-taskCuJ1pZ/test-tmp/rpc-test-97793acae73145d08f74cfad17a7589a.sock every 8 connection(s)
I20260926 07:26:00.241422 17349 rpc-test.cc:1716] Connecting to unix:/tmp/dist-test-taskCuJ1pZ/test-tmp/rpc-test-97793acae73145d08f74cfad17a7589a.sock
I20260926 07:26:00.247570 17349 test_util.cc:268] Using random seed: -1096697586
I20260926 07:26:00.263656 17785 rpc-test-base.h:240] got call: sleep_micros: 500 pattern: 4294967295 num_repetitions: 2097152 sidecar_idx: 0
I20260926 07:26:00.281894 17784 rpc-test-base.h:240] got call: sleep_micros: 500 pattern: 4294967295 num_repetitions: 2097152 sidecar_idx: 0
I20260926 07:26:00.298448 17785 rpc-test-base.h:240] got call: sleep_micros: 500 pattern: 4294967295 num_repetitions: 2097152 sidecar_idx: 0
I20260926 07:26:00.315148 17784 rpc-test-base.h:240] got call: sleep_micros: 500 pattern: 4294967295 num_repetitions: 2097152 sidecar_idx: 0
I20260926 07:26:00.331488 17785 rpc-test-base.h:240] got call: sleep_micros: 500 pattern: 4294967295 num_repetitions: 2097152 sidecar_idx: 0
I20260926 07:26:00.348201 17784 rpc-test-base.h:240] got call: sleep_micros: 500 pattern: 4294967295 num_repetitions: 2097152 sidecar_idx: 0
I20260926 07:26:00.368875 17784 rpc-test-base.h:240] got call: sleep_micros: 500 pattern: 4294967295 num_repetitions: 2097152 sidecar_idx: 0
I20260926 07:26:00.384743 17785 rpc-test-base.h:240] got call: sleep_micros: 500 pattern: 4294967295 num_repetitions: 2097152 sidecar_idx: 0
W20260926 07:26:00.388145 17778 connection.cc:196] Error closing socket: Network error: TlsSocket::Close: Broken pipe
W20260926 07:26:00.403721 17778 connection.cc:441] server connection from unix:<unnamed> torn down before Call kudu.rpc.GenericCalculatorService.SleepWithSidecar from unix:<unnamed> (request call id 9) could send its response
[       OK ] Parameters/TestRpc.TestCancellationAsync/SSL_UnixSocket (178 ms)
[ RUN      ] Parameters/TestRpc.TestPerformanceBySocketType/SSL_UnixSocket
I20260926 07:26:00.417953 17806 acceptor_pool.cc:254] collecting diagnostics on the listening RPC socket unix:/tmp/dist-test-taskCuJ1pZ/test-tmp/rpc-test-ea5fe5e2804b4623b5ea513dd3c270fd.sock every 8 connection(s)
I20260926 07:26:00.417986 17807 acceptor_pool.cc:254] collecting diagnostics on the listening RPC socket unix:/tmp/dist-test-taskCuJ1pZ/test-tmp/rpc-test-ea5fe5e2804b4623b5ea513dd3c270fd.sock every 8 connection(s)
I20260926 07:26:00.418311 17349 rpc-test.cc:1846] Connecting to unix:/tmp/dist-test-taskCuJ1pZ/test-tmp/rpc-test-ea5fe5e2804b4623b5ea513dd3c270fd.sock
I20260926 07:26:02.043493 17349 rpc-test.cc:1859] Sending 1024MB via ssl-enabled unix socket: real 1.609s	user 2.044s	sys 0.853s
I20260926 07:26:03.671476 17349 rpc-test.cc:1859] Sending 1024MB via ssl-enabled unix socket: real 1.628s	user 2.040s	sys 0.919s
I20260926 07:26:05.329525 17349 rpc-test.cc:1859] Sending 1024MB via ssl-enabled unix socket: real 1.658s	user 2.071s	sys 0.929s
I20260926 07:26:06.836140 17349 rpc-test.cc:1859] Sending 1024MB via ssl-enabled unix socket: real 1.506s	user 1.781s	sys 0.939s
I20260926 07:26:08.365131 17349 rpc-test.cc:1859] Sending 1024MB via ssl-enabled unix socket: real 1.529s	user 1.968s	sys 0.809s
W20260926 07:26:08.365954 17803 connection.cc:196] Error closing socket: Network error: TlsSocket::Close: Broken pipe
[       OK ] Parameters/TestRpc.TestPerformanceBySocketType/SSL_UnixSocket (7961 ms)
[----------] 20 tests from Parameters/TestRpc (30100 ms total)

[----------] 1 test from Parameters/TestRpcSocketTxRxQueue
[ RUN      ] Parameters/TestRpcSocketTxRxQueue.AcceptorRxQueueSizeMetric/0
I20260926 07:26:08.373229 17831 acceptor_pool.cc:254] collecting diagnostics on the listening RPC socket 0.0.0.0:36697 every 1 connection(s)
I20260926 07:26:08.373306 17832 acceptor_pool.cc:254] collecting diagnostics on the listening RPC socket 0.0.0.0:36697 every 1 connection(s)
W20260926 07:26:08.374199 17827 negotiation.cc:337] Failed RPC negotiation. Trace:
0926 07:26:08.373936 (+     0us) reactor.cc:625] Submitting negotiation task for server connection from 127.0.0.1:47122 (local address 127.0.0.1:36697)
0926 07:26:08.374048 (+   112us) server_negotiation.cc:206] Beginning negotiation
0926 07:26:08.374051 (+     3us) server_negotiation.cc:399] Waiting for connection header
0926 07:26:08.374136 (+    85us) negotiation.cc:327] Negotiation complete: Network error: Server connection negotiation failed: server connection from 127.0.0.1:47122: BlockingRecv error: recv got EOF from 127.0.0.1:47122 (error 108)
Metrics: {"server-negotiator.queue_time_us":44}
[       OK ] Parameters/TestRpcSocketTxRxQueue.AcceptorRxQueueSizeMetric/0 (9 ms)
[----------] 1 test from Parameters/TestRpcSocketTxRxQueue (9 ms total)

[----------] Global test environment tear-down
[==========] 21 tests from 2 test suites ran. (30109 ms total)
[  PASSED  ] 20 tests.
[  FAILED  ] 1 test, listed below:
[  FAILED  ] Parameters/TestRpc.TestCallWithChainCertAndChainCA/SSL_UnixSocket, where GetParam() = (true, true)

 1 FAILED TEST