Diagnosed failure
Parameters/TestRpc.TestCallWithChainCertAndChainCA/SSL_UnixSocket: /data0/somelongdirectorytoavoidrpathissues/src/kudu/src/kudu/rpc/rpc-test.cc:270: Failure
Failed
Bad status: Runtime error: could not verify certificate chain (error with cert: subject=CN = localhost, ST = sadfjas, C = AS, emailAddress = sdflkdsajf, O = lskdfjlsad, OU = sldfkja, issuer=C = AS, ST = ASDfkjdhf, L = lskdjf, O = saldfja, OU = skdjf, CN = localhost, emailAddress = sadjflkadsj): : certificate has expired
Google Test trace:
/data0/somelongdirectorytoavoidrpathissues/src/kudu/src/kudu/rpc/rpc-test.cc:267: Connecting to unix:/tmp/dist-test-taskecdlzw/test-tmp/rpc-test-500af5671c8e4e9a87f3a32388e445b1.sock
I20260923 19:31:52.613407 2585 test_util.cc:175] -----------------------------------------------
I20260923 19:31:52.613502 2585 test_util.cc:176] Had fatal failures, leaving test files at /tmp/dist-test-taskecdlzw/test-tmp/rpc-test.6.Parameters_TestRpc.TestCallWithChainCertAndChainCA_SSL_UnixSocket.1790191912499998-2585-0
Full log
Note: This is test shard 7 of 8.
[==========] Running 21 tests from 2 test suites.
[----------] Global test environment set-up.
[----------] 20 tests from Parameters/TestRpc
[ RUN ] Parameters/TestRpc.TestMessengerCreateDestroy/SSL_UnixSocket
WARNING: Logging before InitGoogleLogging() is written to STDERR
I20260923 19:31:52.541047 2585 rpc-test.cc:169] started messenger TestCreateDestroy
[ OK ] Parameters/TestRpc.TestMessengerCreateDestroy/SSL_UnixSocket (24 ms)
[ RUN ] Parameters/TestRpc.TestNegotiationDeadlock/SSL_UnixSocket
I20260923 19:31:52.558893 2605 acceptor_pool.cc:254] collecting diagnostics on the listening RPC socket unix:/tmp/dist-test-taskecdlzw/test-tmp/rpc-test-75effc0e46f54ab1942a2b01ac4365ed.sock every 8 connection(s)
I20260923 19:31:52.559173 2606 acceptor_pool.cc:254] collecting diagnostics on the listening RPC socket unix:/tmp/dist-test-taskecdlzw/test-tmp/rpc-test-75effc0e46f54ab1942a2b01ac4365ed.sock every 8 connection(s)
[ OK ] Parameters/TestRpc.TestNegotiationDeadlock/SSL_UnixSocket (34 ms)
[ RUN ] Parameters/TestRpc.TestCallWithChainCertAndChainCA/SSL_UnixSocket
I20260923 19:31:52.601948 2621 acceptor_pool.cc:254] collecting diagnostics on the listening RPC socket unix:/tmp/dist-test-taskecdlzw/test-tmp/rpc-test-500af5671c8e4e9a87f3a32388e445b1.sock every 8 connection(s)
I20260923 19:31:52.602274 2622 acceptor_pool.cc:254] collecting diagnostics on the listening RPC socket unix:/tmp/dist-test-taskecdlzw/test-tmp/rpc-test-500af5671c8e4e9a87f3a32388e445b1.sock every 8 connection(s)
/data0/somelongdirectorytoavoidrpathissues/src/kudu/src/kudu/rpc/rpc-test.cc:270: Failure
Failed
Bad status: Runtime error: could not verify certificate chain (error with cert: subject=CN = localhost, ST = sadfjas, C = AS, emailAddress = sdflkdsajf, O = lskdfjlsad, OU = sldfkja, issuer=C = AS, ST = ASDfkjdhf, L = lskdjf, O = saldfja, OU = skdjf, CN = localhost, emailAddress = sadjflkadsj): : certificate has expired
Google Test trace:
/data0/somelongdirectorytoavoidrpathissues/src/kudu/src/kudu/rpc/rpc-test.cc:267: Connecting to unix:/tmp/dist-test-taskecdlzw/test-tmp/rpc-test-500af5671c8e4e9a87f3a32388e445b1.sock
I20260923 19:31:52.613407 2585 test_util.cc:175] -----------------------------------------------
I20260923 19:31:52.613502 2585 test_util.cc:176] Had fatal failures, leaving test files at /tmp/dist-test-taskecdlzw/test-tmp/rpc-test.6.Parameters_TestRpc.TestCallWithChainCertAndChainCA_SSL_UnixSocket.1790191912499998-2585-0
[ FAILED ] Parameters/TestRpc.TestCallWithChainCertAndChainCA/SSL_UnixSocket, where GetParam() = (true, true) (35 ms)
[ RUN ] Parameters/TestRpc.TestCallWithPasswordProtectedKey/SSL_UnixSocket
I20260923 19:31:52.631758 2646 acceptor_pool.cc:254] collecting diagnostics on the listening RPC socket unix:/tmp/dist-test-taskecdlzw/test-tmp/rpc-test-c9a6ded34a7943ffa4ea163e28376277.sock every 8 connection(s)
I20260923 19:31:52.631978 2647 acceptor_pool.cc:254] collecting diagnostics on the listening RPC socket unix:/tmp/dist-test-taskecdlzw/test-tmp/rpc-test-c9a6ded34a7943ffa4ea163e28376277.sock every 8 connection(s)
[ OK ] Parameters/TestRpc.TestCallWithPasswordProtectedKey/SSL_UnixSocket (53 ms)
[ RUN ] Parameters/TestRpc.TestCallToBadServer/SSL_UnixSocket
I20260923 19:31:52.696938 2585 rpc-test.cc:394] Status: Network error: Client connection negotiation failed: client connection to 0.0.0.0:0: connect: Connection refused (error 111)
I20260923 19:31:52.697741 2585 rpc-test.cc:394] Status: Network error: Client connection negotiation failed: client connection to 0.0.0.0:0: connect: Connection refused (error 111)
I20260923 19:31:52.698611 2585 rpc-test.cc:394] Status: Network error: Client connection negotiation failed: client connection to 0.0.0.0:0: connect: Connection refused (error 111)
I20260923 19:31:52.699334 2585 rpc-test.cc:394] Status: Network error: Client connection negotiation failed: client connection to 0.0.0.0:0: connect: Connection refused (error 111)
I20260923 19:31:52.699995 2585 rpc-test.cc:394] Status: Network error: Client connection negotiation failed: client connection to 0.0.0.0:0: connect: Connection refused (error 111)
[ OK ] Parameters/TestRpc.TestCallToBadServer/SSL_UnixSocket (35 ms)
[ RUN ] Parameters/TestRpc.TestWrongService/SSL_UnixSocket
I20260923 19:31:52.721741 2681 acceptor_pool.cc:254] collecting diagnostics on the listening RPC socket unix:/tmp/dist-test-taskecdlzw/test-tmp/rpc-test-59a2d70f4f3943dca5da977b18654c74.sock every 8 connection(s)
I20260923 19:31:52.721989 2682 acceptor_pool.cc:254] collecting diagnostics on the listening RPC socket unix:/tmp/dist-test-taskecdlzw/test-tmp/rpc-test-59a2d70f4f3943dca5da977b18654c74.sock every 8 connection(s)
I20260923 19:31:52.747040 2678 messenger.cc:345] service WrongServiceName not registered on TestServer
W20260923 19:31:52.748553 2678 connection.cc:196] Error closing socket: Network error: TlsSocket::Close: Broken pipe
[ OK ] Parameters/TestRpc.TestWrongService/SSL_UnixSocket (49 ms)
[ RUN ] Parameters/TestRpc.TestConnectionKeepalive/SSL_UnixSocket
I20260923 19:31:52.764945 2704 acceptor_pool.cc:254] collecting diagnostics on the listening RPC socket unix:/tmp/dist-test-taskecdlzw/test-tmp/rpc-test-8cc774290d29419389209bb987345552.sock every 8 connection(s)
I20260923 19:31:52.765163 2705 acceptor_pool.cc:254] collecting diagnostics on the listening RPC socket unix:/tmp/dist-test-taskecdlzw/test-tmp/rpc-test-8cc774290d29419389209bb987345552.sock every 8 connection(s)
I20260923 19:31:52.766023 2585 rpc-test.cc:488] Connecting to unix:/tmp/dist-test-taskecdlzw/test-tmp/rpc-test-8cc774290d29419389209bb987345552.sock
W20260923 19:31:53.254894 2717 connection.cc:196] Error closing socket: Network error: TlsSocket::Close: Broken pipe
[ OK ] Parameters/TestRpc.TestConnectionKeepalive/SSL_UnixSocket (1053 ms)
[ RUN ] Parameters/TestRpc.TestClientConnectionMetrics/SSL_UnixSocket
I20260923 19:31:53.832561 2729 acceptor_pool.cc:254] collecting diagnostics on the listening RPC socket unix:/tmp/dist-test-taskecdlzw/test-tmp/rpc-test-47b2e2f57e2f4dfcac2d54f3850afa6e.sock every 8 connection(s)
I20260923 19:31:53.832803 2730 acceptor_pool.cc:254] collecting diagnostics on the listening RPC socket unix:/tmp/dist-test-taskecdlzw/test-tmp/rpc-test-47b2e2f57e2f4dfcac2d54f3850afa6e.sock every 8 connection(s)
I20260923 19:31:53.833678 2585 rpc-test.cc:569] Connecting to unix:/tmp/dist-test-taskecdlzw/test-tmp/rpc-test-47b2e2f57e2f4dfcac2d54f3850afa6e.sock
W20260923 19:32:13.957996 2726 connection.cc:196] Error closing socket: Network error: TlsSocket::Close: Broken pipe
[ OK ] Parameters/TestRpc.TestClientConnectionMetrics/SSL_UnixSocket (20158 ms)
[ RUN ] Parameters/TestRpc.TestCredentialsPolicy/SSL_UnixSocket
I20260923 19:32:13.975193 2752 acceptor_pool.cc:254] collecting diagnostics on the listening RPC socket unix:/tmp/dist-test-taskecdlzw/test-tmp/rpc-test-b01687e26f4942489f0f8492f150973a.sock every 8 connection(s)
I20260923 19:32:13.975428 2753 acceptor_pool.cc:254] collecting diagnostics on the listening RPC socket unix:/tmp/dist-test-taskecdlzw/test-tmp/rpc-test-b01687e26f4942489f0f8492f150973a.sock every 8 connection(s)
I20260923 19:32:13.976317 2585 rpc-test.cc:700] Connecting to unix:/tmp/dist-test-taskecdlzw/test-tmp/rpc-test-b01687e26f4942489f0f8492f150973a.sock
W20260923 19:32:14.001206 2751 connection.cc:196] Error closing socket: Network error: TlsSocket::Close: Broken pipe
W20260923 19:32:14.008517 2751 connection.cc:196] Error closing socket: Network error: TlsSocket::Close: Broken pipe
[ OK ] Parameters/TestRpc.TestCredentialsPolicy/SSL_UnixSocket (46 ms)
[ RUN ] Parameters/TestRpc.TestCallLongerThanKeepalive/SSL_UnixSocket
I20260923 19:32:14.030262 2777 acceptor_pool.cc:254] collecting diagnostics on the listening RPC socket unix:/tmp/dist-test-taskecdlzw/test-tmp/rpc-test-64da0b4fefd5496e8c7552659da8d838.sock every 8 connection(s)
I20260923 19:32:14.030476 2778 acceptor_pool.cc:254] collecting diagnostics on the listening RPC socket unix:/tmp/dist-test-taskecdlzw/test-tmp/rpc-test-64da0b4fefd5496e8c7552659da8d838.sock every 8 connection(s)
I20260923 19:32:14.054977 2781 rpc-test-base.h:222] got call: sleep_micros: 3000000 deferred: true
I20260923 19:32:17.056706 2781 rpcz_store.cc:275] Call kudu.rpc.GenericCalculatorService.Sleep from unix:<unnamed> (request call id 0) took 3001 ms. Trace:
I20260923 19:32:17.056864 2781 rpcz_store.cc:276] 0923 19:32:14.054866 (+ 0us) service_pool.cc:170] Inserting onto call queue
0923 19:32:14.054930 (+ 64us) service_pool.cc:227] Handling call
0923 19:32:17.056661 (+3001731us) inbound_call.cc:173] Queueing success response
Metrics: {}
W20260923 19:32:17.059567 2774 connection.cc:196] Error closing socket: Network error: TlsSocket::Close: Broken pipe
[ OK ] Parameters/TestRpc.TestCallLongerThanKeepalive/SSL_UnixSocket (3050 ms)
[ RUN ] Parameters/TestRpc.TestRpcSidecar/SSL_UnixSocket
I20260923 19:32:17.078791 2802 acceptor_pool.cc:254] collecting diagnostics on the listening RPC socket unix:/tmp/dist-test-taskecdlzw/test-tmp/rpc-test-937f61d7444c4ae09d062beb76c3aefe.sock every 8 connection(s)
I20260923 19:32:17.078987 2803 acceptor_pool.cc:254] collecting diagnostics on the listening RPC socket unix:/tmp/dist-test-taskecdlzw/test-tmp/rpc-test-937f61d7444c4ae09d062beb76c3aefe.sock every 8 connection(s)
W20260923 19:32:17.182631 2799 connection.cc:196] Error closing socket: Network error: TlsSocket::Close: Broken pipe
[ OK ] Parameters/TestRpc.TestRpcSidecar/SSL_UnixSocket (123 ms)
[ RUN ] Parameters/TestRpc.TestRpcSidecarLimits/SSL_UnixSocket
I20260923 19:32:19.086369 2827 acceptor_pool.cc:254] collecting diagnostics on the listening RPC socket unix:/tmp/dist-test-taskecdlzw/test-tmp/rpc-test-6e7320485f504c2ca64c776a0302a27e.sock every 8 connection(s)
I20260923 19:32:19.086618 2828 acceptor_pool.cc:254] collecting diagnostics on the listening RPC socket unix:/tmp/dist-test-taskecdlzw/test-tmp/rpc-test-6e7320485f504c2ca64c776a0302a27e.sock every 8 connection(s)
W20260923 19:32:19.112655 2585 serialization.cc:72] Serialized kudu.rpc_test.PushStringsRequestPB (2147483654 bytes) is larger than the maximum configured RPC message size (52428800 bytes). Sending anyway, but peer may reject the data.
W20260923 19:32:19.118085 2824 connection.cc:535] server connection from unix:<unnamed> recv error: Network error: RPC frame had a length of 2147483714, but we only support messages up to 52428800 bytes long.
W20260923 19:32:19.118206 2824 connection.cc:158] shutting down server connection from unix:<unnamed> with pending inbound data: 4/2147483714 bytes received; last active 0 ns ago: status Network error: RPC frame had a length of 2147483714, but we only support messages up to 52428800 bytes long.
W20260923 19:32:19.118731 2840 connection.cc:196] Error closing socket: Network error: TlsSocket::Close: Broken pipe
I20260923 19:32:19.150046 2852 acceptor_pool.cc:254] collecting diagnostics on the listening RPC socket unix:/tmp/dist-test-taskecdlzw/test-tmp/rpc-test-6e7320485f504c2ca64c776a0302a27e.sock every 8 connection(s)
I20260923 19:32:19.150369 2853 acceptor_pool.cc:254] collecting diagnostics on the listening RPC socket unix:/tmp/dist-test-taskecdlzw/test-tmp/rpc-test-6e7320485f504c2ca64c776a0302a27e.sock every 8 connection(s)
W20260923 19:32:24.407431 2849 connection.cc:577] server connection from unix:<unnamed>: received bad data: 'Corruption: Invalid packet: message had a length of 2147483710, but we only support messages up to 2147483647 bytes
'
W20260923 19:32:24.407987 2865 connection.cc:196] Error closing socket: Network error: TlsSocket::Close: Broken pipe
[ OK ] Parameters/TestRpc.TestRpcSidecarLimits/SSL_UnixSocket (7645 ms)
[ RUN ] Parameters/TestRpc.TestCallTimeoutDoesntAffectNegotiation/SSL_UnixSocket
I20260923 19:32:24.857160 2877 acceptor_pool.cc:254] collecting diagnostics on the listening RPC socket unix:/tmp/dist-test-taskecdlzw/test-tmp/rpc-test-5269e9c676bf40c3bdeebb1f89eab714.sock every 8 connection(s)
I20260923 19:32:24.857378 2878 acceptor_pool.cc:254] collecting diagnostics on the listening RPC socket unix:/tmp/dist-test-taskecdlzw/test-tmp/rpc-test-5269e9c676bf40c3bdeebb1f89eab714.sock every 8 connection(s)
W20260923 19:32:24.885454 2873 negotiation.cc:266] Injecting 500ms delay in negotiation
I20260923 19:32:24.935882 2585 rpc-test-base.h:595] status: Timed out: connection negotiation to unix:/tmp/dist-test-taskecdlzw/test-tmp/rpc-test-5269e9c676bf40c3bdeebb1f89eab714.sock for RPC Sleep timed out after 0.050s (ON_OUTBOUND_QUEUE), seconds elapsed: 0.0509646
W20260923 19:32:25.392007 2874 connection.cc:196] Error closing socket: Network error: TlsSocket::Close: Broken pipe
[ OK ] Parameters/TestRpc.TestCallTimeoutDoesntAffectNegotiation/SSL_UnixSocket (563 ms)
[ RUN ] Parameters/TestRpc.TestRpcHandlerLatencyMetric/SSL_UnixSocket
I20260923 19:32:25.407433 2902 acceptor_pool.cc:254] collecting diagnostics on the listening RPC socket unix:/tmp/dist-test-taskecdlzw/test-tmp/rpc-test-c381d2c84aa14522acc422b084a0f833.sock every 8 connection(s)
I20260923 19:32:25.407722 2903 acceptor_pool.cc:254] collecting diagnostics on the listening RPC socket unix:/tmp/dist-test-taskecdlzw/test-tmp/rpc-test-c381d2c84aa14522acc422b084a0f833.sock every 8 connection(s)
I20260923 19:32:25.450702 2585 rpc-test.cc:1236] Sleep() min lat: 20750
I20260923 19:32:25.450829 2585 rpc-test.cc:1237] Sleep() mean lat: 20750
I20260923 19:32:25.450888 2585 rpc-test.cc:1238] Sleep() max lat: 20750
I20260923 19:32:25.450914 2585 rpc-test.cc:1239] Sleep() #calls: 1
[ OK ] Parameters/TestRpc.TestRpcHandlerLatencyMetric/SSL_UnixSocket (60 ms)
[ RUN ] Parameters/TestRpc.TimedOutOnResponseMetricServiceQueue/SSL_UnixSocket
I20260923 19:32:25.467546 2928 acceptor_pool.cc:254] collecting diagnostics on the listening RPC socket unix:/tmp/dist-test-taskecdlzw/test-tmp/rpc-test-89070411986746beb987f244089ada50.sock every 8 connection(s)
I20260923 19:32:25.467741 2929 acceptor_pool.cc:254] collecting diagnostics on the listening RPC socket unix:/tmp/dist-test-taskecdlzw/test-tmp/rpc-test-89070411986746beb987f244089ada50.sock every 8 connection(s)
W20260923 19:32:25.524964 2930 rpcz_store.cc:267] Call kudu.rpc_test.CalculatorService.Sleep from unix:<unnamed> (request call id 2) took 20 ms (client timeout 20 ms). Trace:
W20260923 19:32:25.525102 2930 rpcz_store.cc:269] 0923 19:32:25.504530 (+ 0us) service_pool.cc:170] Inserting onto call queue
0923 19:32:25.524897 (+ 20367us) service_pool.cc:214] Skipping call since client already timed out
0923 19:32:25.524947 (+ 50us) inbound_call.cc:173] Queueing failure response
Metrics: {}
[ OK ] Parameters/TestRpc.TimedOutOnResponseMetricServiceQueue/SSL_UnixSocket (73 ms)
[ RUN ] Parameters/TestRpc.RpcPendingConnectionsMetric/SSL_UnixSocket
I20260923 19:32:25.533429 2951 acceptor_pool.cc:254] collecting diagnostics on the listening RPC socket 0.0.0.0:39081 every 8 connection(s)
I20260923 19:32:25.533609 2952 acceptor_pool.cc:254] collecting diagnostics on the listening RPC socket 0.0.0.0:39081 every 8 connection(s)
W20260923 19:32:25.535504 2947 negotiation.cc:337] Failed RPC negotiation. Trace:
0923 19:32:25.534929 (+ 0us) reactor.cc:625] Submitting negotiation task for server connection from 127.0.0.1:43248 (local address 127.0.0.1:39081)
0923 19:32:25.535065 (+ 136us) server_negotiation.cc:206] Beginning negotiation
0923 19:32:25.535069 (+ 4us) server_negotiation.cc:399] Waiting for connection header
0923 19:32:25.535206 (+ 137us) negotiation.cc:327] Negotiation complete: Network error: Server connection negotiation failed: server connection from 127.0.0.1:43248: BlockingRecv error: recv got EOF from 127.0.0.1:43248 (error 108)
Metrics: {"server-negotiator.queue_time_us":36}
[ OK ] Parameters/TestRpc.RpcPendingConnectionsMetric/SSL_UnixSocket (18 ms)
[ RUN ] Parameters/TestRpc.TestRpcContextClientDeadline/SSL_UnixSocket
I20260923 19:32:25.570971 2967 acceptor_pool.cc:254] collecting diagnostics on the listening RPC socket unix:/tmp/dist-test-taskecdlzw/test-tmp/rpc-test-b4f46594be0e4b79aa5fe231ece0a337.sock every 8 connection(s)
I20260923 19:32:25.571153 2968 acceptor_pool.cc:254] collecting diagnostics on the listening RPC socket unix:/tmp/dist-test-taskecdlzw/test-tmp/rpc-test-b4f46594be0e4b79aa5fe231ece0a337.sock every 8 connection(s)
[ OK ] Parameters/TestRpc.TestRpcContextClientDeadline/SSL_UnixSocket (77 ms)
[ RUN ] Parameters/TestRpc.TestApplicationFeatureFlagUnsupportedServer/SSL_UnixSocket
I20260923 19:32:25.641616 2992 acceptor_pool.cc:254] collecting diagnostics on the listening RPC socket unix:/tmp/dist-test-taskecdlzw/test-tmp/rpc-test-81a14ac21b574d11b8a7219d35cf0532.sock every 8 connection(s)
I20260923 19:32:25.641816 2993 acceptor_pool.cc:254] collecting diagnostics on the listening RPC socket unix:/tmp/dist-test-taskecdlzw/test-tmp/rpc-test-81a14ac21b574d11b8a7219d35cf0532.sock every 8 connection(s)
[ OK ] Parameters/TestRpc.TestApplicationFeatureFlagUnsupportedServer/SSL_UnixSocket (45 ms)
[ RUN ] Parameters/TestRpc.TestCancellationAsync/SSL_UnixSocket
I20260923 19:32:25.697952 3017 acceptor_pool.cc:254] collecting diagnostics on the listening RPC socket unix:/tmp/dist-test-taskecdlzw/test-tmp/rpc-test-3542ce63a9fb46fd9029152bb1b1cad0.sock every 8 connection(s)
I20260923 19:32:25.698134 3018 acceptor_pool.cc:254] collecting diagnostics on the listening RPC socket unix:/tmp/dist-test-taskecdlzw/test-tmp/rpc-test-3542ce63a9fb46fd9029152bb1b1cad0.sock every 8 connection(s)
I20260923 19:32:25.699082 2585 rpc-test.cc:1716] Connecting to unix:/tmp/dist-test-taskecdlzw/test-tmp/rpc-test-3542ce63a9fb46fd9029152bb1b1cad0.sock
I20260923 19:32:25.714241 2585 test_util.cc:268] Using random seed: -1962866129
I20260923 19:32:25.753403 3021 rpc-test-base.h:240] got call: sleep_micros: 500 pattern: 4294967295 num_repetitions: 2097152 sidecar_idx: 0
I20260923 19:32:25.780416 3020 rpc-test-base.h:240] got call: sleep_micros: 500 pattern: 4294967295 num_repetitions: 2097152 sidecar_idx: 0
I20260923 19:32:25.808357 3021 rpc-test-base.h:240] got call: sleep_micros: 500 pattern: 4294967295 num_repetitions: 2097152 sidecar_idx: 0
I20260923 19:32:25.834860 3020 rpc-test-base.h:240] got call: sleep_micros: 500 pattern: 4294967295 num_repetitions: 2097152 sidecar_idx: 0
I20260923 19:32:25.862705 3021 rpc-test-base.h:240] got call: sleep_micros: 500 pattern: 4294967295 num_repetitions: 2097152 sidecar_idx: 0
I20260923 19:32:25.890654 3020 rpc-test-base.h:240] got call: sleep_micros: 500 pattern: 4294967295 num_repetitions: 2097152 sidecar_idx: 0
I20260923 19:32:25.919521 3021 rpc-test-base.h:240] got call: sleep_micros: 500 pattern: 4294967295 num_repetitions: 2097152 sidecar_idx: 0
W20260923 19:32:25.922020 3014 connection.cc:196] Error closing socket: Network error: TlsSocket::Close: Broken pipe
W20260923 19:32:25.934904 3014 connection.cc:441] server connection from unix:<unnamed> torn down before Call kudu.rpc.GenericCalculatorService.SleepWithSidecar from unix:<unnamed> (request call id 8) could send its response
W20260923 19:32:25.953013 3014 connection.cc:441] server connection from unix:<unnamed> torn down before Call kudu.rpc.GenericCalculatorService.SleepWithSidecar from unix:<unnamed> (request call id 9) could send its response
[ OK ] Parameters/TestRpc.TestCancellationAsync/SSL_UnixSocket (284 ms)
[ RUN ] Parameters/TestRpc.TestPerformanceBySocketType/SSL_UnixSocket
I20260923 19:32:25.977545 3042 acceptor_pool.cc:254] collecting diagnostics on the listening RPC socket unix:/tmp/dist-test-taskecdlzw/test-tmp/rpc-test-7bc55cfc9bc645cf98b3056ac87350a2.sock every 8 connection(s)
I20260923 19:32:25.977738 3043 acceptor_pool.cc:254] collecting diagnostics on the listening RPC socket unix:/tmp/dist-test-taskecdlzw/test-tmp/rpc-test-7bc55cfc9bc645cf98b3056ac87350a2.sock every 8 connection(s)
I20260923 19:32:25.978652 2585 rpc-test.cc:1846] Connecting to unix:/tmp/dist-test-taskecdlzw/test-tmp/rpc-test-7bc55cfc9bc645cf98b3056ac87350a2.sock
I20260923 19:32:29.040169 2585 rpc-test.cc:1859] Sending 1024MB via ssl-enabled unix socket: real 3.048s user 3.209s sys 1.971s
I20260923 19:32:32.114236 2585 rpc-test.cc:1859] Sending 1024MB via ssl-enabled unix socket: real 3.074s user 3.165s sys 2.058s
I20260923 19:32:35.174225 2585 rpc-test.cc:1859] Sending 1024MB via ssl-enabled unix socket: real 3.060s user 3.010s sys 2.160s
I20260923 19:32:38.126343 2585 rpc-test.cc:1859] Sending 1024MB via ssl-enabled unix socket: real 2.952s user 2.851s sys 2.136s
I20260923 19:32:41.136749 2585 rpc-test.cc:1859] Sending 1024MB via ssl-enabled unix socket: real 3.010s user 3.031s sys 2.075s
W20260923 19:32:41.139324 3039 connection.cc:196] Error closing socket: Network error: TlsSocket::Close: Broken pipe
[ OK ] Parameters/TestRpc.TestPerformanceBySocketType/SSL_UnixSocket (15188 ms)
[----------] 20 tests from Parameters/TestRpc (48625 ms total)
[----------] 1 test from Parameters/TestRpcSocketTxRxQueue
[ RUN ] Parameters/TestRpcSocketTxRxQueue.AcceptorRxQueueSizeMetric/0
I20260923 19:32:41.152772 3067 acceptor_pool.cc:254] collecting diagnostics on the listening RPC socket 0.0.0.0:37693 every 1 connection(s)
I20260923 19:32:41.153029 3068 acceptor_pool.cc:254] collecting diagnostics on the listening RPC socket 0.0.0.0:37693 every 1 connection(s)
W20260923 19:32:41.154706 3063 negotiation.cc:337] Failed RPC negotiation. Trace:
0923 19:32:41.154295 (+ 0us) reactor.cc:625] Submitting negotiation task for server connection from 127.0.0.1:60328 (local address 127.0.0.1:37693)
0923 19:32:41.154425 (+ 130us) server_negotiation.cc:206] Beginning negotiation
0923 19:32:41.154429 (+ 4us) server_negotiation.cc:399] Waiting for connection header
0923 19:32:41.154579 (+ 150us) negotiation.cc:327] Negotiation complete: Network error: Server connection negotiation failed: server connection from 127.0.0.1:60328: BlockingRecv error: recv got EOF from 127.0.0.1:60328 (error 108)
Metrics: {"server-negotiator.queue_time_us":34}
[ OK ] Parameters/TestRpcSocketTxRxQueue.AcceptorRxQueueSizeMetric/0 (14 ms)
[----------] 1 test from Parameters/TestRpcSocketTxRxQueue (14 ms total)
[----------] Global test environment tear-down
[==========] 21 tests from 2 test suites ran. (48639 ms total)
[ PASSED ] 20 tests.
[ FAILED ] 1 test, listed below:
[ FAILED ] Parameters/TestRpc.TestCallWithChainCertAndChainCA/SSL_UnixSocket, where GetParam() = (true, true)
1 FAILED TEST