Diagnosed failure
Parameters/TestRpc.TestCallWithChainCertAndChainCA/SSL_UnixSocket: /data0/somelongdirectorytoavoidrpathissues/src/kudu/src/kudu/rpc/rpc-test.cc:270: Failure
Failed
Bad status: Runtime error: could not verify certificate chain (error with cert: subject=CN = localhost, ST = sadfjas, C = AS, emailAddress = sdflkdsajf, O = lskdfjlsad, OU = sldfkja, issuer=C = AS, ST = ASDfkjdhf, L = lskdjf, O = saldfja, OU = skdjf, CN = localhost, emailAddress = sadjflkadsj): : certificate has expired
Google Test trace:
/data0/somelongdirectorytoavoidrpathissues/src/kudu/src/kudu/rpc/rpc-test.cc:267: Connecting to unix:/tmp/dist-test-taskcKxyoc/test-tmp/rpc-test-962f80f71d10441e8bbb606622c6d8b7.sock
I20260929 22:45:31.316799 9234 test_util.cc:175] -----------------------------------------------
I20260929 22:45:31.316855 9234 test_util.cc:176] Had fatal failures, leaving test files at /tmp/dist-test-taskcKxyoc/test-tmp/rpc-test.6.Parameters_TestRpc.TestCallWithChainCertAndChainCA_SSL_UnixSocket.1790721931267733-9234-0
Full log
Note: This is test shard 7 of 8.
[==========] Running 21 tests from 2 test suites.
[----------] Global test environment set-up.
[----------] 20 tests from Parameters/TestRpc
[ RUN ] Parameters/TestRpc.TestMessengerCreateDestroy/SSL_UnixSocket
WARNING: Logging before InitGoogleLogging() is written to STDERR
I20260929 22:45:31.282943 9234 rpc-test.cc:169] started messenger TestCreateDestroy
[ OK ] Parameters/TestRpc.TestMessengerCreateDestroy/SSL_UnixSocket (13 ms)
[ RUN ] Parameters/TestRpc.TestNegotiationDeadlock/SSL_UnixSocket
I20260929 22:45:31.290764 9254 acceptor_pool.cc:254] collecting diagnostics on the listening RPC socket unix:/tmp/dist-test-taskcKxyoc/test-tmp/rpc-test-307590ad96a347c2989f780ba80c92ca.sock every 8 connection(s)
I20260929 22:45:31.290766 9255 acceptor_pool.cc:254] collecting diagnostics on the listening RPC socket unix:/tmp/dist-test-taskcKxyoc/test-tmp/rpc-test-307590ad96a347c2989f780ba80c92ca.sock every 8 connection(s)
[ OK ] Parameters/TestRpc.TestNegotiationDeadlock/SSL_UnixSocket (13 ms)
[ RUN ] Parameters/TestRpc.TestCallWithChainCertAndChainCA/SSL_UnixSocket
I20260929 22:45:31.312863 9270 acceptor_pool.cc:254] collecting diagnostics on the listening RPC socket unix:/tmp/dist-test-taskcKxyoc/test-tmp/rpc-test-962f80f71d10441e8bbb606622c6d8b7.sock every 8 connection(s)
I20260929 22:45:31.312863 9271 acceptor_pool.cc:254] collecting diagnostics on the listening RPC socket unix:/tmp/dist-test-taskcKxyoc/test-tmp/rpc-test-962f80f71d10441e8bbb606622c6d8b7.sock every 8 connection(s)
/data0/somelongdirectorytoavoidrpathissues/src/kudu/src/kudu/rpc/rpc-test.cc:270: Failure
Failed
Bad status: Runtime error: could not verify certificate chain (error with cert: subject=CN = localhost, ST = sadfjas, C = AS, emailAddress = sdflkdsajf, O = lskdfjlsad, OU = sldfkja, issuer=C = AS, ST = ASDfkjdhf, L = lskdjf, O = saldfja, OU = skdjf, CN = localhost, emailAddress = sadjflkadsj): : certificate has expired
Google Test trace:
/data0/somelongdirectorytoavoidrpathissues/src/kudu/src/kudu/rpc/rpc-test.cc:267: Connecting to unix:/tmp/dist-test-taskcKxyoc/test-tmp/rpc-test-962f80f71d10441e8bbb606622c6d8b7.sock
I20260929 22:45:31.316799 9234 test_util.cc:175] -----------------------------------------------
I20260929 22:45:31.316855 9234 test_util.cc:176] Had fatal failures, leaving test files at /tmp/dist-test-taskcKxyoc/test-tmp/rpc-test.6.Parameters_TestRpc.TestCallWithChainCertAndChainCA_SSL_UnixSocket.1790721931267733-9234-0
[ FAILED ] Parameters/TestRpc.TestCallWithChainCertAndChainCA/SSL_UnixSocket, where GetParam() = (true, true) (19 ms)
[ RUN ] Parameters/TestRpc.TestCallWithPasswordProtectedKey/SSL_UnixSocket
I20260929 22:45:31.330096 9296 acceptor_pool.cc:254] collecting diagnostics on the listening RPC socket unix:/tmp/dist-test-taskcKxyoc/test-tmp/rpc-test-362fcd1e14e04be9a6ff110f5cca2f0d.sock every 8 connection(s)
I20260929 22:45:31.330085 9295 acceptor_pool.cc:254] collecting diagnostics on the listening RPC socket unix:/tmp/dist-test-taskcKxyoc/test-tmp/rpc-test-362fcd1e14e04be9a6ff110f5cca2f0d.sock every 8 connection(s)
[ OK ] Parameters/TestRpc.TestCallWithPasswordProtectedKey/SSL_UnixSocket (25 ms)
[ RUN ] Parameters/TestRpc.TestCallToBadServer/SSL_UnixSocket
I20260929 22:45:31.360508 9234 rpc-test.cc:394] Status: Network error: Client connection negotiation failed: client connection to 0.0.0.0:0: connect: Connection refused (error 111)
I20260929 22:45:31.360774 9234 rpc-test.cc:394] Status: Network error: Client connection negotiation failed: client connection to 0.0.0.0:0: connect: Connection refused (error 111)
I20260929 22:45:31.360940 9234 rpc-test.cc:394] Status: Network error: Client connection negotiation failed: client connection to 0.0.0.0:0: connect: Connection refused (error 111)
I20260929 22:45:31.361086 9234 rpc-test.cc:394] Status: Network error: Client connection negotiation failed: client connection to 0.0.0.0:0: connect: Connection refused (error 111)
I20260929 22:45:31.361227 9234 rpc-test.cc:394] Status: Network error: Client connection negotiation failed: client connection to 0.0.0.0:0: connect: Connection refused (error 111)
[ OK ] Parameters/TestRpc.TestCallToBadServer/SSL_UnixSocket (19 ms)
[ RUN ] Parameters/TestRpc.TestWrongService/SSL_UnixSocket
I20260929 22:45:31.390518 9330 acceptor_pool.cc:254] collecting diagnostics on the listening RPC socket unix:/tmp/dist-test-taskcKxyoc/test-tmp/rpc-test-a60491bfd8244aa2bd0173dce8aa4088.sock every 8 connection(s)
I20260929 22:45:31.390542 9331 acceptor_pool.cc:254] collecting diagnostics on the listening RPC socket unix:/tmp/dist-test-taskcKxyoc/test-tmp/rpc-test-a60491bfd8244aa2bd0173dce8aa4088.sock every 8 connection(s)
I20260929 22:45:31.407582 9327 messenger.cc:345] service WrongServiceName not registered on TestServer
[ OK ] Parameters/TestRpc.TestWrongService/SSL_UnixSocket (47 ms)
[ RUN ] Parameters/TestRpc.TestConnectionKeepalive/SSL_UnixSocket
I20260929 22:45:31.428637 9353 acceptor_pool.cc:254] collecting diagnostics on the listening RPC socket unix:/tmp/dist-test-taskcKxyoc/test-tmp/rpc-test-37bfa1fb28cf4dde83b8af10e4557536.sock every 8 connection(s)
I20260929 22:45:31.428678 9354 acceptor_pool.cc:254] collecting diagnostics on the listening RPC socket unix:/tmp/dist-test-taskcKxyoc/test-tmp/rpc-test-37bfa1fb28cf4dde83b8af10e4557536.sock every 8 connection(s)
I20260929 22:45:31.428815 9234 rpc-test.cc:488] Connecting to unix:/tmp/dist-test-taskcKxyoc/test-tmp/rpc-test-37bfa1fb28cf4dde83b8af10e4557536.sock
W20260929 22:45:31.910634 9366 connection.cc:196] Error closing socket: Network error: TlsSocket::Close: Broken pipe
[ OK ] Parameters/TestRpc.TestConnectionKeepalive/SSL_UnixSocket (1044 ms)
[ RUN ] Parameters/TestRpc.TestClientConnectionMetrics/SSL_UnixSocket
I20260929 22:45:32.466361 9378 acceptor_pool.cc:254] collecting diagnostics on the listening RPC socket unix:/tmp/dist-test-taskcKxyoc/test-tmp/rpc-test-fd466d1c77a34d888eb62b4086bd1380.sock every 8 connection(s)
I20260929 22:45:32.466426 9379 acceptor_pool.cc:254] collecting diagnostics on the listening RPC socket unix:/tmp/dist-test-taskcKxyoc/test-tmp/rpc-test-fd466d1c77a34d888eb62b4086bd1380.sock every 8 connection(s)
I20260929 22:45:32.466547 9234 rpc-test.cc:569] Connecting to unix:/tmp/dist-test-taskcKxyoc/test-tmp/rpc-test-fd466d1c77a34d888eb62b4086bd1380.sock
W20260929 22:45:40.643097 9375 connection.cc:196] Error closing socket: Network error: TlsSocket::Close: Broken pipe
[ OK ] Parameters/TestRpc.TestClientConnectionMetrics/SSL_UnixSocket (8190 ms)
[ RUN ] Parameters/TestRpc.TestCredentialsPolicy/SSL_UnixSocket
I20260929 22:45:40.668392 9401 acceptor_pool.cc:254] collecting diagnostics on the listening RPC socket unix:/tmp/dist-test-taskcKxyoc/test-tmp/rpc-test-9e65ec293b164ea29a0b5e132267d147.sock every 8 connection(s)
I20260929 22:45:40.668422 9402 acceptor_pool.cc:254] collecting diagnostics on the listening RPC socket unix:/tmp/dist-test-taskcKxyoc/test-tmp/rpc-test-9e65ec293b164ea29a0b5e132267d147.sock every 8 connection(s)
I20260929 22:45:40.668557 9234 rpc-test.cc:700] Connecting to unix:/tmp/dist-test-taskcKxyoc/test-tmp/rpc-test-9e65ec293b164ea29a0b5e132267d147.sock
W20260929 22:45:40.689465 9400 connection.cc:196] Error closing socket: Network error: TlsSocket::Close: Broken pipe
W20260929 22:45:40.692867 9400 connection.cc:196] Error closing socket: Network error: TlsSocket::Close: Broken pipe
[ OK ] Parameters/TestRpc.TestCredentialsPolicy/SSL_UnixSocket (49 ms)
[ RUN ] Parameters/TestRpc.TestCallLongerThanKeepalive/SSL_UnixSocket
I20260929 22:45:40.723606 9426 acceptor_pool.cc:254] collecting diagnostics on the listening RPC socket unix:/tmp/dist-test-taskcKxyoc/test-tmp/rpc-test-b03da507cda44bab8321d0b72fc1481d.sock every 8 connection(s)
I20260929 22:45:40.723611 9427 acceptor_pool.cc:254] collecting diagnostics on the listening RPC socket unix:/tmp/dist-test-taskcKxyoc/test-tmp/rpc-test-b03da507cda44bab8321d0b72fc1481d.sock every 8 connection(s)
I20260929 22:45:40.739694 9430 rpc-test-base.h:222] got call: sleep_micros: 3000000 deferred: true
I20260929 22:45:43.740398 9430 rpcz_store.cc:275] Call kudu.rpc.GenericCalculatorService.Sleep from unix:<unnamed> (request call id 0) took 3000 ms. Trace:
I20260929 22:45:43.740504 9430 rpcz_store.cc:276] 0929 22:45:40.739646 (+ 0us) service_pool.cc:170] Inserting onto call queue
0929 22:45:40.739677 (+ 31us) service_pool.cc:227] Handling call
0929 22:45:43.740380 (+3000703us) inbound_call.cc:173] Queueing success response
Metrics: {}
[ OK ] Parameters/TestRpc.TestCallLongerThanKeepalive/SSL_UnixSocket (3048 ms)
[ RUN ] Parameters/TestRpc.TestRpcSidecar/SSL_UnixSocket
I20260929 22:45:43.755882 9451 acceptor_pool.cc:254] collecting diagnostics on the listening RPC socket unix:/tmp/dist-test-taskcKxyoc/test-tmp/rpc-test-017a04ee626d457ead2b8a10e47fe154.sock every 8 connection(s)
I20260929 22:45:43.755918 9452 acceptor_pool.cc:254] collecting diagnostics on the listening RPC socket unix:/tmp/dist-test-taskcKxyoc/test-tmp/rpc-test-017a04ee626d457ead2b8a10e47fe154.sock every 8 connection(s)
W20260929 22:45:43.793746 9448 connection.cc:196] Error closing socket: Network error: TlsSocket::Close: Broken pipe
[ OK ] Parameters/TestRpc.TestRpcSidecar/SSL_UnixSocket (52 ms)
[ RUN ] Parameters/TestRpc.TestRpcSidecarLimits/SSL_UnixSocket
I20260929 22:45:45.327386 9476 acceptor_pool.cc:254] collecting diagnostics on the listening RPC socket unix:/tmp/dist-test-taskcKxyoc/test-tmp/rpc-test-52b81c311350495889d0ee942df31a4a.sock every 8 connection(s)
I20260929 22:45:45.327455 9477 acceptor_pool.cc:254] collecting diagnostics on the listening RPC socket unix:/tmp/dist-test-taskcKxyoc/test-tmp/rpc-test-52b81c311350495889d0ee942df31a4a.sock every 8 connection(s)
W20260929 22:45:45.343775 9234 serialization.cc:72] Serialized kudu.rpc_test.PushStringsRequestPB (2147483654 bytes) is larger than the maximum configured RPC message size (52428800 bytes). Sending anyway, but peer may reject the data.
W20260929 22:45:45.347224 9473 connection.cc:535] server connection from unix:<unnamed> recv error: Network error: RPC frame had a length of 2147483714, but we only support messages up to 52428800 bytes long.
W20260929 22:45:45.347296 9473 connection.cc:158] shutting down server connection from unix:<unnamed> with pending inbound data: 4/2147483714 bytes received; last active 0 ns ago: status Network error: RPC frame had a length of 2147483714, but we only support messages up to 52428800 bytes long.
W20260929 22:45:45.347494 9489 connection.cc:698] client connection to unix:/tmp/dist-test-taskcKxyoc/test-tmp/rpc-test-52b81c311350495889d0ee942df31a4a.sock send error: Network error: failed to write to TLS socket: Broken pipe
W20260929 22:45:45.347617 9489 connection.cc:196] Error closing socket: Network error: TlsSocket::Close: Success
I20260929 22:45:45.356032 9501 acceptor_pool.cc:254] collecting diagnostics on the listening RPC socket unix:/tmp/dist-test-taskcKxyoc/test-tmp/rpc-test-52b81c311350495889d0ee942df31a4a.sock every 8 connection(s)
I20260929 22:45:45.356051 9502 acceptor_pool.cc:254] collecting diagnostics on the listening RPC socket unix:/tmp/dist-test-taskcKxyoc/test-tmp/rpc-test-52b81c311350495889d0ee942df31a4a.sock every 8 connection(s)
W20260929 22:45:51.388509 9498 connection.cc:577] server connection from unix:<unnamed>: received bad data: 'Corruption: Invalid packet: message had a length of 2147483710, but we only support messages up to 2147483647 bytes
'
W20260929 22:45:51.388916 9514 connection.cc:196] Error closing socket: Network error: TlsSocket::Close: Broken pipe
[ OK ] Parameters/TestRpc.TestRpcSidecarLimits/SSL_UnixSocket (7595 ms)
[ RUN ] Parameters/TestRpc.TestCallTimeoutDoesntAffectNegotiation/SSL_UnixSocket
I20260929 22:45:51.398484 9526 acceptor_pool.cc:254] collecting diagnostics on the listening RPC socket unix:/tmp/dist-test-taskcKxyoc/test-tmp/rpc-test-9f403c68fd4f4c9ea48d3b4fd56b901a.sock every 8 connection(s)
I20260929 22:45:51.398545 9527 acceptor_pool.cc:254] collecting diagnostics on the listening RPC socket unix:/tmp/dist-test-taskcKxyoc/test-tmp/rpc-test-9f403c68fd4f4c9ea48d3b4fd56b901a.sock every 8 connection(s)
W20260929 22:45:51.406101 9522 negotiation.cc:266] Injecting 500ms delay in negotiation
I20260929 22:45:51.456497 9234 rpc-test-base.h:595] status: Timed out: connection negotiation to unix:/tmp/dist-test-taskcKxyoc/test-tmp/rpc-test-9f403c68fd4f4c9ea48d3b4fd56b901a.sock for RPC Sleep timed out after 0.050s (ON_OUTBOUND_QUEUE), seconds elapsed: 0.050648
W20260929 22:45:51.915030 9523 connection.cc:196] Error closing socket: Network error: TlsSocket::Close: Broken pipe
[ OK ] Parameters/TestRpc.TestCallTimeoutDoesntAffectNegotiation/SSL_UnixSocket (525 ms)
[ RUN ] Parameters/TestRpc.TestRpcHandlerLatencyMetric/SSL_UnixSocket
I20260929 22:45:51.942108 9551 acceptor_pool.cc:254] collecting diagnostics on the listening RPC socket unix:/tmp/dist-test-taskcKxyoc/test-tmp/rpc-test-31b4c2df92d844948d8f08abca960ba5.sock every 8 connection(s)
I20260929 22:45:51.942137 9552 acceptor_pool.cc:254] collecting diagnostics on the listening RPC socket unix:/tmp/dist-test-taskcKxyoc/test-tmp/rpc-test-31b4c2df92d844948d8f08abca960ba5.sock every 8 connection(s)
I20260929 22:45:51.971072 9234 rpc-test.cc:1236] Sleep() min lat: 20290
I20260929 22:45:51.971146 9234 rpc-test.cc:1237] Sleep() mean lat: 20290
I20260929 22:45:51.971171 9234 rpc-test.cc:1238] Sleep() max lat: 20290
I20260929 22:45:51.971184 9234 rpc-test.cc:1239] Sleep() #calls: 1
[ OK ] Parameters/TestRpc.TestRpcHandlerLatencyMetric/SSL_UnixSocket (55 ms)
[ RUN ] Parameters/TestRpc.TimedOutOnResponseMetricServiceQueue/SSL_UnixSocket
I20260929 22:45:51.983896 9577 acceptor_pool.cc:254] collecting diagnostics on the listening RPC socket unix:/tmp/dist-test-taskcKxyoc/test-tmp/rpc-test-631d4d4cecb8443296f4fb184d37ac44.sock every 8 connection(s)
I20260929 22:45:51.983913 9578 acceptor_pool.cc:254] collecting diagnostics on the listening RPC socket unix:/tmp/dist-test-taskcKxyoc/test-tmp/rpc-test-631d4d4cecb8443296f4fb184d37ac44.sock every 8 connection(s)
W20260929 22:45:52.053129 9579 rpcz_store.cc:267] Call kudu.rpc_test.CalculatorService.Sleep from unix:<unnamed> (request call id 2) took 20 ms (client timeout 20 ms). Trace:
W20260929 22:45:52.053229 9579 rpcz_store.cc:269] 0929 22:45:52.032857 (+ 0us) service_pool.cc:170] Inserting onto call queue
0929 22:45:52.053106 (+ 20249us) service_pool.cc:214] Skipping call since client already timed out
0929 22:45:52.053115 (+ 9us) inbound_call.cc:173] Queueing failure response
Metrics: {}
[ OK ] Parameters/TestRpc.TimedOutOnResponseMetricServiceQueue/SSL_UnixSocket (81 ms)
[ RUN ] Parameters/TestRpc.RpcPendingConnectionsMetric/SSL_UnixSocket
I20260929 22:45:52.056352 9601 acceptor_pool.cc:254] collecting diagnostics on the listening RPC socket 0.0.0.0:33013 every 8 connection(s)
I20260929 22:45:52.056352 9600 acceptor_pool.cc:254] collecting diagnostics on the listening RPC socket 0.0.0.0:33013 every 8 connection(s)
W20260929 22:45:52.056921 9596 negotiation.cc:337] Failed RPC negotiation. Trace:
0929 22:45:52.056736 (+ 0us) reactor.cc:625] Submitting negotiation task for server connection from 127.0.0.1:47042 (local address 127.0.0.1:33013)
0929 22:45:52.056787 (+ 51us) server_negotiation.cc:206] Beginning negotiation
0929 22:45:52.056789 (+ 2us) server_negotiation.cc:399] Waiting for connection header
0929 22:45:52.056861 (+ 72us) negotiation.cc:327] Negotiation complete: Network error: Server connection negotiation failed: server connection from 127.0.0.1:47042: BlockingRecv error: recv got EOF from 127.0.0.1:47042 (error 108)
Metrics: {"server-negotiator.queue_time_us":24}
[ OK ] Parameters/TestRpc.RpcPendingConnectionsMetric/SSL_UnixSocket (13 ms)
[ RUN ] Parameters/TestRpc.TestRpcContextClientDeadline/SSL_UnixSocket
I20260929 22:45:52.101429 9616 acceptor_pool.cc:254] collecting diagnostics on the listening RPC socket unix:/tmp/dist-test-taskcKxyoc/test-tmp/rpc-test-6d17bb3cd19247d7b6517622b5279cbe.sock every 8 connection(s)
I20260929 22:45:52.101502 9617 acceptor_pool.cc:254] collecting diagnostics on the listening RPC socket unix:/tmp/dist-test-taskcKxyoc/test-tmp/rpc-test-6d17bb3cd19247d7b6517622b5279cbe.sock every 8 connection(s)
[ OK ] Parameters/TestRpc.TestRpcContextClientDeadline/SSL_UnixSocket (81 ms)
[ RUN ] Parameters/TestRpc.TestApplicationFeatureFlagUnsupportedServer/SSL_UnixSocket
I20260929 22:45:52.169493 9641 acceptor_pool.cc:254] collecting diagnostics on the listening RPC socket unix:/tmp/dist-test-taskcKxyoc/test-tmp/rpc-test-91f58129814c447993d632579e9a5518.sock every 8 connection(s)
I20260929 22:45:52.169543 9642 acceptor_pool.cc:254] collecting diagnostics on the listening RPC socket unix:/tmp/dist-test-taskcKxyoc/test-tmp/rpc-test-91f58129814c447993d632579e9a5518.sock every 8 connection(s)
[ OK ] Parameters/TestRpc.TestApplicationFeatureFlagUnsupportedServer/SSL_UnixSocket (31 ms)
[ RUN ] Parameters/TestRpc.TestCancellationAsync/SSL_UnixSocket
I20260929 22:45:52.205479 9666 acceptor_pool.cc:254] collecting diagnostics on the listening RPC socket unix:/tmp/dist-test-taskcKxyoc/test-tmp/rpc-test-4a4f2a15e6794604a76271aa59115034.sock every 8 connection(s)
I20260929 22:45:52.205511 9667 acceptor_pool.cc:254] collecting diagnostics on the listening RPC socket unix:/tmp/dist-test-taskcKxyoc/test-tmp/rpc-test-4a4f2a15e6794604a76271aa59115034.sock every 8 connection(s)
I20260929 22:45:52.205662 9234 rpc-test.cc:1716] Connecting to unix:/tmp/dist-test-taskcKxyoc/test-tmp/rpc-test-4a4f2a15e6794604a76271aa59115034.sock
I20260929 22:45:52.222252 9234 test_util.cc:268] Using random seed: -237335519
I20260929 22:45:52.236150 9670 rpc-test-base.h:240] got call: sleep_micros: 500 pattern: 4294967295 num_repetitions: 2097152 sidecar_idx: 0
I20260929 22:45:52.246500 9670 rpc-test-base.h:240] got call: sleep_micros: 500 pattern: 4294967295 num_repetitions: 2097152 sidecar_idx: 0
I20260929 22:45:52.257170 9670 rpc-test-base.h:240] got call: sleep_micros: 500 pattern: 4294967295 num_repetitions: 2097152 sidecar_idx: 0
I20260929 22:45:52.267778 9670 rpc-test-base.h:240] got call: sleep_micros: 500 pattern: 4294967295 num_repetitions: 2097152 sidecar_idx: 0
I20260929 22:45:52.279253 9670 rpc-test-base.h:240] got call: sleep_micros: 500 pattern: 4294967295 num_repetitions: 2097152 sidecar_idx: 0
I20260929 22:45:52.290485 9670 rpc-test-base.h:240] got call: sleep_micros: 500 pattern: 4294967295 num_repetitions: 2097152 sidecar_idx: 0
I20260929 22:45:52.301949 9670 rpc-test-base.h:240] got call: sleep_micros: 500 pattern: 4294967295 num_repetitions: 2097152 sidecar_idx: 0
I20260929 22:45:52.314674 9670 rpc-test-base.h:240] got call: sleep_micros: 500 pattern: 4294967295 num_repetitions: 2097152 sidecar_idx: 0
W20260929 22:45:52.316370 9663 connection.cc:196] Error closing socket: Network error: TlsSocket::Close: Broken pipe
W20260929 22:45:52.317755 9663 connection.cc:441] server connection from unix:<unnamed> torn down before Call kudu.rpc.GenericCalculatorService.SleepWithSidecar from unix:<unnamed> (request call id 9) could send its response
[ OK ] Parameters/TestRpc.TestCancellationAsync/SSL_UnixSocket (136 ms)
[ RUN ] Parameters/TestRpc.TestPerformanceBySocketType/SSL_UnixSocket
I20260929 22:45:52.336329 9691 acceptor_pool.cc:254] collecting diagnostics on the listening RPC socket unix:/tmp/dist-test-taskcKxyoc/test-tmp/rpc-test-244c7554419a473d936b58bba5e332b5.sock every 8 connection(s)
I20260929 22:45:52.336361 9692 acceptor_pool.cc:254] collecting diagnostics on the listening RPC socket unix:/tmp/dist-test-taskcKxyoc/test-tmp/rpc-test-244c7554419a473d936b58bba5e332b5.sock every 8 connection(s)
I20260929 22:45:52.336494 9234 rpc-test.cc:1846] Connecting to unix:/tmp/dist-test-taskcKxyoc/test-tmp/rpc-test-244c7554419a473d936b58bba5e332b5.sock
I20260929 22:45:53.675016 9234 rpc-test.cc:1859] Sending 1024MB via ssl-enabled unix socket: real 1.301s user 1.468s sys 0.833s
I20260929 22:45:55.049583 9234 rpc-test.cc:1859] Sending 1024MB via ssl-enabled unix socket: real 1.374s user 1.478s sys 0.954s
I20260929 22:45:56.370464 9234 rpc-test.cc:1859] Sending 1024MB via ssl-enabled unix socket: real 1.321s user 1.424s sys 0.914s
I20260929 22:45:57.736518 9234 rpc-test.cc:1859] Sending 1024MB via ssl-enabled unix socket: real 1.366s user 1.533s sys 0.894s
I20260929 22:45:59.060550 9234 rpc-test.cc:1859] Sending 1024MB via ssl-enabled unix socket: real 1.324s user 1.383s sys 0.967s
[ OK ] Parameters/TestRpc.TestPerformanceBySocketType/SSL_UnixSocket (6742 ms)
[----------] 20 tests from Parameters/TestRpc (27791 ms total)
[----------] 1 test from Parameters/TestRpcSocketTxRxQueue
[ RUN ] Parameters/TestRpcSocketTxRxQueue.AcceptorRxQueueSizeMetric/0
I20260929 22:45:59.067930 9716 acceptor_pool.cc:254] collecting diagnostics on the listening RPC socket 0.0.0.0:36183 every 1 connection(s)
I20260929 22:45:59.068017 9717 acceptor_pool.cc:254] collecting diagnostics on the listening RPC socket 0.0.0.0:36183 every 1 connection(s)
W20260929 22:45:59.068634 9712 negotiation.cc:337] Failed RPC negotiation. Trace:
0929 22:45:59.068497 (+ 0us) reactor.cc:625] Submitting negotiation task for server connection from 127.0.0.1:44878 (local address 127.0.0.1:36183)
0929 22:45:59.068542 (+ 45us) server_negotiation.cc:206] Beginning negotiation
0929 22:45:59.068545 (+ 3us) server_negotiation.cc:399] Waiting for connection header
0929 22:45:59.068603 (+ 58us) negotiation.cc:327] Negotiation complete: Network error: Server connection negotiation failed: server connection from 127.0.0.1:44878: BlockingRecv error: recv got EOF from 127.0.0.1:44878 (error 108)
Metrics: {"server-negotiator.queue_time_us":17}
[ OK ] Parameters/TestRpcSocketTxRxQueue.AcceptorRxQueueSizeMetric/0 (8 ms)
[----------] 1 test from Parameters/TestRpcSocketTxRxQueue (8 ms total)
[----------] Global test environment tear-down
[==========] 21 tests from 2 test suites ran. (27800 ms total)
[ PASSED ] 20 tests.
[ FAILED ] 1 test, listed below:
[ FAILED ] Parameters/TestRpc.TestCallWithChainCertAndChainCA/SSL_UnixSocket, where GetParam() = (true, true)
1 FAILED TEST