Diagnosed failure

Parameters/TestRpc.TestCallWithChainCertAndChainCA/SSL_TCP: /data0/somelongdirectorytoavoidrpathissues/src/kudu/src/kudu/rpc/rpc-test.cc:270: Failure
Failed
Bad status: Runtime error: could not verify certificate chain (error with cert: subject=CN = localhost, ST = sadfjas, C = AS, emailAddress = sdflkdsajf, O = lskdfjlsad, OU = sldfkja, issuer=C = AS, ST = ASDfkjdhf, L = lskdjf, O = saldfja, OU = skdjf, CN = localhost, emailAddress = sadjflkadsj): : certificate has expired
Google Test trace:
/data0/somelongdirectorytoavoidrpathissues/src/kudu/src/kudu/rpc/rpc-test.cc:267: Connecting to 0.0.0.0:36773
I20260928 14:54:09.497818 30457 test_util.cc:175] -----------------------------------------------
I20260928 14:54:09.497895 30457 test_util.cc:176] Had fatal failures, leaving test files at /tmp/dist-test-taskAyJgLk/test-tmp/rpc-test.5.Parameters_TestRpc.TestCallWithChainCertAndChainCA_SSL_TCP.1790607249395528-30457-0

Full log

Note: This is test shard 6 of 8.
[==========] Running 21 tests from 2 test suites.
[----------] Global test environment set-up.
[----------] 20 tests from Parameters/TestRpc
[ RUN      ] Parameters/TestRpc.TestMessengerCreateDestroy/SSL_TCP
WARNING: Logging before InitGoogleLogging() is written to STDERR
I20260928 14:54:09.435563 30457 rpc-test.cc:169] started messenger TestCreateDestroy
[       OK ] Parameters/TestRpc.TestMessengerCreateDestroy/SSL_TCP (38 ms)
[ RUN      ] Parameters/TestRpc.TestNegotiationDeadlock/SSL_TCP
I20260928 14:54:09.455703 30477 acceptor_pool.cc:254] collecting diagnostics on the listening RPC socket 0.0.0.0:35507 every 8 connection(s)
I20260928 14:54:09.455693 30478 acceptor_pool.cc:254] collecting diagnostics on the listening RPC socket 0.0.0.0:35507 every 8 connection(s)
[       OK ] Parameters/TestRpc.TestNegotiationDeadlock/SSL_TCP (27 ms)
[ RUN      ] Parameters/TestRpc.TestCallWithChainCertAndChainCA/SSL_TCP
I20260928 14:54:09.493196 30493 acceptor_pool.cc:254] collecting diagnostics on the listening RPC socket 0.0.0.0:36773 every 8 connection(s)
I20260928 14:54:09.493228 30494 acceptor_pool.cc:254] collecting diagnostics on the listening RPC socket 0.0.0.0:36773 every 8 connection(s)
/data0/somelongdirectorytoavoidrpathissues/src/kudu/src/kudu/rpc/rpc-test.cc:270: Failure
Failed
Bad status: Runtime error: could not verify certificate chain (error with cert: subject=CN = localhost, ST = sadfjas, C = AS, emailAddress = sdflkdsajf, O = lskdfjlsad, OU = sldfkja, issuer=C = AS, ST = ASDfkjdhf, L = lskdjf, O = saldfja, OU = skdjf, CN = localhost, emailAddress = sadjflkadsj): : certificate has expired
Google Test trace:
/data0/somelongdirectorytoavoidrpathissues/src/kudu/src/kudu/rpc/rpc-test.cc:267: Connecting to 0.0.0.0:36773
I20260928 14:54:09.497818 30457 test_util.cc:175] -----------------------------------------------
I20260928 14:54:09.497895 30457 test_util.cc:176] Had fatal failures, leaving test files at /tmp/dist-test-taskAyJgLk/test-tmp/rpc-test.5.Parameters_TestRpc.TestCallWithChainCertAndChainCA_SSL_TCP.1790607249395528-30457-0
[  FAILED  ] Parameters/TestRpc.TestCallWithChainCertAndChainCA/SSL_TCP, where GetParam() = (true, false) (34 ms)
[ RUN      ] Parameters/TestRpc.TestCallWithPasswordProtectedKey/SSL_TCP
I20260928 14:54:09.508651 30518 acceptor_pool.cc:254] collecting diagnostics on the listening RPC socket 0.0.0.0:33301 every 8 connection(s)
I20260928 14:54:09.508642 30519 acceptor_pool.cc:254] collecting diagnostics on the listening RPC socket 0.0.0.0:33301 every 8 connection(s)
[       OK ] Parameters/TestRpc.TestCallWithPasswordProtectedKey/SSL_TCP (25 ms)
[ RUN      ] Parameters/TestRpc.TestCallToBadServer/SSL_TCP
I20260928 14:54:09.541188 30457 rpc-test.cc:394] Status: Network error: Client connection negotiation failed: client connection to 0.0.0.0:0: connect: Connection refused (error 111)
I20260928 14:54:09.541527 30457 rpc-test.cc:394] Status: Network error: Client connection negotiation failed: client connection to 0.0.0.0:0: connect: Connection refused (error 111)
I20260928 14:54:09.541915 30457 rpc-test.cc:394] Status: Network error: Client connection negotiation failed: client connection to 0.0.0.0:0: connect: Connection refused (error 111)
I20260928 14:54:09.542155 30457 rpc-test.cc:394] Status: Network error: Client connection negotiation failed: client connection to 0.0.0.0:0: connect: Connection refused (error 111)
I20260928 14:54:09.542402 30457 rpc-test.cc:394] Status: Network error: Client connection negotiation failed: client connection to 0.0.0.0:0: connect: Connection refused (error 111)
[       OK ] Parameters/TestRpc.TestCallToBadServer/SSL_TCP (19 ms)
[ RUN      ] Parameters/TestRpc.TestWrongService/SSL_TCP
I20260928 14:54:09.555663 30554 acceptor_pool.cc:254] collecting diagnostics on the listening RPC socket 0.0.0.0:39547 every 8 connection(s)
I20260928 14:54:09.555678 30553 acceptor_pool.cc:254] collecting diagnostics on the listening RPC socket 0.0.0.0:39547 every 8 connection(s)
I20260928 14:54:09.572229 30550 messenger.cc:345] service WrongServiceName not registered on TestServer
[       OK ] Parameters/TestRpc.TestWrongService/SSL_TCP (31 ms)
[ RUN      ] Parameters/TestRpc.TestConnectionKeepalive/SSL_TCP
I20260928 14:54:09.603199 30576 acceptor_pool.cc:254] collecting diagnostics on the listening RPC socket 0.0.0.0:45955 every 8 connection(s)
I20260928 14:54:09.603219 30577 acceptor_pool.cc:254] collecting diagnostics on the listening RPC socket 0.0.0.0:45955 every 8 connection(s)
I20260928 14:54:09.603396 30457 rpc-test.cc:488] Connecting to 0.0.0.0:45955
[       OK ] Parameters/TestRpc.TestConnectionKeepalive/SSL_TCP (1055 ms)
[ RUN      ] Parameters/TestRpc.TestClientConnectionMetrics/SSL_TCP
I20260928 14:54:10.646868 30601 acceptor_pool.cc:254] collecting diagnostics on the listening RPC socket 0.0.0.0:37945 every 8 connection(s)
I20260928 14:54:10.646872 30602 acceptor_pool.cc:254] collecting diagnostics on the listening RPC socket 0.0.0.0:37945 every 8 connection(s)
I20260928 14:54:10.647042 30457 rpc-test.cc:569] Connecting to 0.0.0.0:37945
[       OK ] Parameters/TestRpc.TestClientConnectionMetrics/SSL_TCP (9895 ms)
[ RUN      ] Parameters/TestRpc.TestCredentialsPolicy/SSL_TCP
I20260928 14:54:20.539009 30624 acceptor_pool.cc:254] collecting diagnostics on the listening RPC socket 0.0.0.0:43637 every 8 connection(s)
I20260928 14:54:20.539064 30625 acceptor_pool.cc:254] collecting diagnostics on the listening RPC socket 0.0.0.0:43637 every 8 connection(s)
I20260928 14:54:20.539215 30457 rpc-test.cc:700] Connecting to 0.0.0.0:43637
[       OK ] Parameters/TestRpc.TestCredentialsPolicy/SSL_TCP (42 ms)
[ RUN      ] Parameters/TestRpc.TestCallLongerThanKeepalive/SSL_TCP
I20260928 14:54:20.593525 30649 acceptor_pool.cc:254] collecting diagnostics on the listening RPC socket 0.0.0.0:36199 every 8 connection(s)
I20260928 14:54:20.593571 30650 acceptor_pool.cc:254] collecting diagnostics on the listening RPC socket 0.0.0.0:36199 every 8 connection(s)
I20260928 14:54:20.623646 30652 rpc-test-base.h:222] got call: sleep_micros: 3000000 deferred: true
I20260928 14:54:23.624594 30652 rpcz_store.cc:275] Call kudu.rpc.GenericCalculatorService.Sleep from 127.0.0.1:44064 (request call id 0) took 3001 ms. Trace:
I20260928 14:54:23.624758 30652 rpcz_store.cc:276] 0928 14:54:20.623491 (+     0us) service_pool.cc:170] Inserting onto call queue
0928 14:54:20.623539 (+    48us) service_pool.cc:227] Handling call
0928 14:54:23.624569 (+3001030us) inbound_call.cc:173] Queueing success response
Metrics: {}
[       OK ] Parameters/TestRpc.TestCallLongerThanKeepalive/SSL_TCP (3059 ms)
[ RUN      ] Parameters/TestRpc.TestRpcSidecar/SSL_TCP
I20260928 14:54:23.645728 30675 acceptor_pool.cc:254] collecting diagnostics on the listening RPC socket 0.0.0.0:35325 every 8 connection(s)
I20260928 14:54:23.645853 30674 acceptor_pool.cc:254] collecting diagnostics on the listening RPC socket 0.0.0.0:35325 every 8 connection(s)
[       OK ] Parameters/TestRpc.TestRpcSidecar/SSL_TCP (70 ms)
[ RUN      ] Parameters/TestRpc.TestRpcSidecarLimits/SSL_TCP
I20260928 14:54:27.146704 30699 acceptor_pool.cc:254] collecting diagnostics on the listening RPC socket 0.0.0.0:44495 every 8 connection(s)
I20260928 14:54:27.146740 30700 acceptor_pool.cc:254] collecting diagnostics on the listening RPC socket 0.0.0.0:44495 every 8 connection(s)
W20260928 14:54:27.162837 30457 serialization.cc:72] Serialized kudu.rpc_test.PushStringsRequestPB (2147483654 bytes) is larger than the maximum configured RPC message size (52428800 bytes). Sending anyway, but peer may reject the data.
W20260928 14:54:27.166870 30697 connection.cc:535] server connection from 127.0.0.1:42318 recv error: Network error: RPC frame had a length of 2147483714, but we only support messages up to 52428800 bytes long.
W20260928 14:54:27.166947 30697 connection.cc:158] shutting down server connection from 127.0.0.1:42318 with pending inbound data: 4/2147483714 bytes received; last active 0 ns ago: status Network error: RPC frame had a length of 2147483714, but we only support messages up to 52428800 bytes long.
W20260928 14:54:27.167179 30712 connection.cc:196] Error closing socket: Network error: TlsSocket::Close: Connection reset by peer
I20260928 14:54:27.193017 30724 acceptor_pool.cc:254] collecting diagnostics on the listening RPC socket 0.0.0.0:35323 every 8 connection(s)
I20260928 14:54:27.193051 30725 acceptor_pool.cc:254] collecting diagnostics on the listening RPC socket 0.0.0.0:35323 every 8 connection(s)
W20260928 14:54:32.348398 30722 connection.cc:577] server connection from 127.0.0.1:37054: received bad data: 'Corruption: Invalid packet: message had a length of 2147483710, but we only support messages up to 2147483647 bytes
'
[       OK ] Parameters/TestRpc.TestRpcSidecarLimits/SSL_TCP (8653 ms)
[ RUN      ] Parameters/TestRpc.TestCallTimeoutDoesntAffectNegotiation/SSL_TCP
I20260928 14:54:32.375200 30750 acceptor_pool.cc:254] collecting diagnostics on the listening RPC socket 0.0.0.0:35351 every 8 connection(s)
I20260928 14:54:32.375200 30749 acceptor_pool.cc:254] collecting diagnostics on the listening RPC socket 0.0.0.0:35351 every 8 connection(s)
W20260928 14:54:32.383149 30745 negotiation.cc:266] Injecting 500ms delay in negotiation
I20260928 14:54:32.433547 30457 rpc-test-base.h:595] status: Timed out: connection negotiation to 0.0.0.0:35351 for RPC Sleep timed out after 0.050s (ON_OUTBOUND_QUEUE), seconds elapsed: 0.0508239
[       OK ] Parameters/TestRpc.TestCallTimeoutDoesntAffectNegotiation/SSL_TCP (538 ms)
[ RUN      ] Parameters/TestRpc.TestRpcHandlerLatencyMetric/SSL_TCP
I20260928 14:54:32.900764 30774 acceptor_pool.cc:254] collecting diagnostics on the listening RPC socket 0.0.0.0:35879 every 8 connection(s)
I20260928 14:54:32.900854 30775 acceptor_pool.cc:254] collecting diagnostics on the listening RPC socket 0.0.0.0:35879 every 8 connection(s)
I20260928 14:54:32.935549 30457 rpc-test.cc:1236] Sleep() min lat: 20363
I20260928 14:54:32.935644 30457 rpc-test.cc:1237] Sleep() mean lat: 20363
I20260928 14:54:32.935676 30457 rpc-test.cc:1238] Sleep() max lat: 20363
I20260928 14:54:32.935689 30457 rpc-test.cc:1239] Sleep() #calls: 1
[       OK ] Parameters/TestRpc.TestRpcHandlerLatencyMetric/SSL_TCP (47 ms)
[ RUN      ] Parameters/TestRpc.TimedOutOnResponseMetricServiceQueue/SSL_TCP
I20260928 14:54:32.942871 30800 acceptor_pool.cc:254] collecting diagnostics on the listening RPC socket 0.0.0.0:33223 every 8 connection(s)
I20260928 14:54:32.942927 30801 acceptor_pool.cc:254] collecting diagnostics on the listening RPC socket 0.0.0.0:33223 every 8 connection(s)
W20260928 14:54:32.996343 30802 rpcz_store.cc:267] Call kudu.rpc_test.CalculatorService.Sleep from 127.0.0.1:42748 (request call id 2) took 20 ms (client timeout 20 ms). Trace:
W20260928 14:54:32.996475 30802 rpcz_store.cc:269] 0928 14:54:32.975971 (+     0us) service_pool.cc:170] Inserting onto call queue
0928 14:54:32.996270 (+ 20299us) service_pool.cc:214] Skipping call since client already timed out
0928 14:54:32.996287 (+    17us) inbound_call.cc:173] Queueing failure response
Metrics: {}
[       OK ] Parameters/TestRpc.TimedOutOnResponseMetricServiceQueue/SSL_TCP (60 ms)
[ RUN      ] Parameters/TestRpc.RpcPendingConnectionsMetric/SSL_TCP
I20260928 14:54:33.000275 30823 acceptor_pool.cc:254] collecting diagnostics on the listening RPC socket 0.0.0.0:43213 every 8 connection(s)
I20260928 14:54:33.000335 30824 acceptor_pool.cc:254] collecting diagnostics on the listening RPC socket 0.0.0.0:43213 every 8 connection(s)
W20260928 14:54:33.000979 30819 negotiation.cc:337] Failed RPC negotiation. Trace:
0928 14:54:33.000785 (+     0us) reactor.cc:625] Submitting negotiation task for server connection from 127.0.0.1:32888 (local address 127.0.0.1:43213)
0928 14:54:33.000834 (+    49us) server_negotiation.cc:206] Beginning negotiation
0928 14:54:33.000836 (+     2us) server_negotiation.cc:399] Waiting for connection header
0928 14:54:33.000914 (+    78us) negotiation.cc:327] Negotiation complete: Network error: Server connection negotiation failed: server connection from 127.0.0.1:32888: BlockingRecv error: recv got EOF from 127.0.0.1:32888 (error 108)
Metrics: {"server-negotiator.queue_time_us":14}
[       OK ] Parameters/TestRpc.RpcPendingConnectionsMetric/SSL_TCP (13 ms)
[ RUN      ] Parameters/TestRpc.TestRpcContextClientDeadline/SSL_TCP
I20260928 14:54:33.034765 30840 acceptor_pool.cc:254] collecting diagnostics on the listening RPC socket 0.0.0.0:39411 every 8 connection(s)
I20260928 14:54:33.034802 30839 acceptor_pool.cc:254] collecting diagnostics on the listening RPC socket 0.0.0.0:39411 every 8 connection(s)
[       OK ] Parameters/TestRpc.TestRpcContextClientDeadline/SSL_TCP (54 ms)
[ RUN      ] Parameters/TestRpc.TestApplicationFeatureFlagUnsupportedServer/SSL_TCP
I20260928 14:54:33.083961 30864 acceptor_pool.cc:254] collecting diagnostics on the listening RPC socket 0.0.0.0:34993 every 8 connection(s)
I20260928 14:54:33.084016 30865 acceptor_pool.cc:254] collecting diagnostics on the listening RPC socket 0.0.0.0:34993 every 8 connection(s)
[       OK ] Parameters/TestRpc.TestApplicationFeatureFlagUnsupportedServer/SSL_TCP (32 ms)
[ RUN      ] Parameters/TestRpc.TestCancellationAsync/SSL_TCP
I20260928 14:54:33.109151 30889 acceptor_pool.cc:254] collecting diagnostics on the listening RPC socket 0.0.0.0:42137 every 8 connection(s)
I20260928 14:54:33.109196 30890 acceptor_pool.cc:254] collecting diagnostics on the listening RPC socket 0.0.0.0:42137 every 8 connection(s)
I20260928 14:54:33.109352 30457 rpc-test.cc:1716] Connecting to 0.0.0.0:42137
I20260928 14:54:33.125906 30457 test_util.cc:268] Using random seed: 1047685134
I20260928 14:54:33.148455 30893 rpc-test-base.h:240] got call: sleep_micros: 500 pattern: 4294967295 num_repetitions: 2097152 sidecar_idx: 0
I20260928 14:54:33.163209 30893 rpc-test-base.h:240] got call: sleep_micros: 500 pattern: 4294967295 num_repetitions: 2097152 sidecar_idx: 0
I20260928 14:54:33.181958 30893 rpc-test-base.h:240] got call: sleep_micros: 500 pattern: 4294967295 num_repetitions: 2097152 sidecar_idx: 0
I20260928 14:54:33.202265 30893 rpc-test-base.h:240] got call: sleep_micros: 500 pattern: 4294967295 num_repetitions: 2097152 sidecar_idx: 0
I20260928 14:54:33.223126 30893 rpc-test-base.h:240] got call: sleep_micros: 500 pattern: 4294967295 num_repetitions: 2097152 sidecar_idx: 0
I20260928 14:54:33.238260 30893 rpc-test-base.h:240] got call: sleep_micros: 500 pattern: 4294967295 num_repetitions: 2097152 sidecar_idx: 0
I20260928 14:54:33.254554 30893 rpc-test-base.h:240] got call: sleep_micros: 500 pattern: 4294967295 num_repetitions: 2097152 sidecar_idx: 0
I20260928 14:54:33.270560 30893 rpc-test-base.h:240] got call: sleep_micros: 500 pattern: 4294967295 num_repetitions: 2097152 sidecar_idx: 0
I20260928 14:54:33.287496 30893 rpc-test-base.h:240] got call: sleep_micros: 500 pattern: 4294967295 num_repetitions: 2097152 sidecar_idx: 0
W20260928 14:54:33.291826 30887 connection.cc:441] server connection from 127.0.0.1:52420 torn down before Call kudu.rpc.GenericCalculatorService.SleepWithSidecar from 127.0.0.1:52420 (request call id 9) could send its response
[       OK ] Parameters/TestRpc.TestCancellationAsync/SSL_TCP (192 ms)
[ RUN      ] Parameters/TestRpc.TestPerformanceBySocketType/SSL_TCP
I20260928 14:54:33.303362 30914 acceptor_pool.cc:254] collecting diagnostics on the listening RPC socket 0.0.0.0:33309 every 8 connection(s)
I20260928 14:54:33.303396 30915 acceptor_pool.cc:254] collecting diagnostics on the listening RPC socket 0.0.0.0:33309 every 8 connection(s)
I20260928 14:54:33.303555 30457 rpc-test.cc:1846] Connecting to 0.0.0.0:33309
I20260928 14:54:35.103360 30457 rpc-test.cc:1859] Sending 1024MB via ssl-enabled tcp socket: real 1.784s	user 1.743s	sys 1.370s
I20260928 14:54:36.906469 30457 rpc-test.cc:1859] Sending 1024MB via ssl-enabled tcp socket: real 1.803s	user 1.711s	sys 1.437s
I20260928 14:54:38.716861 30457 rpc-test.cc:1859] Sending 1024MB via ssl-enabled tcp socket: real 1.810s	user 1.776s	sys 1.374s
I20260928 14:54:40.583007 30457 rpc-test.cc:1859] Sending 1024MB via ssl-enabled tcp socket: real 1.866s	user 1.805s	sys 1.422s
I20260928 14:54:42.365957 30457 rpc-test.cc:1859] Sending 1024MB via ssl-enabled tcp socket: real 1.783s	user 1.697s	sys 1.406s
[       OK ] Parameters/TestRpc.TestPerformanceBySocketType/SSL_TCP (9074 ms)
[----------] 20 tests from Parameters/TestRpc (32969 ms total)

[----------] 1 test from Parameters/TestRpcSocketTxRxQueue
[ RUN      ] Parameters/TestRpcSocketTxRxQueue.OverCapacity/0
W20260928 14:54:42.634341 30949 negotiation.cc:337] Failed RPC negotiation. Trace:
0928 14:54:42.371482 (+     0us) reactor.cc:625] Submitting negotiation task for client connection to 0.0.0.0:40343 (local address 127.0.0.1:35136)
0928 14:54:42.371522 (+    40us) negotiation.cc:107] Waiting for socket to connect
0928 14:54:42.371529 (+     7us) client_negotiation.cc:174] Beginning negotiation
0928 14:54:42.371575 (+    46us) client_negotiation.cc:252] Sending NEGOTIATE NegotiatePB request
0928 14:54:42.634154 (+262579us) negotiation.cc:327] Negotiation complete: Network error: Client connection negotiation failed: client connection to 0.0.0.0:40343: BlockingRecv error: recv error from unknown peer: Transport endpoint is not connected (error 107)
Metrics: {"client-negotiator.queue_time_us":20}
W20260928 14:54:42.634342 30958 negotiation.cc:337] Failed RPC negotiation. Trace:
0928 14:54:42.372366 (+     0us) reactor.cc:625] Submitting negotiation task for client connection to 0.0.0.0:40343 (local address 127.0.0.1:35140)
0928 14:54:42.372404 (+    38us) negotiation.cc:107] Waiting for socket to connect
0928 14:54:42.372411 (+     7us) client_negotiation.cc:174] Beginning negotiation
0928 14:54:42.372452 (+    41us) client_negotiation.cc:252] Sending NEGOTIATE NegotiatePB request
0928 14:54:42.634108 (+261656us) negotiation.cc:327] Negotiation complete: Network error: Client connection negotiation failed: client connection to 0.0.0.0:40343: BlockingRecv error: recv error from unknown peer: Transport endpoint is not connected (error 107)
Metrics: {"client-negotiator.queue_time_us":18}
W20260928 14:54:42.634513 30967 negotiation.cc:337] Failed RPC negotiation. Trace:
0928 14:54:42.373279 (+     0us) reactor.cc:625] Submitting negotiation task for client connection to 0.0.0.0:40343 (local address 127.0.0.1:35144)
0928 14:54:42.373337 (+    58us) negotiation.cc:107] Waiting for socket to connect
0928 14:54:42.373345 (+     8us) client_negotiation.cc:174] Beginning negotiation
0928 14:54:42.373388 (+    43us) client_negotiation.cc:252] Sending NEGOTIATE NegotiatePB request
0928 14:54:42.634463 (+261075us) negotiation.cc:327] Negotiation complete: Network error: Client connection negotiation failed: client connection to 0.0.0.0:40343: BlockingRecv error: recv error from unknown peer: Transport endpoint is not connected (error 107)
Metrics: {"client-negotiator.queue_time_us":33}
W20260928 14:54:42.634342 30940 negotiation.cc:337] Failed RPC negotiation. Trace:
0928 14:54:42.370540 (+     0us) reactor.cc:625] Submitting negotiation task for client connection to 0.0.0.0:40343 (local address 127.0.0.1:35122)
0928 14:54:42.370602 (+    62us) negotiation.cc:107] Waiting for socket to connect
0928 14:54:42.370610 (+     8us) client_negotiation.cc:174] Beginning negotiation
0928 14:54:42.370659 (+    49us) client_negotiation.cc:252] Sending NEGOTIATE NegotiatePB request
0928 14:54:42.634170 (+263511us) negotiation.cc:327] Negotiation complete: Network error: Client connection negotiation failed: client connection to 0.0.0.0:40343: BlockingRecv error: recv error from unknown peer: Transport endpoint is not connected (error 107)
Metrics: {"client-negotiator.queue_time_us":37}
W20260928 14:54:42.634353 30931 negotiation.cc:337] Failed RPC negotiation. Trace:
0928 14:54:42.369584 (+     0us) reactor.cc:625] Submitting negotiation task for client connection to 0.0.0.0:40343 (local address 127.0.0.1:35116)
0928 14:54:42.369631 (+    47us) negotiation.cc:107] Waiting for socket to connect
0928 14:54:42.369641 (+    10us) client_negotiation.cc:174] Beginning negotiation
0928 14:54:42.369704 (+    63us) client_negotiation.cc:252] Sending NEGOTIATE NegotiatePB request
0928 14:54:42.634108 (+264404us) negotiation.cc:327] Negotiation complete: Network error: Client connection negotiation failed: client connection to 0.0.0.0:40343: BlockingRecv error: recv error from unknown peer: Transport endpoint is not connected (error 107)
Metrics: {"client-negotiator.queue_time_us":17}
W20260928 14:54:42.634759 30976 negotiation.cc:337] Failed RPC negotiation. Trace:
0928 14:54:42.374289 (+     0us) reactor.cc:625] Submitting negotiation task for client connection to 0.0.0.0:40343 (local address 127.0.0.1:35160)
0928 14:54:42.374357 (+    68us) negotiation.cc:107] Waiting for socket to connect
0928 14:54:42.374367 (+    10us) client_negotiation.cc:174] Beginning negotiation
0928 14:54:42.374451 (+    84us) client_negotiation.cc:252] Sending NEGOTIATE NegotiatePB request
0928 14:54:42.634714 (+260263us) negotiation.cc:327] Negotiation complete: Network error: Client connection negotiation failed: client connection to 0.0.0.0:40343: BlockingRecv error: recv error from unknown peer: Transport endpoint is not connected (error 107)
Metrics: {"client-negotiator.queue_time_us":36}
[       OK ] Parameters/TestRpcSocketTxRxQueue.OverCapacity/0 (1047 ms)
[----------] 1 test from Parameters/TestRpcSocketTxRxQueue (1047 ms total)

[----------] Global test environment tear-down
[==========] 21 tests from 2 test suites ran. (34017 ms total)
[  PASSED  ] 20 tests.
[  FAILED  ] 1 test, listed below:
[  FAILED  ] Parameters/TestRpc.TestCallWithChainCertAndChainCA/SSL_TCP, where GetParam() = (true, false)

 1 FAILED TEST