Diagnosed failure
Parameters/TestRpc.TestCallWithChainCertAndChainCA/SSL_TCP: /data0/somelongdirectorytoavoidrpathissues/src/kudu/src/kudu/rpc/rpc-test.cc:270: Failure
Failed
Bad status: Runtime error: could not verify certificate chain (error with cert: subject=CN = localhost, ST = sadfjas, C = AS, emailAddress = sdflkdsajf, O = lskdfjlsad, OU = sldfkja, issuer=C = AS, ST = ASDfkjdhf, L = lskdjf, O = saldfja, OU = skdjf, CN = localhost, emailAddress = sadjflkadsj): : certificate has expired
Google Test trace:
/data0/somelongdirectorytoavoidrpathissues/src/kudu/src/kudu/rpc/rpc-test.cc:267: Connecting to 0.0.0.0:39875
I20260928 16:34:15.855160 18572 test_util.cc:175] -----------------------------------------------
I20260928 16:34:15.855228 18572 test_util.cc:176] Had fatal failures, leaving test files at /tmp/dist-test-taskmB61P8/test-tmp/rpc-test.5.Parameters_TestRpc.TestCallWithChainCertAndChainCA_SSL_TCP.1790613255759694-18572-0
Full log
Note: This is test shard 6 of 8.
[==========] Running 21 tests from 2 test suites.
[----------] Global test environment set-up.
[----------] 20 tests from Parameters/TestRpc
[ RUN ] Parameters/TestRpc.TestMessengerCreateDestroy/SSL_TCP
WARNING: Logging before InitGoogleLogging() is written to STDERR
I20260928 16:34:15.793078 18572 rpc-test.cc:169] started messenger TestCreateDestroy
[ OK ] Parameters/TestRpc.TestMessengerCreateDestroy/SSL_TCP (26 ms)
[ RUN ] Parameters/TestRpc.TestNegotiationDeadlock/SSL_TCP
I20260928 16:34:15.808980 18592 acceptor_pool.cc:254] collecting diagnostics on the listening RPC socket 0.0.0.0:37293 every 8 connection(s)
I20260928 16:34:15.808980 18593 acceptor_pool.cc:254] collecting diagnostics on the listening RPC socket 0.0.0.0:37293 every 8 connection(s)
[ OK ] Parameters/TestRpc.TestNegotiationDeadlock/SSL_TCP (29 ms)
[ RUN ] Parameters/TestRpc.TestCallWithChainCertAndChainCA/SSL_TCP
I20260928 16:34:15.848655 18608 acceptor_pool.cc:254] collecting diagnostics on the listening RPC socket 0.0.0.0:39875 every 8 connection(s)
I20260928 16:34:15.848701 18609 acceptor_pool.cc:254] collecting diagnostics on the listening RPC socket 0.0.0.0:39875 every 8 connection(s)
/data0/somelongdirectorytoavoidrpathissues/src/kudu/src/kudu/rpc/rpc-test.cc:270: Failure
Failed
Bad status: Runtime error: could not verify certificate chain (error with cert: subject=CN = localhost, ST = sadfjas, C = AS, emailAddress = sdflkdsajf, O = lskdfjlsad, OU = sldfkja, issuer=C = AS, ST = ASDfkjdhf, L = lskdjf, O = saldfja, OU = skdjf, CN = localhost, emailAddress = sadjflkadsj): : certificate has expired
Google Test trace:
/data0/somelongdirectorytoavoidrpathissues/src/kudu/src/kudu/rpc/rpc-test.cc:267: Connecting to 0.0.0.0:39875
I20260928 16:34:15.855160 18572 test_util.cc:175] -----------------------------------------------
I20260928 16:34:15.855228 18572 test_util.cc:176] Had fatal failures, leaving test files at /tmp/dist-test-taskmB61P8/test-tmp/rpc-test.5.Parameters_TestRpc.TestCallWithChainCertAndChainCA_SSL_TCP.1790613255759694-18572-0
[ FAILED ] Parameters/TestRpc.TestCallWithChainCertAndChainCA/SSL_TCP, where GetParam() = (true, false) (30 ms)
[ RUN ] Parameters/TestRpc.TestCallWithPasswordProtectedKey/SSL_TCP
I20260928 16:34:15.869462 18633 acceptor_pool.cc:254] collecting diagnostics on the listening RPC socket 0.0.0.0:44051 every 8 connection(s)
I20260928 16:34:15.869508 18634 acceptor_pool.cc:254] collecting diagnostics on the listening RPC socket 0.0.0.0:44051 every 8 connection(s)
[ OK ] Parameters/TestRpc.TestCallWithPasswordProtectedKey/SSL_TCP (31 ms)
[ RUN ] Parameters/TestRpc.TestCallToBadServer/SSL_TCP
I20260928 16:34:15.894178 18572 rpc-test.cc:394] Status: Network error: Client connection negotiation failed: client connection to 0.0.0.0:0: connect: Connection refused (error 111)
I20260928 16:34:15.894716 18572 rpc-test.cc:394] Status: Network error: Client connection negotiation failed: client connection to 0.0.0.0:0: connect: Connection refused (error 111)
I20260928 16:34:15.895193 18572 rpc-test.cc:394] Status: Network error: Client connection negotiation failed: client connection to 0.0.0.0:0: connect: Connection refused (error 111)
I20260928 16:34:15.895706 18572 rpc-test.cc:394] Status: Network error: Client connection negotiation failed: client connection to 0.0.0.0:0: connect: Connection refused (error 111)
I20260928 16:34:15.896162 18572 rpc-test.cc:394] Status: Network error: Client connection negotiation failed: client connection to 0.0.0.0:0: connect: Connection refused (error 111)
[ OK ] Parameters/TestRpc.TestCallToBadServer/SSL_TCP (10 ms)
[ RUN ] Parameters/TestRpc.TestWrongService/SSL_TCP
I20260928 16:34:15.929061 18668 acceptor_pool.cc:254] collecting diagnostics on the listening RPC socket 0.0.0.0:43077 every 8 connection(s)
I20260928 16:34:15.929138 18669 acceptor_pool.cc:254] collecting diagnostics on the listening RPC socket 0.0.0.0:43077 every 8 connection(s)
I20260928 16:34:15.951905 18666 messenger.cc:345] service WrongServiceName not registered on TestServer
[ OK ] Parameters/TestRpc.TestWrongService/SSL_TCP (57 ms)
[ RUN ] Parameters/TestRpc.TestConnectionKeepalive/SSL_TCP
I20260928 16:34:15.979723 18692 acceptor_pool.cc:254] collecting diagnostics on the listening RPC socket 0.0.0.0:42547 every 8 connection(s)
I20260928 16:34:15.979743 18693 acceptor_pool.cc:254] collecting diagnostics on the listening RPC socket 0.0.0.0:42547 every 8 connection(s)
I20260928 16:34:15.980067 18572 rpc-test.cc:488] Connecting to 0.0.0.0:42547
[ OK ] Parameters/TestRpc.TestConnectionKeepalive/SSL_TCP (1057 ms)
[ RUN ] Parameters/TestRpc.TestClientConnectionMetrics/SSL_TCP
I20260928 16:34:17.031539 18717 acceptor_pool.cc:254] collecting diagnostics on the listening RPC socket 0.0.0.0:45131 every 8 connection(s)
I20260928 16:34:17.031560 18718 acceptor_pool.cc:254] collecting diagnostics on the listening RPC socket 0.0.0.0:45131 every 8 connection(s)
I20260928 16:34:17.031867 18572 rpc-test.cc:569] Connecting to 0.0.0.0:45131
[ OK ] Parameters/TestRpc.TestClientConnectionMetrics/SSL_TCP (14034 ms)
[ RUN ] Parameters/TestRpc.TestCredentialsPolicy/SSL_TCP
I20260928 16:34:31.063345 18740 acceptor_pool.cc:254] collecting diagnostics on the listening RPC socket 0.0.0.0:35845 every 8 connection(s)
I20260928 16:34:31.063395 18741 acceptor_pool.cc:254] collecting diagnostics on the listening RPC socket 0.0.0.0:35845 every 8 connection(s)
I20260928 16:34:31.063872 18572 rpc-test.cc:700] Connecting to 0.0.0.0:35845
[ OK ] Parameters/TestRpc.TestCredentialsPolicy/SSL_TCP (49 ms)
[ RUN ] Parameters/TestRpc.TestCallLongerThanKeepalive/SSL_TCP
I20260928 16:34:31.119822 18766 acceptor_pool.cc:254] collecting diagnostics on the listening RPC socket 0.0.0.0:40283 every 8 connection(s)
I20260928 16:34:31.119792 18765 acceptor_pool.cc:254] collecting diagnostics on the listening RPC socket 0.0.0.0:40283 every 8 connection(s)
I20260928 16:34:31.151104 18769 rpc-test-base.h:222] got call: sleep_micros: 3000000 deferred: true
I20260928 16:34:34.152549 18769 rpcz_store.cc:275] Call kudu.rpc.GenericCalculatorService.Sleep from 127.0.0.1:44646 (request call id 0) took 3001 ms. Trace:
I20260928 16:34:34.152683 18769 rpcz_store.cc:276] 0928 16:34:31.151001 (+ 0us) service_pool.cc:170] Inserting onto call queue
0928 16:34:31.151069 (+ 68us) service_pool.cc:227] Handling call
0928 16:34:34.152525 (+3001456us) inbound_call.cc:173] Queueing success response
Metrics: {}
[ OK ] Parameters/TestRpc.TestCallLongerThanKeepalive/SSL_TCP (3059 ms)
[ RUN ] Parameters/TestRpc.TestRpcSidecar/SSL_TCP
I20260928 16:34:34.190894 18790 acceptor_pool.cc:254] collecting diagnostics on the listening RPC socket 0.0.0.0:41921 every 8 connection(s)
I20260928 16:34:34.190936 18791 acceptor_pool.cc:254] collecting diagnostics on the listening RPC socket 0.0.0.0:41921 every 8 connection(s)
[ OK ] Parameters/TestRpc.TestRpcSidecar/SSL_TCP (109 ms)
[ RUN ] Parameters/TestRpc.TestRpcSidecarLimits/SSL_TCP
I20260928 16:34:36.593376 18815 acceptor_pool.cc:254] collecting diagnostics on the listening RPC socket 0.0.0.0:45587 every 8 connection(s)
I20260928 16:34:36.593436 18816 acceptor_pool.cc:254] collecting diagnostics on the listening RPC socket 0.0.0.0:45587 every 8 connection(s)
W20260928 16:34:36.609484 18572 serialization.cc:72] Serialized kudu.rpc_test.PushStringsRequestPB (2147483654 bytes) is larger than the maximum configured RPC message size (52428800 bytes). Sending anyway, but peer may reject the data.
W20260928 16:34:36.613842 18812 connection.cc:535] server connection from 127.0.0.1:52392 recv error: Network error: RPC frame had a length of 2147483714, but we only support messages up to 52428800 bytes long.
W20260928 16:34:36.613920 18812 connection.cc:158] shutting down server connection from 127.0.0.1:52392 with pending inbound data: 4/2147483714 bytes received; last active 0 ns ago: status Network error: RPC frame had a length of 2147483714, but we only support messages up to 52428800 bytes long.
W20260928 16:34:36.614360 18828 connection.cc:196] Error closing socket: Network error: TlsSocket::Close: Connection reset by peer
I20260928 16:34:36.625010 18840 acceptor_pool.cc:254] collecting diagnostics on the listening RPC socket 0.0.0.0:41117 every 8 connection(s)
I20260928 16:34:36.625041 18841 acceptor_pool.cc:254] collecting diagnostics on the listening RPC socket 0.0.0.0:41117 every 8 connection(s)
W20260928 16:34:42.412603 18838 connection.cc:577] server connection from 127.0.0.1:50904: received bad data: 'Corruption: Invalid packet: message had a length of 2147483710, but we only support messages up to 2147483647 bytes
'
[ OK ] Parameters/TestRpc.TestRpcSidecarLimits/SSL_TCP (8149 ms)
[ RUN ] Parameters/TestRpc.TestCallTimeoutDoesntAffectNegotiation/SSL_TCP
I20260928 16:34:42.438874 18866 acceptor_pool.cc:254] collecting diagnostics on the listening RPC socket 0.0.0.0:34339 every 8 connection(s)
I20260928 16:34:42.438869 18865 acceptor_pool.cc:254] collecting diagnostics on the listening RPC socket 0.0.0.0:34339 every 8 connection(s)
W20260928 16:34:42.454517 18861 negotiation.cc:266] Injecting 500ms delay in negotiation
I20260928 16:34:42.505002 18572 rpc-test-base.h:595] status: Timed out: connection negotiation to 0.0.0.0:34339 for RPC Sleep timed out after 0.050s (ON_OUTBOUND_QUEUE), seconds elapsed: 0.0510951
[ OK ] Parameters/TestRpc.TestCallTimeoutDoesntAffectNegotiation/SSL_TCP (547 ms)
[ RUN ] Parameters/TestRpc.TestRpcHandlerLatencyMetric/SSL_TCP
I20260928 16:34:42.979733 18890 acceptor_pool.cc:254] collecting diagnostics on the listening RPC socket 0.0.0.0:43245 every 8 connection(s)
I20260928 16:34:42.979765 18891 acceptor_pool.cc:254] collecting diagnostics on the listening RPC socket 0.0.0.0:43245 every 8 connection(s)
I20260928 16:34:43.018059 18572 rpc-test.cc:1236] Sleep() min lat: 20446
I20260928 16:34:43.018129 18572 rpc-test.cc:1237] Sleep() mean lat: 20446
I20260928 16:34:43.018159 18572 rpc-test.cc:1238] Sleep() max lat: 20446
I20260928 16:34:43.018172 18572 rpc-test.cc:1239] Sleep() #calls: 1
[ OK ] Parameters/TestRpc.TestRpcHandlerLatencyMetric/SSL_TCP (57 ms)
[ RUN ] Parameters/TestRpc.TimedOutOnResponseMetricServiceQueue/SSL_TCP
I20260928 16:34:43.033160 18916 acceptor_pool.cc:254] collecting diagnostics on the listening RPC socket 0.0.0.0:42063 every 8 connection(s)
I20260928 16:34:43.033181 18917 acceptor_pool.cc:254] collecting diagnostics on the listening RPC socket 0.0.0.0:42063 every 8 connection(s)
W20260928 16:34:43.091820 18918 rpcz_store.cc:267] Call kudu.rpc_test.CalculatorService.Sleep from 127.0.0.1:40802 (request call id 2) took 20 ms (client timeout 20 ms). Trace:
W20260928 16:34:43.091970 18918 rpcz_store.cc:269] 0928 16:34:43.071316 (+ 0us) service_pool.cc:170] Inserting onto call queue
0928 16:34:43.091758 (+ 20442us) service_pool.cc:214] Skipping call since client already timed out
0928 16:34:43.091798 (+ 40us) inbound_call.cc:173] Queueing failure response
Metrics: {}
[ OK ] Parameters/TestRpc.TimedOutOnResponseMetricServiceQueue/SSL_TCP (73 ms)
[ RUN ] Parameters/TestRpc.RpcPendingConnectionsMetric/SSL_TCP
I20260928 16:34:43.096535 18939 acceptor_pool.cc:254] collecting diagnostics on the listening RPC socket 0.0.0.0:43403 every 8 connection(s)
I20260928 16:34:43.096560 18940 acceptor_pool.cc:254] collecting diagnostics on the listening RPC socket 0.0.0.0:43403 every 8 connection(s)
W20260928 16:34:43.097879 18935 negotiation.cc:337] Failed RPC negotiation. Trace:
0928 16:34:43.097445 (+ 0us) reactor.cc:625] Submitting negotiation task for server connection from 127.0.0.1:40666 (local address 127.0.0.1:43403)
0928 16:34:43.097564 (+ 119us) server_negotiation.cc:206] Beginning negotiation
0928 16:34:43.097568 (+ 4us) server_negotiation.cc:399] Waiting for connection header
0928 16:34:43.097659 (+ 91us) negotiation.cc:327] Negotiation complete: Network error: Server connection negotiation failed: server connection from 127.0.0.1:40666: BlockingRecv error: recv got EOF from 127.0.0.1:40666 (error 108)
Metrics: {"server-negotiator.queue_time_us":45}
[ OK ] Parameters/TestRpc.RpcPendingConnectionsMetric/SSL_TCP (15 ms)
[ RUN ] Parameters/TestRpc.TestRpcContextClientDeadline/SSL_TCP
I20260928 16:34:43.127894 18956 acceptor_pool.cc:254] collecting diagnostics on the listening RPC socket 0.0.0.0:42909 every 8 connection(s)
I20260928 16:34:43.127919 18955 acceptor_pool.cc:254] collecting diagnostics on the listening RPC socket 0.0.0.0:42909 every 8 connection(s)
[ OK ] Parameters/TestRpc.TestRpcContextClientDeadline/SSL_TCP (56 ms)
[ RUN ] Parameters/TestRpc.TestApplicationFeatureFlagUnsupportedServer/SSL_TCP
I20260928 16:34:43.185299 18981 acceptor_pool.cc:254] collecting diagnostics on the listening RPC socket 0.0.0.0:36561 every 8 connection(s)
I20260928 16:34:43.185340 18980 acceptor_pool.cc:254] collecting diagnostics on the listening RPC socket 0.0.0.0:36561 every 8 connection(s)
[ OK ] Parameters/TestRpc.TestApplicationFeatureFlagUnsupportedServer/SSL_TCP (42 ms)
[ RUN ] Parameters/TestRpc.TestCancellationAsync/SSL_TCP
I20260928 16:34:43.221606 19005 acceptor_pool.cc:254] collecting diagnostics on the listening RPC socket 0.0.0.0:42355 every 8 connection(s)
I20260928 16:34:43.221613 19006 acceptor_pool.cc:254] collecting diagnostics on the listening RPC socket 0.0.0.0:42355 every 8 connection(s)
I20260928 16:34:43.221968 18572 rpc-test.cc:1716] Connecting to 0.0.0.0:42355
I20260928 16:34:43.231680 18572 test_util.cc:268] Using random seed: -1532143683
I20260928 16:34:43.260361 19008 rpc-test-base.h:240] got call: sleep_micros: 500 pattern: 4294967295 num_repetitions: 2097152 sidecar_idx: 0
I20260928 16:34:43.284003 19008 rpc-test-base.h:240] got call: sleep_micros: 500 pattern: 4294967295 num_repetitions: 2097152 sidecar_idx: 0
I20260928 16:34:43.307382 19008 rpc-test-base.h:240] got call: sleep_micros: 500 pattern: 4294967295 num_repetitions: 2097152 sidecar_idx: 0
I20260928 16:34:43.325276 19009 rpc-test-base.h:240] got call: sleep_micros: 500 pattern: 4294967295 num_repetitions: 2097152 sidecar_idx: 0
I20260928 16:34:43.343963 19008 rpc-test-base.h:240] got call: sleep_micros: 500 pattern: 4294967295 num_repetitions: 2097152 sidecar_idx: 0
I20260928 16:34:43.362962 19009 rpc-test-base.h:240] got call: sleep_micros: 500 pattern: 4294967295 num_repetitions: 2097152 sidecar_idx: 0
I20260928 16:34:43.383790 19008 rpc-test-base.h:240] got call: sleep_micros: 500 pattern: 4294967295 num_repetitions: 2097152 sidecar_idx: 0
I20260928 16:34:43.402796 19009 rpc-test-base.h:240] got call: sleep_micros: 500 pattern: 4294967295 num_repetitions: 2097152 sidecar_idx: 0
W20260928 16:34:43.413550 19003 connection.cc:441] server connection from 127.0.0.1:59244 torn down before Call kudu.rpc.GenericCalculatorService.SleepWithSidecar from 127.0.0.1:59244 (request call id 8) could send its response
W20260928 16:34:43.426030 19003 connection.cc:441] server connection from 127.0.0.1:59244 torn down before Call kudu.rpc.GenericCalculatorService.SleepWithSidecar from 127.0.0.1:59244 (request call id 9) could send its response
[ OK ] Parameters/TestRpc.TestCancellationAsync/SSL_TCP (219 ms)
[ RUN ] Parameters/TestRpc.TestPerformanceBySocketType/SSL_TCP
I20260928 16:34:43.455739 19030 acceptor_pool.cc:254] collecting diagnostics on the listening RPC socket 0.0.0.0:43865 every 8 connection(s)
I20260928 16:34:43.455760 19031 acceptor_pool.cc:254] collecting diagnostics on the listening RPC socket 0.0.0.0:43865 every 8 connection(s)
I20260928 16:34:43.456081 18572 rpc-test.cc:1846] Connecting to 0.0.0.0:43865
I20260928 16:34:45.855790 18572 rpc-test.cc:1859] Sending 1024MB via ssl-enabled tcp socket: real 2.390s user 2.511s sys 1.701s
I20260928 16:34:48.297545 18572 rpc-test.cc:1859] Sending 1024MB via ssl-enabled tcp socket: real 2.442s user 2.523s sys 1.737s
I20260928 16:34:50.673434 18572 rpc-test.cc:1859] Sending 1024MB via ssl-enabled tcp socket: real 2.376s user 2.436s sys 1.731s
I20260928 16:34:53.056659 18572 rpc-test.cc:1859] Sending 1024MB via ssl-enabled tcp socket: real 2.383s user 2.419s sys 1.766s
I20260928 16:34:55.545049 18572 rpc-test.cc:1859] Sending 1024MB via ssl-enabled tcp socket: real 2.488s user 2.636s sys 1.724s
[ OK ] Parameters/TestRpc.TestPerformanceBySocketType/SSL_TCP (12119 ms)
[----------] 20 tests from Parameters/TestRpc (39778 ms total)
[----------] 1 test from Parameters/TestRpcSocketTxRxQueue
[ RUN ] Parameters/TestRpcSocketTxRxQueue.OverCapacity/0
W20260928 16:34:55.826963 19083 negotiation.cc:337] Failed RPC negotiation. Trace:
0928 16:34:55.561911 (+ 0us) reactor.cc:625] Submitting negotiation task for client connection to 0.0.0.0:42259 (local address 127.0.0.1:35330)
0928 16:34:55.562053 (+ 142us) negotiation.cc:107] Waiting for socket to connect
0928 16:34:55.562068 (+ 15us) client_negotiation.cc:174] Beginning negotiation
0928 16:34:55.562154 (+ 86us) client_negotiation.cc:252] Sending NEGOTIATE NegotiatePB request
0928 16:34:55.826894 (+264740us) negotiation.cc:327] Negotiation complete: Network error: Client connection negotiation failed: client connection to 0.0.0.0:42259: BlockingRecv error: recv error from unknown peer: Transport endpoint is not connected (error 107)
Metrics: {"client-negotiator.queue_time_us":46}
W20260928 16:34:55.826963 19056 negotiation.cc:337] Failed RPC negotiation. Trace:
0928 16:34:55.557732 (+ 0us) reactor.cc:625] Submitting negotiation task for client connection to 0.0.0.0:42259 (local address 127.0.0.1:35296)
0928 16:34:55.557854 (+ 122us) negotiation.cc:107] Waiting for socket to connect
0928 16:34:55.557869 (+ 15us) client_negotiation.cc:174] Beginning negotiation
0928 16:34:55.557975 (+ 106us) client_negotiation.cc:252] Sending NEGOTIATE NegotiatePB request
0928 16:34:55.826751 (+268776us) negotiation.cc:327] Negotiation complete: Network error: Client connection negotiation failed: client connection to 0.0.0.0:42259: BlockingRecv error: recv error from unknown peer: Transport endpoint is not connected (error 107)
Metrics: {"client-negotiator.queue_time_us":28}
W20260928 16:34:55.827135 19092 negotiation.cc:337] Failed RPC negotiation. Trace:
0928 16:34:55.563333 (+ 0us) reactor.cc:625] Submitting negotiation task for client connection to 0.0.0.0:42259 (local address 127.0.0.1:35336)
0928 16:34:55.563470 (+ 137us) negotiation.cc:107] Waiting for socket to connect
0928 16:34:55.563484 (+ 14us) client_negotiation.cc:174] Beginning negotiation
0928 16:34:55.563569 (+ 85us) client_negotiation.cc:252] Sending NEGOTIATE NegotiatePB request
0928 16:34:55.827078 (+263509us) negotiation.cc:327] Negotiation complete: Network error: Client connection negotiation failed: client connection to 0.0.0.0:42259: BlockingRecv error: recv error from unknown peer: Transport endpoint is not connected (error 107)
Metrics: {"client-negotiator.queue_time_us":48}
W20260928 16:34:55.827378 19047 negotiation.cc:337] Failed RPC negotiation. Trace:
0928 16:34:55.556227 (+ 0us) reactor.cc:625] Submitting negotiation task for client connection to 0.0.0.0:42259 (local address 127.0.0.1:35288)
0928 16:34:55.556354 (+ 127us) negotiation.cc:107] Waiting for socket to connect
0928 16:34:55.556371 (+ 17us) client_negotiation.cc:174] Beginning negotiation
0928 16:34:55.556472 (+ 101us) client_negotiation.cc:252] Sending NEGOTIATE NegotiatePB request
0928 16:34:55.826751 (+270279us) negotiation.cc:327] Negotiation complete: Network error: Client connection negotiation failed: client connection to 0.0.0.0:42259: BlockingRecv error: recv error from unknown peer: Transport endpoint is not connected (error 107)
Metrics: {"client-negotiator.queue_time_us":53}
W20260928 16:34:55.826994 19065 negotiation.cc:337] Failed RPC negotiation. Trace:
0928 16:34:55.559148 (+ 0us) reactor.cc:625] Submitting negotiation task for client connection to 0.0.0.0:42259 (local address 127.0.0.1:35298)
0928 16:34:55.559331 (+ 183us) negotiation.cc:107] Waiting for socket to connect
0928 16:34:55.559345 (+ 14us) client_negotiation.cc:174] Beginning negotiation
0928 16:34:55.559436 (+ 91us) client_negotiation.cc:252] Sending NEGOTIATE NegotiatePB request
0928 16:34:55.826751 (+267315us) negotiation.cc:327] Negotiation complete: Network error: Client connection negotiation failed: client connection to 0.0.0.0:42259: BlockingRecv error: recv error from unknown peer: Transport endpoint is not connected (error 107)
Metrics: {"client-negotiator.queue_time_us":57}
W20260928 16:34:55.827564 19074 negotiation.cc:337] Failed RPC negotiation. Trace:
0928 16:34:55.560500 (+ 0us) reactor.cc:625] Submitting negotiation task for client connection to 0.0.0.0:42259 (local address 127.0.0.1:35314)
0928 16:34:55.560653 (+ 153us) negotiation.cc:107] Waiting for socket to connect
0928 16:34:55.560674 (+ 21us) client_negotiation.cc:174] Beginning negotiation
0928 16:34:55.560769 (+ 95us) client_negotiation.cc:252] Sending NEGOTIATE NegotiatePB request
0928 16:34:55.826763 (+265994us) negotiation.cc:327] Negotiation complete: Network error: Client connection negotiation failed: client connection to 0.0.0.0:42259: BlockingRecv error: recv error from unknown peer: Transport endpoint is not connected (error 107)
Metrics: {"client-negotiator.queue_time_us":56}
[ OK ] Parameters/TestRpcSocketTxRxQueue.OverCapacity/0 (1051 ms)
[----------] 1 test from Parameters/TestRpcSocketTxRxQueue (1051 ms total)
[----------] Global test environment tear-down
[==========] 21 tests from 2 test suites ran. (40830 ms total)
[ PASSED ] 20 tests.
[ FAILED ] 1 test, listed below:
[ FAILED ] Parameters/TestRpc.TestCallWithChainCertAndChainCA/SSL_TCP, where GetParam() = (true, false)
1 FAILED TEST