Diagnosed failure

Parameters/TestRpc.TestCallWithChainCertAndChainCA/SSL_TCP: /data0/somelongdirectorytoavoidrpathissues/src/kudu/src/kudu/rpc/rpc-test.cc:270: Failure
Failed
Bad status: Runtime error: could not verify certificate chain (error with cert: subject=CN = localhost, ST = sadfjas, C = AS, emailAddress = sdflkdsajf, O = lskdfjlsad, OU = sldfkja, issuer=C = AS, ST = ASDfkjdhf, L = lskdjf, O = saldfja, OU = skdjf, CN = localhost, emailAddress = sadjflkadsj): : certificate has expired
Google Test trace:
/data0/somelongdirectorytoavoidrpathissues/src/kudu/src/kudu/rpc/rpc-test.cc:267: Connecting to 0.0.0.0:37079
I20260925 07:19:40.720582   383 test_util.cc:175] -----------------------------------------------
I20260925 07:19:40.720633   383 test_util.cc:176] Had fatal failures, leaving test files at /tmp/dist-test-tasktXr6M2/test-tmp/rpc-test.5.Parameters_TestRpc.TestCallWithChainCertAndChainCA_SSL_TCP.1790320780647930-383-0

Full log

Note: This is test shard 6 of 8.
[==========] Running 21 tests from 2 test suites.
[----------] Global test environment set-up.
[----------] 20 tests from Parameters/TestRpc
[ RUN      ] Parameters/TestRpc.TestMessengerCreateDestroy/SSL_TCP
WARNING: Logging before InitGoogleLogging() is written to STDERR
I20260925 07:19:40.659655   383 rpc-test.cc:169] started messenger TestCreateDestroy
[       OK ] Parameters/TestRpc.TestMessengerCreateDestroy/SSL_TCP (10 ms)
[ RUN      ] Parameters/TestRpc.TestNegotiationDeadlock/SSL_TCP
I20260925 07:19:40.681137   403 acceptor_pool.cc:254] collecting diagnostics on the listening RPC socket 0.0.0.0:41125 every 8 connection(s)
I20260925 07:19:40.681149   404 acceptor_pool.cc:254] collecting diagnostics on the listening RPC socket 0.0.0.0:41125 every 8 connection(s)
[       OK ] Parameters/TestRpc.TestNegotiationDeadlock/SSL_TCP (30 ms)
[ RUN      ] Parameters/TestRpc.TestCallWithChainCertAndChainCA/SSL_TCP
I20260925 07:19:40.716977   419 acceptor_pool.cc:254] collecting diagnostics on the listening RPC socket 0.0.0.0:37079 every 8 connection(s)
I20260925 07:19:40.716987   420 acceptor_pool.cc:254] collecting diagnostics on the listening RPC socket 0.0.0.0:37079 every 8 connection(s)
/data0/somelongdirectorytoavoidrpathissues/src/kudu/src/kudu/rpc/rpc-test.cc:270: Failure
Failed
Bad status: Runtime error: could not verify certificate chain (error with cert: subject=CN = localhost, ST = sadfjas, C = AS, emailAddress = sdflkdsajf, O = lskdfjlsad, OU = sldfkja, issuer=C = AS, ST = ASDfkjdhf, L = lskdjf, O = saldfja, OU = skdjf, CN = localhost, emailAddress = sadjflkadsj): : certificate has expired
Google Test trace:
/data0/somelongdirectorytoavoidrpathissues/src/kudu/src/kudu/rpc/rpc-test.cc:267: Connecting to 0.0.0.0:37079
I20260925 07:19:40.720582   383 test_util.cc:175] -----------------------------------------------
I20260925 07:19:40.720633   383 test_util.cc:176] Had fatal failures, leaving test files at /tmp/dist-test-tasktXr6M2/test-tmp/rpc-test.5.Parameters_TestRpc.TestCallWithChainCertAndChainCA_SSL_TCP.1790320780647930-383-0
[  FAILED  ] Parameters/TestRpc.TestCallWithChainCertAndChainCA/SSL_TCP, where GetParam() = (true, false) (29 ms)
[ RUN      ] Parameters/TestRpc.TestCallWithPasswordProtectedKey/SSL_TCP
I20260925 07:19:40.732141   445 acceptor_pool.cc:254] collecting diagnostics on the listening RPC socket 0.0.0.0:44819 every 8 connection(s)
I20260925 07:19:40.732116   444 acceptor_pool.cc:254] collecting diagnostics on the listening RPC socket 0.0.0.0:44819 every 8 connection(s)
[       OK ] Parameters/TestRpc.TestCallWithPasswordProtectedKey/SSL_TCP (23 ms)
[ RUN      ] Parameters/TestRpc.TestCallToBadServer/SSL_TCP
I20260925 07:19:40.751248   383 rpc-test.cc:394] Status: Network error: Client connection negotiation failed: client connection to 0.0.0.0:0: connect: Connection refused (error 111)
I20260925 07:19:40.751477   383 rpc-test.cc:394] Status: Network error: Client connection negotiation failed: client connection to 0.0.0.0:0: connect: Connection refused (error 111)
I20260925 07:19:40.751663   383 rpc-test.cc:394] Status: Network error: Client connection negotiation failed: client connection to 0.0.0.0:0: connect: Connection refused (error 111)
I20260925 07:19:40.751830   383 rpc-test.cc:394] Status: Network error: Client connection negotiation failed: client connection to 0.0.0.0:0: connect: Connection refused (error 111)
I20260925 07:19:40.751992   383 rpc-test.cc:394] Status: Network error: Client connection negotiation failed: client connection to 0.0.0.0:0: connect: Connection refused (error 111)
[       OK ] Parameters/TestRpc.TestCallToBadServer/SSL_TCP (8 ms)
[ RUN      ] Parameters/TestRpc.TestWrongService/SSL_TCP
I20260925 07:19:40.770491   480 acceptor_pool.cc:254] collecting diagnostics on the listening RPC socket 0.0.0.0:34939 every 8 connection(s)
I20260925 07:19:40.770491   479 acceptor_pool.cc:254] collecting diagnostics on the listening RPC socket 0.0.0.0:34939 every 8 connection(s)
I20260925 07:19:40.800551   476 messenger.cc:345] service WrongServiceName not registered on TestServer
[       OK ] Parameters/TestRpc.TestWrongService/SSL_TCP (49 ms)
[ RUN      ] Parameters/TestRpc.TestConnectionKeepalive/SSL_TCP
I20260925 07:19:40.811545   502 acceptor_pool.cc:254] collecting diagnostics on the listening RPC socket 0.0.0.0:44855 every 8 connection(s)
I20260925 07:19:40.811579   503 acceptor_pool.cc:254] collecting diagnostics on the listening RPC socket 0.0.0.0:44855 every 8 connection(s)
I20260925 07:19:40.811690   383 rpc-test.cc:488] Connecting to 0.0.0.0:44855
[       OK ] Parameters/TestRpc.TestConnectionKeepalive/SSL_TCP (1028 ms)
[ RUN      ] Parameters/TestRpc.TestClientConnectionMetrics/SSL_TCP
I20260925 07:19:41.864534   527 acceptor_pool.cc:254] collecting diagnostics on the listening RPC socket 0.0.0.0:39775 every 8 connection(s)
I20260925 07:19:41.864588   528 acceptor_pool.cc:254] collecting diagnostics on the listening RPC socket 0.0.0.0:39775 every 8 connection(s)
I20260925 07:19:41.864678   383 rpc-test.cc:569] Connecting to 0.0.0.0:39775
[       OK ] Parameters/TestRpc.TestClientConnectionMetrics/SSL_TCP (7983 ms)
[ RUN      ] Parameters/TestRpc.TestCredentialsPolicy/SSL_TCP
I20260925 07:19:49.839836   550 acceptor_pool.cc:254] collecting diagnostics on the listening RPC socket 0.0.0.0:39527 every 8 connection(s)
I20260925 07:19:49.839859   551 acceptor_pool.cc:254] collecting diagnostics on the listening RPC socket 0.0.0.0:39527 every 8 connection(s)
I20260925 07:19:49.839969   383 rpc-test.cc:700] Connecting to 0.0.0.0:39527
[       OK ] Parameters/TestRpc.TestCredentialsPolicy/SSL_TCP (44 ms)
[ RUN      ] Parameters/TestRpc.TestCallLongerThanKeepalive/SSL_TCP
I20260925 07:19:49.888847   575 acceptor_pool.cc:254] collecting diagnostics on the listening RPC socket 0.0.0.0:35345 every 8 connection(s)
I20260925 07:19:49.888887   576 acceptor_pool.cc:254] collecting diagnostics on the listening RPC socket 0.0.0.0:35345 every 8 connection(s)
I20260925 07:19:49.895998   579 rpc-test-base.h:222] got call: sleep_micros: 3000000 deferred: true
I20260925 07:19:52.896644   579 rpcz_store.cc:275] Call kudu.rpc.GenericCalculatorService.Sleep from 127.0.0.1:55586 (request call id 0) took 3000 ms. Trace:
I20260925 07:19:52.896739   579 rpcz_store.cc:276] 0925 07:19:49.895904 (+     0us) service_pool.cc:170] Inserting onto call queue
0925 07:19:49.895974 (+    70us) service_pool.cc:227] Handling call
0925 07:19:52.896626 (+3000652us) inbound_call.cc:173] Queueing success response
Metrics: {}
[       OK ] Parameters/TestRpc.TestCallLongerThanKeepalive/SSL_TCP (3038 ms)
[ RUN      ] Parameters/TestRpc.TestRpcSidecar/SSL_TCP
I20260925 07:19:52.905205   600 acceptor_pool.cc:254] collecting diagnostics on the listening RPC socket 0.0.0.0:44513 every 8 connection(s)
I20260925 07:19:52.905241   601 acceptor_pool.cc:254] collecting diagnostics on the listening RPC socket 0.0.0.0:44513 every 8 connection(s)
[       OK ] Parameters/TestRpc.TestRpcSidecar/SSL_TCP (59 ms)
[ RUN      ] Parameters/TestRpc.TestRpcSidecarLimits/SSL_TCP
I20260925 07:19:54.609344   625 acceptor_pool.cc:254] collecting diagnostics on the listening RPC socket 0.0.0.0:37555 every 8 connection(s)
I20260925 07:19:54.609382   626 acceptor_pool.cc:254] collecting diagnostics on the listening RPC socket 0.0.0.0:37555 every 8 connection(s)
W20260925 07:19:54.631407   383 serialization.cc:72] Serialized kudu.rpc_test.PushStringsRequestPB (2147483654 bytes) is larger than the maximum configured RPC message size (52428800 bytes). Sending anyway, but peer may reject the data.
W20260925 07:19:54.635085   623 connection.cc:535] server connection from 127.0.0.1:58410 recv error: Network error: RPC frame had a length of 2147483714, but we only support messages up to 52428800 bytes long.
W20260925 07:19:54.635195   623 connection.cc:158] shutting down server connection from 127.0.0.1:58410 with pending inbound data: 4/2147483714 bytes received; last active 0 ns ago: status Network error: RPC frame had a length of 2147483714, but we only support messages up to 52428800 bytes long.
W20260925 07:19:54.635412   638 connection.cc:196] Error closing socket: Network error: TlsSocket::Close: Connection reset by peer
I20260925 07:19:54.653095   650 acceptor_pool.cc:254] collecting diagnostics on the listening RPC socket 0.0.0.0:42891 every 8 connection(s)
I20260925 07:19:54.653110   651 acceptor_pool.cc:254] collecting diagnostics on the listening RPC socket 0.0.0.0:42891 every 8 connection(s)
W20260925 07:19:58.253494   648 connection.cc:577] server connection from 127.0.0.1:41814: received bad data: 'Corruption: Invalid packet: message had a length of 2147483710, but we only support messages up to 2147483647 bytes
'
[       OK ] Parameters/TestRpc.TestRpcSidecarLimits/SSL_TCP (5297 ms)
[ RUN      ] Parameters/TestRpc.TestCallTimeoutDoesntAffectNegotiation/SSL_TCP
I20260925 07:19:58.266384   675 acceptor_pool.cc:254] collecting diagnostics on the listening RPC socket 0.0.0.0:43157 every 8 connection(s)
I20260925 07:19:58.266503   676 acceptor_pool.cc:254] collecting diagnostics on the listening RPC socket 0.0.0.0:43157 every 8 connection(s)
W20260925 07:19:58.274914   671 negotiation.cc:266] Injecting 500ms delay in negotiation
I20260925 07:19:58.325238   383 rpc-test-base.h:595] status: Timed out: connection negotiation to 0.0.0.0:43157 for RPC Sleep timed out after 0.050s (ON_OUTBOUND_QUEUE), seconds elapsed: 0.0506034
[       OK ] Parameters/TestRpc.TestCallTimeoutDoesntAffectNegotiation/SSL_TCP (523 ms)
[ RUN      ] Parameters/TestRpc.TestRpcHandlerLatencyMetric/SSL_TCP
I20260925 07:19:58.802839   700 acceptor_pool.cc:254] collecting diagnostics on the listening RPC socket 0.0.0.0:39153 every 8 connection(s)
I20260925 07:19:58.802878   701 acceptor_pool.cc:254] collecting diagnostics on the listening RPC socket 0.0.0.0:39153 every 8 connection(s)
I20260925 07:19:58.849871   383 rpc-test.cc:1236] Sleep() min lat: 20269
I20260925 07:19:58.849934   383 rpc-test.cc:1237] Sleep() mean lat: 20269
I20260925 07:19:58.849962   383 rpc-test.cc:1238] Sleep() max lat: 20269
I20260925 07:19:58.849978   383 rpc-test.cc:1239] Sleep() #calls: 1
[       OK ] Parameters/TestRpc.TestRpcHandlerLatencyMetric/SSL_TCP (71 ms)
[ RUN      ] Parameters/TestRpc.TimedOutOnResponseMetricServiceQueue/SSL_TCP
I20260925 07:19:58.870152   726 acceptor_pool.cc:254] collecting diagnostics on the listening RPC socket 0.0.0.0:37819 every 8 connection(s)
I20260925 07:19:58.870175   727 acceptor_pool.cc:254] collecting diagnostics on the listening RPC socket 0.0.0.0:37819 every 8 connection(s)
W20260925 07:19:58.930716   728 rpcz_store.cc:267] Call kudu.rpc_test.CalculatorService.Sleep from 127.0.0.1:54986 (request call id 2) took 20 ms (client timeout 20 ms). Trace:
W20260925 07:19:58.930809   728 rpcz_store.cc:269] 0925 07:19:58.910427 (+     0us) service_pool.cc:170] Inserting onto call queue
0925 07:19:58.930671 (+ 20244us) service_pool.cc:214] Skipping call since client already timed out
0925 07:19:58.930681 (+    10us) inbound_call.cc:173] Queueing failure response
Metrics: {}
[       OK ] Parameters/TestRpc.TimedOutOnResponseMetricServiceQueue/SSL_TCP (80 ms)
[ RUN      ] Parameters/TestRpc.RpcPendingConnectionsMetric/SSL_TCP
I20260925 07:19:58.933698   749 acceptor_pool.cc:254] collecting diagnostics on the listening RPC socket 0.0.0.0:44171 every 8 connection(s)
I20260925 07:19:58.933750   750 acceptor_pool.cc:254] collecting diagnostics on the listening RPC socket 0.0.0.0:44171 every 8 connection(s)
W20260925 07:19:58.942121   745 negotiation.cc:337] Failed RPC negotiation. Trace:
0925 07:19:58.941865 (+     0us) reactor.cc:625] Submitting negotiation task for server connection from 127.0.0.1:60140 (local address 127.0.0.1:44171)
0925 07:19:58.941933 (+    68us) server_negotiation.cc:206] Beginning negotiation
0925 07:19:58.941935 (+     2us) server_negotiation.cc:399] Waiting for connection header
0925 07:19:58.942033 (+    98us) negotiation.cc:327] Negotiation complete: Network error: Server connection negotiation failed: server connection from 127.0.0.1:60140: BlockingRecv error: recv got EOF from 127.0.0.1:60140 (error 108)
Metrics: {"server-negotiator.queue_time_us":31}
[       OK ] Parameters/TestRpc.RpcPendingConnectionsMetric/SSL_TCP (20 ms)
[ RUN      ] Parameters/TestRpc.TestRpcContextClientDeadline/SSL_TCP
I20260925 07:19:58.977977   765 acceptor_pool.cc:254] collecting diagnostics on the listening RPC socket 0.0.0.0:38953 every 8 connection(s)
I20260925 07:19:58.978029   766 acceptor_pool.cc:254] collecting diagnostics on the listening RPC socket 0.0.0.0:38953 every 8 connection(s)
[       OK ] Parameters/TestRpc.TestRpcContextClientDeadline/SSL_TCP (61 ms)
[ RUN      ] Parameters/TestRpc.TestApplicationFeatureFlagUnsupportedServer/SSL_TCP
I20260925 07:19:59.022810   790 acceptor_pool.cc:254] collecting diagnostics on the listening RPC socket 0.0.0.0:40333 every 8 connection(s)
I20260925 07:19:59.022872   791 acceptor_pool.cc:254] collecting diagnostics on the listening RPC socket 0.0.0.0:40333 every 8 connection(s)
[       OK ] Parameters/TestRpc.TestApplicationFeatureFlagUnsupportedServer/SSL_TCP (19 ms)
[ RUN      ] Parameters/TestRpc.TestCancellationAsync/SSL_TCP
I20260925 07:19:59.043773   815 acceptor_pool.cc:254] collecting diagnostics on the listening RPC socket 0.0.0.0:37185 every 8 connection(s)
I20260925 07:19:59.043819   816 acceptor_pool.cc:254] collecting diagnostics on the listening RPC socket 0.0.0.0:37185 every 8 connection(s)
I20260925 07:19:59.043962   383 rpc-test.cc:1716] Connecting to 0.0.0.0:37185
I20260925 07:19:59.057289   383 test_util.cc:268] Using random seed: -1958541946
I20260925 07:19:59.071754   819 rpc-test-base.h:240] got call: sleep_micros: 500 pattern: 4294967295 num_repetitions: 2097152 sidecar_idx: 0
I20260925 07:19:59.082685   819 rpc-test-base.h:240] got call: sleep_micros: 500 pattern: 4294967295 num_repetitions: 2097152 sidecar_idx: 0
I20260925 07:19:59.092931   819 rpc-test-base.h:240] got call: sleep_micros: 500 pattern: 4294967295 num_repetitions: 2097152 sidecar_idx: 0
I20260925 07:19:59.103475   819 rpc-test-base.h:240] got call: sleep_micros: 500 pattern: 4294967295 num_repetitions: 2097152 sidecar_idx: 0
I20260925 07:19:59.114151   819 rpc-test-base.h:240] got call: sleep_micros: 500 pattern: 4294967295 num_repetitions: 2097152 sidecar_idx: 0
I20260925 07:19:59.124914   819 rpc-test-base.h:240] got call: sleep_micros: 500 pattern: 4294967295 num_repetitions: 2097152 sidecar_idx: 0
I20260925 07:19:59.136003   819 rpc-test-base.h:240] got call: sleep_micros: 500 pattern: 4294967295 num_repetitions: 2097152 sidecar_idx: 0
I20260925 07:19:59.147509   819 rpc-test-base.h:240] got call: sleep_micros: 500 pattern: 4294967295 num_repetitions: 2097152 sidecar_idx: 0
W20260925 07:19:59.150373   813 connection.cc:441] server connection from 127.0.0.1:33224 torn down before Call kudu.rpc.GenericCalculatorService.SleepWithSidecar from 127.0.0.1:33224 (request call id 9) could send its response
[       OK ] Parameters/TestRpc.TestCancellationAsync/SSL_TCP (117 ms)
[ RUN      ] Parameters/TestRpc.TestPerformanceBySocketType/SSL_TCP
I20260925 07:19:59.164662   840 acceptor_pool.cc:254] collecting diagnostics on the listening RPC socket 0.0.0.0:35337 every 8 connection(s)
I20260925 07:19:59.164695   841 acceptor_pool.cc:254] collecting diagnostics on the listening RPC socket 0.0.0.0:35337 every 8 connection(s)
I20260925 07:19:59.164803   383 rpc-test.cc:1846] Connecting to 0.0.0.0:35337
I20260925 07:20:00.804697   383 rpc-test.cc:1859] Sending 1024MB via ssl-enabled tcp socket: real 1.615s	user 1.494s	sys 1.359s
I20260925 07:20:02.423229   383 rpc-test.cc:1859] Sending 1024MB via ssl-enabled tcp socket: real 1.618s	user 1.484s	sys 1.372s
I20260925 07:20:04.103726   383 rpc-test.cc:1859] Sending 1024MB via ssl-enabled tcp socket: real 1.680s	user 1.657s	sys 1.302s
I20260925 07:20:05.827210   383 rpc-test.cc:1859] Sending 1024MB via ssl-enabled tcp socket: real 1.723s	user 1.649s	sys 1.378s
I20260925 07:20:07.404690   383 rpc-test.cc:1859] Sending 1024MB via ssl-enabled tcp socket: real 1.577s	user 1.552s	sys 1.229s
[       OK ] Parameters/TestRpc.TestPerformanceBySocketType/SSL_TCP (8254 ms)
[----------] 20 tests from Parameters/TestRpc (26755 ms total)

[----------] 1 test from Parameters/TestRpcSocketTxRxQueue
[ RUN      ] Parameters/TestRpcSocketTxRxQueue.OverCapacity/0
W20260925 07:20:07.670138   875 negotiation.cc:337] Failed RPC negotiation. Trace:
0925 07:20:07.409339 (+     0us) reactor.cc:625] Submitting negotiation task for client connection to 0.0.0.0:36823 (local address 127.0.0.1:37988)
0925 07:20:07.409387 (+    48us) negotiation.cc:107] Waiting for socket to connect
0925 07:20:07.409396 (+     9us) client_negotiation.cc:174] Beginning negotiation
0925 07:20:07.409433 (+    37us) client_negotiation.cc:252] Sending NEGOTIATE NegotiatePB request
0925 07:20:07.670002 (+260569us) negotiation.cc:327] Negotiation complete: Network error: Client connection negotiation failed: client connection to 0.0.0.0:36823: BlockingRecv error: recv error from unknown peer: Transport endpoint is not connected (error 107)
Metrics: {"client-negotiator.queue_time_us":29}
W20260925 07:20:07.670136   893 negotiation.cc:337] Failed RPC negotiation. Trace:
0925 07:20:07.410990 (+     0us) reactor.cc:625] Submitting negotiation task for client connection to 0.0.0.0:36823 (local address 127.0.0.1:38006)
0925 07:20:07.411035 (+    45us) negotiation.cc:107] Waiting for socket to connect
0925 07:20:07.411043 (+     8us) client_negotiation.cc:174] Beginning negotiation
0925 07:20:07.411082 (+    39us) client_negotiation.cc:252] Sending NEGOTIATE NegotiatePB request
0925 07:20:07.670054 (+258972us) negotiation.cc:327] Negotiation complete: Network error: Client connection negotiation failed: client connection to 0.0.0.0:36823: BlockingRecv error: recv error from unknown peer: Transport endpoint is not connected (error 107)
Metrics: {"client-negotiator.queue_time_us":27}
W20260925 07:20:07.670143   884 negotiation.cc:337] Failed RPC negotiation. Trace:
0925 07:20:07.410132 (+     0us) reactor.cc:625] Submitting negotiation task for client connection to 0.0.0.0:36823 (local address 127.0.0.1:38002)
0925 07:20:07.410179 (+    47us) negotiation.cc:107] Waiting for socket to connect
0925 07:20:07.410187 (+     8us) client_negotiation.cc:174] Beginning negotiation
0925 07:20:07.410225 (+    38us) client_negotiation.cc:252] Sending NEGOTIATE NegotiatePB request
0925 07:20:07.669990 (+259765us) negotiation.cc:327] Negotiation complete: Network error: Client connection negotiation failed: client connection to 0.0.0.0:36823: BlockingRecv error: recv error from unknown peer: Transport endpoint is not connected (error 107)
Metrics: {"client-negotiator.queue_time_us":28}
W20260925 07:20:07.670143   856 negotiation.cc:337] Failed RPC negotiation. Trace:
0925 07:20:07.407663 (+     0us) reactor.cc:625] Submitting negotiation task for client connection to 0.0.0.0:36823 (local address 127.0.0.1:37968)
0925 07:20:07.407720 (+    57us) negotiation.cc:107] Waiting for socket to connect
0925 07:20:07.407734 (+    14us) client_negotiation.cc:174] Beginning negotiation
0925 07:20:07.407797 (+    63us) client_negotiation.cc:252] Sending NEGOTIATE NegotiatePB request
0925 07:20:07.670002 (+262205us) negotiation.cc:327] Negotiation complete: Network error: Client connection negotiation failed: client connection to 0.0.0.0:36823: BlockingRecv error: recv error from unknown peer: Transport endpoint is not connected (error 107)
Metrics: {"client-negotiator.queue_time_us":36}
W20260925 07:20:07.670472   866 negotiation.cc:337] Failed RPC negotiation. Trace:
0925 07:20:07.408570 (+     0us) reactor.cc:625] Submitting negotiation task for client connection to 0.0.0.0:36823 (local address 127.0.0.1:37982)
0925 07:20:07.408609 (+    39us) negotiation.cc:107] Waiting for socket to connect
0925 07:20:07.408618 (+     9us) client_negotiation.cc:174] Beginning negotiation
0925 07:20:07.408659 (+    41us) client_negotiation.cc:252] Sending NEGOTIATE NegotiatePB request
0925 07:20:07.669989 (+261330us) negotiation.cc:327] Negotiation complete: Network error: Client connection negotiation failed: client connection to 0.0.0.0:36823: BlockingRecv error: recv error from unknown peer: Transport endpoint is not connected (error 107)
Metrics: {"client-negotiator.queue_time_us":16}
W20260925 07:20:07.670579   902 negotiation.cc:337] Failed RPC negotiation. Trace:
0925 07:20:07.411777 (+     0us) reactor.cc:625] Submitting negotiation task for client connection to 0.0.0.0:36823 (local address 127.0.0.1:38020)
0925 07:20:07.411825 (+    48us) negotiation.cc:107] Waiting for socket to connect
0925 07:20:07.411833 (+     8us) client_negotiation.cc:174] Beginning negotiation
0925 07:20:07.411871 (+    38us) client_negotiation.cc:252] Sending NEGOTIATE NegotiatePB request
0925 07:20:07.670260 (+258389us) negotiation.cc:327] Negotiation complete: Network error: Client connection negotiation failed: client connection to 0.0.0.0:36823: BlockingRecv error: recv error from unknown peer: Transport endpoint is not connected (error 107)
Metrics: {"client-negotiator.queue_time_us":30}
[       OK ] Parameters/TestRpcSocketTxRxQueue.OverCapacity/0 (1028 ms)
[----------] 1 test from Parameters/TestRpcSocketTxRxQueue (1028 ms total)

[----------] Global test environment tear-down
[==========] 21 tests from 2 test suites ran. (27784 ms total)
[  PASSED  ] 20 tests.
[  FAILED  ] 1 test, listed below:
[  FAILED  ] Parameters/TestRpc.TestCallWithChainCertAndChainCA/SSL_TCP, where GetParam() = (true, false)

 1 FAILED TEST