Diagnosed failure

Parameters/TestRpc.TestCallWithChainCertAndChainCA/SSL_TCP: /data0/somelongdirectorytoavoidrpathissues/src/kudu/src/kudu/rpc/rpc-test.cc:270: Failure
Failed
Bad status: Runtime error: could not verify certificate chain (error with cert: subject=CN = localhost, ST = sadfjas, C = AS, emailAddress = sdflkdsajf, O = lskdfjlsad, OU = sldfkja, issuer=C = AS, ST = ASDfkjdhf, L = lskdjf, O = saldfja, OU = skdjf, CN = localhost, emailAddress = sadjflkadsj): : certificate has expired
Google Test trace:
/data0/somelongdirectorytoavoidrpathissues/src/kudu/src/kudu/rpc/rpc-test.cc:267: Connecting to 0.0.0.0:41349
I20260924 21:11:10.013363 16521 test_util.cc:175] -----------------------------------------------
I20260924 21:11:10.013422 16521 test_util.cc:176] Had fatal failures, leaving test files at /tmp/dist-test-taskDcNiaL/test-tmp/rpc-test.5.Parameters_TestRpc.TestCallWithChainCertAndChainCA_SSL_TCP.1790284269913041-16521-0

Full log

Note: This is test shard 6 of 8.
[==========] Running 21 tests from 2 test suites.
[----------] Global test environment set-up.
[----------] 20 tests from Parameters/TestRpc
[ RUN      ] Parameters/TestRpc.TestMessengerCreateDestroy/SSL_TCP
WARNING: Logging before InitGoogleLogging() is written to STDERR
I20260924 21:11:09.941866 16521 rpc-test.cc:169] started messenger TestCreateDestroy
[       OK ] Parameters/TestRpc.TestMessengerCreateDestroy/SSL_TCP (27 ms)
[ RUN      ] Parameters/TestRpc.TestNegotiationDeadlock/SSL_TCP
I20260924 21:11:09.959762 16542 acceptor_pool.cc:254] collecting diagnostics on the listening RPC socket 0.0.0.0:37389 every 8 connection(s)
I20260924 21:11:09.959762 16541 acceptor_pool.cc:254] collecting diagnostics on the listening RPC socket 0.0.0.0:37389 every 8 connection(s)
[       OK ] Parameters/TestRpc.TestNegotiationDeadlock/SSL_TCP (24 ms)
[ RUN      ] Parameters/TestRpc.TestCallWithChainCertAndChainCA/SSL_TCP
I20260924 21:11:10.009270 16557 acceptor_pool.cc:254] collecting diagnostics on the listening RPC socket 0.0.0.0:41349 every 8 connection(s)
I20260924 21:11:10.009270 16558 acceptor_pool.cc:254] collecting diagnostics on the listening RPC socket 0.0.0.0:41349 every 8 connection(s)
/data0/somelongdirectorytoavoidrpathissues/src/kudu/src/kudu/rpc/rpc-test.cc:270: Failure
Failed
Bad status: Runtime error: could not verify certificate chain (error with cert: subject=CN = localhost, ST = sadfjas, C = AS, emailAddress = sdflkdsajf, O = lskdfjlsad, OU = sldfkja, issuer=C = AS, ST = ASDfkjdhf, L = lskdjf, O = saldfja, OU = skdjf, CN = localhost, emailAddress = sadjflkadsj): : certificate has expired
Google Test trace:
/data0/somelongdirectorytoavoidrpathissues/src/kudu/src/kudu/rpc/rpc-test.cc:267: Connecting to 0.0.0.0:41349
I20260924 21:11:10.013363 16521 test_util.cc:175] -----------------------------------------------
I20260924 21:11:10.013422 16521 test_util.cc:176] Had fatal failures, leaving test files at /tmp/dist-test-taskDcNiaL/test-tmp/rpc-test.5.Parameters_TestRpc.TestCallWithChainCertAndChainCA_SSL_TCP.1790284269913041-16521-0
[  FAILED  ] Parameters/TestRpc.TestCallWithChainCertAndChainCA/SSL_TCP, where GetParam() = (true, false) (45 ms)
[ RUN      ] Parameters/TestRpc.TestCallWithPasswordProtectedKey/SSL_TCP
I20260924 21:11:10.021296 16582 acceptor_pool.cc:254] collecting diagnostics on the listening RPC socket 0.0.0.0:40839 every 8 connection(s)
I20260924 21:11:10.021333 16583 acceptor_pool.cc:254] collecting diagnostics on the listening RPC socket 0.0.0.0:40839 every 8 connection(s)
[       OK ] Parameters/TestRpc.TestCallWithPasswordProtectedKey/SSL_TCP (21 ms)
[ RUN      ] Parameters/TestRpc.TestCallToBadServer/SSL_TCP
I20260924 21:11:10.041337 16521 rpc-test.cc:394] Status: Network error: Client connection negotiation failed: client connection to 0.0.0.0:0: connect: Connection refused (error 111)
I20260924 21:11:10.041739 16521 rpc-test.cc:394] Status: Network error: Client connection negotiation failed: client connection to 0.0.0.0:0: connect: Connection refused (error 111)
I20260924 21:11:10.042042 16521 rpc-test.cc:394] Status: Network error: Client connection negotiation failed: client connection to 0.0.0.0:0: connect: Connection refused (error 111)
I20260924 21:11:10.042302 16521 rpc-test.cc:394] Status: Network error: Client connection negotiation failed: client connection to 0.0.0.0:0: connect: Connection refused (error 111)
I20260924 21:11:10.042539 16521 rpc-test.cc:394] Status: Network error: Client connection negotiation failed: client connection to 0.0.0.0:0: connect: Connection refused (error 111)
[       OK ] Parameters/TestRpc.TestCallToBadServer/SSL_TCP (8 ms)
[ RUN      ] Parameters/TestRpc.TestWrongService/SSL_TCP
I20260924 21:11:10.058287 16618 acceptor_pool.cc:254] collecting diagnostics on the listening RPC socket 0.0.0.0:43163 every 8 connection(s)
I20260924 21:11:10.058332 16617 acceptor_pool.cc:254] collecting diagnostics on the listening RPC socket 0.0.0.0:43163 every 8 connection(s)
I20260924 21:11:10.078244 16615 messenger.cc:345] service WrongServiceName not registered on TestServer
[       OK ] Parameters/TestRpc.TestWrongService/SSL_TCP (36 ms)
[ RUN      ] Parameters/TestRpc.TestConnectionKeepalive/SSL_TCP
I20260924 21:11:10.089960 16640 acceptor_pool.cc:254] collecting diagnostics on the listening RPC socket 0.0.0.0:36753 every 8 connection(s)
I20260924 21:11:10.090009 16641 acceptor_pool.cc:254] collecting diagnostics on the listening RPC socket 0.0.0.0:36753 every 8 connection(s)
I20260924 21:11:10.090291 16521 rpc-test.cc:488] Connecting to 0.0.0.0:36753
[       OK ] Parameters/TestRpc.TestConnectionKeepalive/SSL_TCP (1027 ms)
[ RUN      ] Parameters/TestRpc.TestClientConnectionMetrics/SSL_TCP
I20260924 21:11:11.117416 16665 acceptor_pool.cc:254] collecting diagnostics on the listening RPC socket 0.0.0.0:38949 every 8 connection(s)
I20260924 21:11:11.117465 16666 acceptor_pool.cc:254] collecting diagnostics on the listening RPC socket 0.0.0.0:38949 every 8 connection(s)
I20260924 21:11:11.117643 16521 rpc-test.cc:569] Connecting to 0.0.0.0:38949
[       OK ] Parameters/TestRpc.TestClientConnectionMetrics/SSL_TCP (9560 ms)
[ RUN      ] Parameters/TestRpc.TestCredentialsPolicy/SSL_TCP
I20260924 21:11:20.697989 16688 acceptor_pool.cc:254] collecting diagnostics on the listening RPC socket 0.0.0.0:33207 every 8 connection(s)
I20260924 21:11:20.698041 16689 acceptor_pool.cc:254] collecting diagnostics on the listening RPC socket 0.0.0.0:33207 every 8 connection(s)
I20260924 21:11:20.698177 16521 rpc-test.cc:700] Connecting to 0.0.0.0:33207
[       OK ] Parameters/TestRpc.TestCredentialsPolicy/SSL_TCP (55 ms)
[ RUN      ] Parameters/TestRpc.TestCallLongerThanKeepalive/SSL_TCP
I20260924 21:11:20.739691 16713 acceptor_pool.cc:254] collecting diagnostics on the listening RPC socket 0.0.0.0:39417 every 8 connection(s)
I20260924 21:11:20.739732 16714 acceptor_pool.cc:254] collecting diagnostics on the listening RPC socket 0.0.0.0:39417 every 8 connection(s)
I20260924 21:11:20.758026 16717 rpc-test-base.h:222] got call: sleep_micros: 3000000 deferred: true
I20260924 21:11:23.758704 16717 rpcz_store.cc:275] Call kudu.rpc.GenericCalculatorService.Sleep from 127.0.0.1:38986 (request call id 0) took 3000 ms. Trace:
I20260924 21:11:23.758831 16717 rpcz_store.cc:276] 0924 21:11:20.757971 (+     0us) service_pool.cc:170] Inserting onto call queue
0924 21:11:20.758007 (+    36us) service_pool.cc:227] Handling call
0924 21:11:23.758686 (+3000679us) inbound_call.cc:173] Queueing success response
Metrics: {}
[       OK ] Parameters/TestRpc.TestCallLongerThanKeepalive/SSL_TCP (3037 ms)
[ RUN      ] Parameters/TestRpc.TestRpcSidecar/SSL_TCP
I20260924 21:11:23.772624 16738 acceptor_pool.cc:254] collecting diagnostics on the listening RPC socket 0.0.0.0:34795 every 8 connection(s)
I20260924 21:11:23.772697 16739 acceptor_pool.cc:254] collecting diagnostics on the listening RPC socket 0.0.0.0:34795 every 8 connection(s)
[       OK ] Parameters/TestRpc.TestRpcSidecar/SSL_TCP (55 ms)
[ RUN      ] Parameters/TestRpc.TestRpcSidecarLimits/SSL_TCP
I20260924 21:11:25.528955 16763 acceptor_pool.cc:254] collecting diagnostics on the listening RPC socket 0.0.0.0:43329 every 8 connection(s)
I20260924 21:11:25.528997 16764 acceptor_pool.cc:254] collecting diagnostics on the listening RPC socket 0.0.0.0:43329 every 8 connection(s)
W20260924 21:11:25.545938 16521 serialization.cc:72] Serialized kudu.rpc_test.PushStringsRequestPB (2147483654 bytes) is larger than the maximum configured RPC message size (52428800 bytes). Sending anyway, but peer may reject the data.
W20260924 21:11:25.549482 16761 connection.cc:535] server connection from 127.0.0.1:40876 recv error: Network error: RPC frame had a length of 2147483714, but we only support messages up to 52428800 bytes long.
W20260924 21:11:25.549562 16761 connection.cc:158] shutting down server connection from 127.0.0.1:40876 with pending inbound data: 4/2147483714 bytes received; last active 0 ns ago: status Network error: RPC frame had a length of 2147483714, but we only support messages up to 52428800 bytes long.
W20260924 21:11:25.549821 16776 connection.cc:196] Error closing socket: Network error: TlsSocket::Close: Connection reset by peer
I20260924 21:11:25.569991 16788 acceptor_pool.cc:254] collecting diagnostics on the listening RPC socket 0.0.0.0:33351 every 8 connection(s)
I20260924 21:11:25.570032 16789 acceptor_pool.cc:254] collecting diagnostics on the listening RPC socket 0.0.0.0:33351 every 8 connection(s)
W20260924 21:11:29.377635 16785 connection.cc:577] server connection from 127.0.0.1:48196: received bad data: 'Corruption: Invalid packet: message had a length of 2147483710, but we only support messages up to 2147483647 bytes
'
[       OK ] Parameters/TestRpc.TestRpcSidecarLimits/SSL_TCP (5564 ms)
[ RUN      ] Parameters/TestRpc.TestCallTimeoutDoesntAffectNegotiation/SSL_TCP
I20260924 21:11:29.415107 16814 acceptor_pool.cc:254] collecting diagnostics on the listening RPC socket 0.0.0.0:43849 every 8 connection(s)
I20260924 21:11:29.415079 16813 acceptor_pool.cc:254] collecting diagnostics on the listening RPC socket 0.0.0.0:43849 every 8 connection(s)
W20260924 21:11:29.432430 16809 negotiation.cc:266] Injecting 500ms delay in negotiation
I20260924 21:11:29.482678 16521 rpc-test-base.h:595] status: Timed out: connection negotiation to 0.0.0.0:43849 for RPC Sleep timed out after 0.050s (ON_OUTBOUND_QUEUE), seconds elapsed: 0.0506309
[       OK ] Parameters/TestRpc.TestCallTimeoutDoesntAffectNegotiation/SSL_TCP (556 ms)
[ RUN      ] Parameters/TestRpc.TestRpcHandlerLatencyMetric/SSL_TCP
I20260924 21:11:29.954061 16838 acceptor_pool.cc:254] collecting diagnostics on the listening RPC socket 0.0.0.0:34025 every 8 connection(s)
I20260924 21:11:29.954088 16839 acceptor_pool.cc:254] collecting diagnostics on the listening RPC socket 0.0.0.0:34025 every 8 connection(s)
I20260924 21:11:29.983086 16521 rpc-test.cc:1236] Sleep() min lat: 20306
I20260924 21:11:29.983181 16521 rpc-test.cc:1237] Sleep() mean lat: 20306
I20260924 21:11:29.983212 16521 rpc-test.cc:1238] Sleep() max lat: 20306
I20260924 21:11:29.983229 16521 rpc-test.cc:1239] Sleep() #calls: 1
[       OK ] Parameters/TestRpc.TestRpcHandlerLatencyMetric/SSL_TCP (47 ms)
[ RUN      ] Parameters/TestRpc.TimedOutOnResponseMetricServiceQueue/SSL_TCP
I20260924 21:11:30.001238 16864 acceptor_pool.cc:254] collecting diagnostics on the listening RPC socket 0.0.0.0:38545 every 8 connection(s)
I20260924 21:11:30.001276 16865 acceptor_pool.cc:254] collecting diagnostics on the listening RPC socket 0.0.0.0:38545 every 8 connection(s)
W20260924 21:11:30.051084 16866 rpcz_store.cc:267] Call kudu.rpc_test.CalculatorService.Sleep from 127.0.0.1:54256 (request call id 2) took 20 ms (client timeout 20 ms). Trace:
W20260924 21:11:30.051211 16866 rpcz_store.cc:269] 0924 21:11:30.030765 (+     0us) service_pool.cc:170] Inserting onto call queue
0924 21:11:30.051010 (+ 20245us) service_pool.cc:214] Skipping call since client already timed out
0924 21:11:30.051019 (+     9us) inbound_call.cc:173] Queueing failure response
Metrics: {}
[       OK ] Parameters/TestRpc.TimedOutOnResponseMetricServiceQueue/SSL_TCP (67 ms)
[ RUN      ] Parameters/TestRpc.RpcPendingConnectionsMetric/SSL_TCP
I20260924 21:11:30.054409 16887 acceptor_pool.cc:254] collecting diagnostics on the listening RPC socket 0.0.0.0:43903 every 8 connection(s)
I20260924 21:11:30.054471 16888 acceptor_pool.cc:254] collecting diagnostics on the listening RPC socket 0.0.0.0:43903 every 8 connection(s)
W20260924 21:11:30.055076 16883 negotiation.cc:337] Failed RPC negotiation. Trace:
0924 21:11:30.054920 (+     0us) reactor.cc:625] Submitting negotiation task for server connection from 127.0.0.1:37394 (local address 127.0.0.1:43903)
0924 21:11:30.054960 (+    40us) server_negotiation.cc:206] Beginning negotiation
0924 21:11:30.054961 (+     1us) server_negotiation.cc:399] Waiting for connection header
0924 21:11:30.055023 (+    62us) negotiation.cc:327] Negotiation complete: Network error: Server connection negotiation failed: server connection from 127.0.0.1:37394: BlockingRecv error: recv got EOF from 127.0.0.1:37394 (error 108)
Metrics: {"server-negotiator.queue_time_us":13}
[       OK ] Parameters/TestRpc.RpcPendingConnectionsMetric/SSL_TCP (13 ms)
[ RUN      ] Parameters/TestRpc.TestRpcContextClientDeadline/SSL_TCP
I20260924 21:11:30.078449 16903 acceptor_pool.cc:254] collecting diagnostics on the listening RPC socket 0.0.0.0:42927 every 8 connection(s)
I20260924 21:11:30.078529 16904 acceptor_pool.cc:254] collecting diagnostics on the listening RPC socket 0.0.0.0:42927 every 8 connection(s)
[       OK ] Parameters/TestRpc.TestRpcContextClientDeadline/SSL_TCP (46 ms)
[ RUN      ] Parameters/TestRpc.TestApplicationFeatureFlagUnsupportedServer/SSL_TCP
I20260924 21:11:30.127449 16928 acceptor_pool.cc:254] collecting diagnostics on the listening RPC socket 0.0.0.0:34375 every 8 connection(s)
I20260924 21:11:30.127461 16929 acceptor_pool.cc:254] collecting diagnostics on the listening RPC socket 0.0.0.0:34375 every 8 connection(s)
[       OK ] Parameters/TestRpc.TestApplicationFeatureFlagUnsupportedServer/SSL_TCP (49 ms)
[ RUN      ] Parameters/TestRpc.TestCancellationAsync/SSL_TCP
I20260924 21:11:30.196323 16953 acceptor_pool.cc:254] collecting diagnostics on the listening RPC socket 0.0.0.0:32995 every 8 connection(s)
I20260924 21:11:30.196341 16954 acceptor_pool.cc:254] collecting diagnostics on the listening RPC socket 0.0.0.0:32995 every 8 connection(s)
I20260924 21:11:30.196511 16521 rpc-test.cc:1716] Connecting to 0.0.0.0:32995
I20260924 21:11:30.209512 16521 test_util.cc:268] Using random seed: 187315941
I20260924 21:11:30.232081 16957 rpc-test-base.h:240] got call: sleep_micros: 500 pattern: 4294967295 num_repetitions: 2097152 sidecar_idx: 0
I20260924 21:11:30.249769 16957 rpc-test-base.h:240] got call: sleep_micros: 500 pattern: 4294967295 num_repetitions: 2097152 sidecar_idx: 0
I20260924 21:11:30.268375 16957 rpc-test-base.h:240] got call: sleep_micros: 500 pattern: 4294967295 num_repetitions: 2097152 sidecar_idx: 0
I20260924 21:11:30.287050 16957 rpc-test-base.h:240] got call: sleep_micros: 500 pattern: 4294967295 num_repetitions: 2097152 sidecar_idx: 0
I20260924 21:11:30.305606 16957 rpc-test-base.h:240] got call: sleep_micros: 500 pattern: 4294967295 num_repetitions: 2097152 sidecar_idx: 0
I20260924 21:11:30.324798 16957 rpc-test-base.h:240] got call: sleep_micros: 500 pattern: 4294967295 num_repetitions: 2097152 sidecar_idx: 0
I20260924 21:11:30.337352 16957 rpc-test-base.h:240] got call: sleep_micros: 500 pattern: 4294967295 num_repetitions: 2097152 sidecar_idx: 0
W20260924 21:11:30.340576 16950 connection.cc:441] server connection from 127.0.0.1:33440 torn down before Call kudu.rpc.GenericCalculatorService.SleepWithSidecar from 127.0.0.1:33440 (request call id 9) could send its response
[       OK ] Parameters/TestRpc.TestCancellationAsync/SSL_TCP (179 ms)
[ RUN      ] Parameters/TestRpc.TestPerformanceBySocketType/SSL_TCP
I20260924 21:11:30.372216 16978 acceptor_pool.cc:254] collecting diagnostics on the listening RPC socket 0.0.0.0:33527 every 8 connection(s)
I20260924 21:11:30.372238 16979 acceptor_pool.cc:254] collecting diagnostics on the listening RPC socket 0.0.0.0:33527 every 8 connection(s)
I20260924 21:11:30.372402 16521 rpc-test.cc:1846] Connecting to 0.0.0.0:33527
I20260924 21:11:32.047919 16521 rpc-test.cc:1859] Sending 1024MB via ssl-enabled tcp socket: real 1.638s	user 1.492s	sys 1.414s
I20260924 21:11:33.778051 16521 rpc-test.cc:1859] Sending 1024MB via ssl-enabled tcp socket: real 1.730s	user 1.585s	sys 1.487s
I20260924 21:11:35.518348 16521 rpc-test.cc:1859] Sending 1024MB via ssl-enabled tcp socket: real 1.740s	user 1.571s	sys 1.499s
I20260924 21:11:37.303997 16521 rpc-test.cc:1859] Sending 1024MB via ssl-enabled tcp socket: real 1.786s	user 1.629s	sys 1.513s
I20260924 21:11:38.946396 16521 rpc-test.cc:1859] Sending 1024MB via ssl-enabled tcp socket: real 1.642s	user 1.494s	sys 1.411s
[       OK ] Parameters/TestRpc.TestPerformanceBySocketType/SSL_TCP (8606 ms)
[----------] 20 tests from Parameters/TestRpc (29032 ms total)

[----------] 1 test from Parameters/TestRpcSocketTxRxQueue
[ RUN      ] Parameters/TestRpcSocketTxRxQueue.OverCapacity/0
W20260924 21:11:39.215018 17004 negotiation.cc:337] Failed RPC negotiation. Trace:
0924 21:11:38.951136 (+     0us) reactor.cc:625] Submitting negotiation task for client connection to 0.0.0.0:45587 (local address 127.0.0.1:49656)
0924 21:11:38.951175 (+    39us) negotiation.cc:107] Waiting for socket to connect
0924 21:11:38.951183 (+     8us) client_negotiation.cc:174] Beginning negotiation
0924 21:11:38.951221 (+    38us) client_negotiation.cc:252] Sending NEGOTIATE NegotiatePB request
0924 21:11:39.214879 (+263658us) negotiation.cc:327] Negotiation complete: Network error: Client connection negotiation failed: client connection to 0.0.0.0:45587: BlockingRecv error: recv error from unknown peer: Transport endpoint is not connected (error 107)
Metrics: {"client-negotiator.queue_time_us":19}
W20260924 21:11:39.215195 17031 negotiation.cc:337] Failed RPC negotiation. Trace:
0924 21:11:38.954045 (+     0us) reactor.cc:625] Submitting negotiation task for client connection to 0.0.0.0:45587 (local address 127.0.0.1:49688)
0924 21:11:38.954100 (+    55us) negotiation.cc:107] Waiting for socket to connect
0924 21:11:38.954109 (+     9us) client_negotiation.cc:174] Beginning negotiation
0924 21:11:38.954163 (+    54us) client_negotiation.cc:252] Sending NEGOTIATE NegotiatePB request
0924 21:11:39.215152 (+260989us) negotiation.cc:327] Negotiation complete: Network error: Client connection negotiation failed: client connection to 0.0.0.0:45587: BlockingRecv error: recv error from unknown peer: Transport endpoint is not connected (error 107)
Metrics: {"client-negotiator.queue_time_us":34}
W20260924 21:11:39.215296 17013 negotiation.cc:337] Failed RPC negotiation. Trace:
0924 21:11:38.952059 (+     0us) reactor.cc:625] Submitting negotiation task for client connection to 0.0.0.0:45587 (local address 127.0.0.1:49672)
0924 21:11:38.952128 (+    69us) negotiation.cc:107] Waiting for socket to connect
0924 21:11:38.952138 (+    10us) client_negotiation.cc:174] Beginning negotiation
0924 21:11:38.952193 (+    55us) client_negotiation.cc:252] Sending NEGOTIATE NegotiatePB request
0924 21:11:39.214880 (+262687us) negotiation.cc:327] Negotiation complete: Network error: Client connection negotiation failed: client connection to 0.0.0.0:45587: BlockingRecv error: recv error from unknown peer: Transport endpoint is not connected (error 107)
Metrics: {"client-negotiator.queue_time_us":38}
W20260924 21:11:39.215036 17022 negotiation.cc:337] Failed RPC negotiation. Trace:
0924 21:11:38.952956 (+     0us) reactor.cc:625] Submitting negotiation task for client connection to 0.0.0.0:45587 (local address 127.0.0.1:49686)
0924 21:11:38.953012 (+    56us) negotiation.cc:107] Waiting for socket to connect
0924 21:11:38.953021 (+     9us) client_negotiation.cc:174] Beginning negotiation
0924 21:11:38.953064 (+    43us) client_negotiation.cc:252] Sending NEGOTIATE NegotiatePB request
0924 21:11:39.214953 (+261889us) negotiation.cc:327] Negotiation complete: Network error: Client connection negotiation failed: client connection to 0.0.0.0:45587: BlockingRecv error: recv error from unknown peer: Transport endpoint is not connected (error 107)
Metrics: {"client-negotiator.queue_time_us":35}
W20260924 21:11:39.215027 17040 negotiation.cc:337] Failed RPC negotiation. Trace:
0924 21:11:38.955117 (+     0us) reactor.cc:625] Submitting negotiation task for client connection to 0.0.0.0:45587 (local address 127.0.0.1:49692)
0924 21:11:38.955181 (+    64us) negotiation.cc:107] Waiting for socket to connect
0924 21:11:38.955190 (+     9us) client_negotiation.cc:174] Beginning negotiation
0924 21:11:38.955235 (+    45us) client_negotiation.cc:252] Sending NEGOTIATE NegotiatePB request
0924 21:11:39.214982 (+259747us) negotiation.cc:327] Negotiation complete: Network error: Client connection negotiation failed: client connection to 0.0.0.0:45587: BlockingRecv error: recv error from unknown peer: Transport endpoint is not connected (error 107)
Metrics: {"client-negotiator.queue_time_us":44}
W20260924 21:11:39.215598 16994 negotiation.cc:337] Failed RPC negotiation. Trace:
0924 21:11:38.950225 (+     0us) reactor.cc:625] Submitting negotiation task for client connection to 0.0.0.0:45587 (local address 127.0.0.1:49642)
0924 21:11:38.950269 (+    44us) negotiation.cc:107] Waiting for socket to connect
0924 21:11:38.950279 (+    10us) client_negotiation.cc:174] Beginning negotiation
0924 21:11:38.950335 (+    56us) client_negotiation.cc:252] Sending NEGOTIATE NegotiatePB request
0924 21:11:39.214887 (+264552us) negotiation.cc:327] Negotiation complete: Network error: Client connection negotiation failed: client connection to 0.0.0.0:45587: BlockingRecv error: recv error from unknown peer: Transport endpoint is not connected (error 107)
Metrics: {"client-negotiator.queue_time_us":18}
[       OK ] Parameters/TestRpcSocketTxRxQueue.OverCapacity/0 (1029 ms)
[----------] 1 test from Parameters/TestRpcSocketTxRxQueue (1029 ms total)

[----------] Global test environment tear-down
[==========] 21 tests from 2 test suites ran. (30062 ms total)
[  PASSED  ] 20 tests.
[  FAILED  ] 1 test, listed below:
[  FAILED  ] Parameters/TestRpc.TestCallWithChainCertAndChainCA/SSL_TCP, where GetParam() = (true, false)

 1 FAILED TEST