Diagnosed failure
Parameters/TestRpc.TestCallWithChainCertAndChainCA/SSL_UnixSocket: /data0/somelongdirectorytoavoidrpathissues/src/kudu/src/kudu/rpc/rpc-test.cc:270: Failure
Failed
Bad status: Runtime error: could not verify certificate chain (error with cert: subject=CN = localhost, ST = sadfjas, C = AS, emailAddress = sdflkdsajf, O = lskdfjlsad, OU = sldfkja, issuer=C = AS, ST = ASDfkjdhf, L = lskdjf, O = saldfja, OU = skdjf, CN = localhost, emailAddress = sadjflkadsj): : certificate has expired
Google Test trace:
/data0/somelongdirectorytoavoidrpathissues/src/kudu/src/kudu/rpc/rpc-test.cc:267: Connecting to unix:/tmp/dist-test-taskzpNd26/test-tmp/rpc-test-150f4da92c634b87a92b4ec4f9861c3a.sock
I20260926 21:54:53.825313 1185 test_util.cc:175] -----------------------------------------------
I20260926 21:54:53.825489 1185 test_util.cc:176] Had fatal failures, leaving test files at /tmp/dist-test-taskzpNd26/test-tmp/rpc-test.6.Parameters_TestRpc.TestCallWithChainCertAndChainCA_SSL_UnixSocket.1790459692453324-1185-0
Full log
Note: This is test shard 7 of 8.
[==========] Running 21 tests from 2 test suites.
[----------] Global test environment set-up.
[----------] 20 tests from Parameters/TestRpc
[ RUN ] Parameters/TestRpc.TestMessengerCreateDestroy/SSL_UnixSocket
WARNING: Logging before InitGoogleLogging() is written to STDERR
I20260926 21:54:52.549150 1185 rpc-test.cc:169] started messenger TestCreateDestroy
[ OK ] Parameters/TestRpc.TestMessengerCreateDestroy/SSL_UnixSocket (1178 ms)
[ RUN ] Parameters/TestRpc.TestNegotiationDeadlock/SSL_UnixSocket
I20260926 21:54:53.715024 1207 acceptor_pool.cc:254] collecting diagnostics on the listening RPC socket unix:/tmp/dist-test-taskzpNd26/test-tmp/rpc-test-ef56f77c0993437797ae5b3c925493e0.sock every 8 connection(s)
I20260926 21:54:53.716329 1208 acceptor_pool.cc:254] collecting diagnostics on the listening RPC socket unix:/tmp/dist-test-taskzpNd26/test-tmp/rpc-test-ef56f77c0993437797ae5b3c925493e0.sock every 8 connection(s)
[ OK ] Parameters/TestRpc.TestNegotiationDeadlock/SSL_UnixSocket (85 ms)
[ RUN ] Parameters/TestRpc.TestCallWithChainCertAndChainCA/SSL_UnixSocket
I20260926 21:54:53.793956 1223 acceptor_pool.cc:254] collecting diagnostics on the listening RPC socket unix:/tmp/dist-test-taskzpNd26/test-tmp/rpc-test-150f4da92c634b87a92b4ec4f9861c3a.sock every 8 connection(s)
I20260926 21:54:53.796597 1224 acceptor_pool.cc:254] collecting diagnostics on the listening RPC socket unix:/tmp/dist-test-taskzpNd26/test-tmp/rpc-test-150f4da92c634b87a92b4ec4f9861c3a.sock every 8 connection(s)
/data0/somelongdirectorytoavoidrpathissues/src/kudu/src/kudu/rpc/rpc-test.cc:270: Failure
Failed
Bad status: Runtime error: could not verify certificate chain (error with cert: subject=CN = localhost, ST = sadfjas, C = AS, emailAddress = sdflkdsajf, O = lskdfjlsad, OU = sldfkja, issuer=C = AS, ST = ASDfkjdhf, L = lskdjf, O = saldfja, OU = skdjf, CN = localhost, emailAddress = sadjflkadsj): : certificate has expired
Google Test trace:
/data0/somelongdirectorytoavoidrpathissues/src/kudu/src/kudu/rpc/rpc-test.cc:267: Connecting to unix:/tmp/dist-test-taskzpNd26/test-tmp/rpc-test-150f4da92c634b87a92b4ec4f9861c3a.sock
I20260926 21:54:53.825313 1185 test_util.cc:175] -----------------------------------------------
I20260926 21:54:53.825489 1185 test_util.cc:176] Had fatal failures, leaving test files at /tmp/dist-test-taskzpNd26/test-tmp/rpc-test.6.Parameters_TestRpc.TestCallWithChainCertAndChainCA_SSL_UnixSocket.1790459692453324-1185-0
[ FAILED ] Parameters/TestRpc.TestCallWithChainCertAndChainCA/SSL_UnixSocket, where GetParam() = (true, true) (55 ms)
[ RUN ] Parameters/TestRpc.TestCallWithPasswordProtectedKey/SSL_UnixSocket
I20260926 21:54:53.843497 1248 acceptor_pool.cc:254] collecting diagnostics on the listening RPC socket unix:/tmp/dist-test-taskzpNd26/test-tmp/rpc-test-162ca91019074c20bbd48ec9433bd0c2.sock every 8 connection(s)
I20260926 21:54:53.844259 1249 acceptor_pool.cc:254] collecting diagnostics on the listening RPC socket unix:/tmp/dist-test-taskzpNd26/test-tmp/rpc-test-162ca91019074c20bbd48ec9433bd0c2.sock every 8 connection(s)
[ OK ] Parameters/TestRpc.TestCallWithPasswordProtectedKey/SSL_UnixSocket (68 ms)
[ RUN ] Parameters/TestRpc.TestCallToBadServer/SSL_UnixSocket
I20260926 21:54:53.929461 1185 rpc-test.cc:394] Status: Network error: Client connection negotiation failed: client connection to 0.0.0.0:0: connect: Connection refused (error 111)
I20260926 21:54:53.930795 1185 rpc-test.cc:394] Status: Network error: Client connection negotiation failed: client connection to 0.0.0.0:0: connect: Connection refused (error 111)
I20260926 21:54:53.932034 1185 rpc-test.cc:394] Status: Network error: Client connection negotiation failed: client connection to 0.0.0.0:0: connect: Connection refused (error 111)
I20260926 21:54:53.933265 1185 rpc-test.cc:394] Status: Network error: Client connection negotiation failed: client connection to 0.0.0.0:0: connect: Connection refused (error 111)
I20260926 21:54:53.934501 1185 rpc-test.cc:394] Status: Network error: Client connection negotiation failed: client connection to 0.0.0.0:0: connect: Connection refused (error 111)
[ OK ] Parameters/TestRpc.TestCallToBadServer/SSL_UnixSocket (43 ms)
[ RUN ] Parameters/TestRpc.TestWrongService/SSL_UnixSocket
I20260926 21:54:53.962919 1283 acceptor_pool.cc:254] collecting diagnostics on the listening RPC socket unix:/tmp/dist-test-taskzpNd26/test-tmp/rpc-test-42428a33904c4b99a68ffd765048ebf2.sock every 8 connection(s)
I20260926 21:54:53.963706 1284 acceptor_pool.cc:254] collecting diagnostics on the listening RPC socket unix:/tmp/dist-test-taskzpNd26/test-tmp/rpc-test-42428a33904c4b99a68ffd765048ebf2.sock every 8 connection(s)
I20260926 21:54:54.002777 1280 messenger.cc:345] service WrongServiceName not registered on TestServer
[ OK ] Parameters/TestRpc.TestWrongService/SSL_UnixSocket (73 ms)
[ RUN ] Parameters/TestRpc.TestConnectionKeepalive/SSL_UnixSocket
I20260926 21:54:54.032650 1306 acceptor_pool.cc:254] collecting diagnostics on the listening RPC socket unix:/tmp/dist-test-taskzpNd26/test-tmp/rpc-test-174d74709adc4da594a5076ce2da76f2.sock every 8 connection(s)
I20260926 21:54:54.033380 1307 acceptor_pool.cc:254] collecting diagnostics on the listening RPC socket unix:/tmp/dist-test-taskzpNd26/test-tmp/rpc-test-174d74709adc4da594a5076ce2da76f2.sock every 8 connection(s)
I20260926 21:54:54.036554 1185 rpc-test.cc:488] Connecting to unix:/tmp/dist-test-taskzpNd26/test-tmp/rpc-test-174d74709adc4da594a5076ce2da76f2.sock
W20260926 21:54:54.514989 1319 connection.cc:196] Error closing socket: Network error: TlsSocket::Close: Broken pipe
[ OK ] Parameters/TestRpc.TestConnectionKeepalive/SSL_UnixSocket (1065 ms)
[ RUN ] Parameters/TestRpc.TestClientConnectionMetrics/SSL_UnixSocket
I20260926 21:54:55.095579 1331 acceptor_pool.cc:254] collecting diagnostics on the listening RPC socket unix:/tmp/dist-test-taskzpNd26/test-tmp/rpc-test-8c5f58173a3741d0b830e9a7fd6e1cd1.sock every 8 connection(s)
I20260926 21:54:55.096284 1332 acceptor_pool.cc:254] collecting diagnostics on the listening RPC socket unix:/tmp/dist-test-taskzpNd26/test-tmp/rpc-test-8c5f58173a3741d0b830e9a7fd6e1cd1.sock every 8 connection(s)
I20260926 21:54:55.099547 1185 rpc-test.cc:569] Connecting to unix:/tmp/dist-test-taskzpNd26/test-tmp/rpc-test-8c5f58173a3741d0b830e9a7fd6e1cd1.sock
W20260926 21:57:10.978494 1328 connection.cc:196] Error closing socket: Network error: TlsSocket::Close: Broken pipe
[ OK ] Parameters/TestRpc.TestClientConnectionMetrics/SSL_UnixSocket (135908 ms)
[ RUN ] Parameters/TestRpc.TestCredentialsPolicy/SSL_UnixSocket
I20260926 21:57:11.005450 1367 acceptor_pool.cc:254] collecting diagnostics on the listening RPC socket unix:/tmp/dist-test-taskzpNd26/test-tmp/rpc-test-60c5493c2afe4b04a74694753d9fd63b.sock every 8 connection(s)
I20260926 21:57:11.006328 1368 acceptor_pool.cc:254] collecting diagnostics on the listening RPC socket unix:/tmp/dist-test-taskzpNd26/test-tmp/rpc-test-60c5493c2afe4b04a74694753d9fd63b.sock every 8 connection(s)
I20260926 21:57:11.009454 1185 rpc-test.cc:700] Connecting to unix:/tmp/dist-test-taskzpNd26/test-tmp/rpc-test-60c5493c2afe4b04a74694753d9fd63b.sock
W20260926 21:57:11.045217 1366 connection.cc:196] Error closing socket: Network error: TlsSocket::Close: Broken pipe
[ OK ] Parameters/TestRpc.TestCredentialsPolicy/SSL_UnixSocket (80 ms)
[ RUN ] Parameters/TestRpc.TestCallLongerThanKeepalive/SSL_UnixSocket
I20260926 21:57:11.085865 1392 acceptor_pool.cc:254] collecting diagnostics on the listening RPC socket unix:/tmp/dist-test-taskzpNd26/test-tmp/rpc-test-485053142d3f4513952e56791776110f.sock every 8 connection(s)
I20260926 21:57:11.086499 1393 acceptor_pool.cc:254] collecting diagnostics on the listening RPC socket unix:/tmp/dist-test-taskzpNd26/test-tmp/rpc-test-485053142d3f4513952e56791776110f.sock every 8 connection(s)
I20260926 21:57:11.113480 1396 rpc-test-base.h:222] got call: sleep_micros: 3000000 deferred: true
I20260926 21:57:14.117906 1396 rpcz_store.cc:275] Call kudu.rpc.GenericCalculatorService.Sleep from unix:<unnamed> (request call id 0) took 3004 ms. Trace:
I20260926 21:57:14.118341 1396 rpcz_store.cc:276] 0926 21:57:11.113326 (+ 0us) service_pool.cc:170] Inserting onto call queue
0926 21:57:11.113427 (+ 101us) service_pool.cc:227] Handling call
0926 21:57:14.117734 (+3004307us) inbound_call.cc:173] Queueing success response
Metrics: {}
[ OK ] Parameters/TestRpc.TestCallLongerThanKeepalive/SSL_UnixSocket (3063 ms)
[ RUN ] Parameters/TestRpc.TestRpcSidecar/SSL_UnixSocket
I20260926 21:57:14.175834 1418 acceptor_pool.cc:254] collecting diagnostics on the listening RPC socket unix:/tmp/dist-test-taskzpNd26/test-tmp/rpc-test-00e973a0c4b1458ba2deca6e66177d3d.sock every 8 connection(s)
I20260926 21:57:14.176695 1419 acceptor_pool.cc:254] collecting diagnostics on the listening RPC socket unix:/tmp/dist-test-taskzpNd26/test-tmp/rpc-test-00e973a0c4b1458ba2deca6e66177d3d.sock every 8 connection(s)
[ OK ] Parameters/TestRpc.TestRpcSidecar/SSL_UnixSocket (573 ms)
[ RUN ] Parameters/TestRpc.TestRpcSidecarLimits/SSL_UnixSocket
I20260926 21:57:31.440759 1444 acceptor_pool.cc:254] collecting diagnostics on the listening RPC socket unix:/tmp/dist-test-taskzpNd26/test-tmp/rpc-test-d265e7fd47774dda9c2f4f1befc2c379.sock every 8 connection(s)
I20260926 21:57:31.441565 1445 acceptor_pool.cc:254] collecting diagnostics on the listening RPC socket unix:/tmp/dist-test-taskzpNd26/test-tmp/rpc-test-d265e7fd47774dda9c2f4f1befc2c379.sock every 8 connection(s)
W20260926 21:57:31.483049 1185 serialization.cc:72] Serialized kudu.rpc_test.PushStringsRequestPB (2147483654 bytes) is larger than the maximum configured RPC message size (52428800 bytes). Sending anyway, but peer may reject the data.
W20260926 21:57:31.493777 1441 connection.cc:535] server connection from unix:<unnamed> recv error: Network error: RPC frame had a length of 2147483714, but we only support messages up to 52428800 bytes long.
W20260926 21:57:31.494113 1441 connection.cc:158] shutting down server connection from unix:<unnamed> with pending inbound data: 4/2147483714 bytes received; last active 0 ns ago: status Network error: RPC frame had a length of 2147483714, but we only support messages up to 52428800 bytes long.
W20260926 21:57:31.494807 1457 connection.cc:698] client connection to unix:/tmp/dist-test-taskzpNd26/test-tmp/rpc-test-d265e7fd47774dda9c2f4f1befc2c379.sock send error: Network error: failed to write to TLS socket: Broken pipe
W20260926 21:57:31.495352 1457 connection.cc:196] Error closing socket: Network error: TlsSocket::Close: Success
[ OK ] Parameters/TestRpc.TestRpcSidecarLimits/SSL_UnixSocket (17586 ms)
[ RUN ] Parameters/TestRpc.TestCallTimeoutDoesntAffectNegotiation/SSL_UnixSocket
I20260926 21:57:32.312762 1469 acceptor_pool.cc:254] collecting diagnostics on the listening RPC socket unix:/tmp/dist-test-taskzpNd26/test-tmp/rpc-test-d1aa85233dad4127a667931d9b58c09d.sock every 8 connection(s)
I20260926 21:57:32.313506 1470 acceptor_pool.cc:254] collecting diagnostics on the listening RPC socket unix:/tmp/dist-test-taskzpNd26/test-tmp/rpc-test-d1aa85233dad4127a667931d9b58c09d.sock every 8 connection(s)
W20260926 21:57:32.357126 1465 negotiation.cc:266] Injecting 500ms delay in negotiation
I20260926 21:57:32.406749 1185 rpc-test-base.h:595] status: Timed out: connection negotiation to unix:/tmp/dist-test-taskzpNd26/test-tmp/rpc-test-d1aa85233dad4127a667931d9b58c09d.sock for RPC Sleep timed out after 0.050s (ON_OUTBOUND_QUEUE), seconds elapsed: 0.0505937
W20260926 21:57:32.869993 1466 connection.cc:196] Error closing socket: Network error: TlsSocket::Close: Broken pipe
[ OK ] Parameters/TestRpc.TestCallTimeoutDoesntAffectNegotiation/SSL_UnixSocket (583 ms)
[ RUN ] Parameters/TestRpc.TestRpcHandlerLatencyMetric/SSL_UnixSocket
I20260926 21:57:32.915747 1494 acceptor_pool.cc:254] collecting diagnostics on the listening RPC socket unix:/tmp/dist-test-taskzpNd26/test-tmp/rpc-test-6337127313de4478a45be5eaea720b5a.sock every 8 connection(s)
I20260926 21:57:32.916503 1495 acceptor_pool.cc:254] collecting diagnostics on the listening RPC socket unix:/tmp/dist-test-taskzpNd26/test-tmp/rpc-test-6337127313de4478a45be5eaea720b5a.sock every 8 connection(s)
I20260926 21:57:32.973905 1185 rpc-test.cc:1236] Sleep() min lat: 21595
I20260926 21:57:32.974102 1185 rpc-test.cc:1237] Sleep() mean lat: 21595
I20260926 21:57:32.974228 1185 rpc-test.cc:1238] Sleep() max lat: 21595
I20260926 21:57:32.974344 1185 rpc-test.cc:1239] Sleep() #calls: 1
W20260926 21:57:32.977264 1491 connection.cc:196] Error closing socket: Network error: TlsSocket::Close: Broken pipe
[ OK ] Parameters/TestRpc.TestRpcHandlerLatencyMetric/SSL_UnixSocket (108 ms)
[ RUN ] Parameters/TestRpc.TimedOutOnResponseMetricServiceQueue/SSL_UnixSocket
I20260926 21:57:33.011372 1521 acceptor_pool.cc:254] collecting diagnostics on the listening RPC socket unix:/tmp/dist-test-taskzpNd26/test-tmp/rpc-test-f2a1efc5c7644dc0bb6420fbf71094a4.sock every 8 connection(s)
I20260926 21:57:33.012187 1522 acceptor_pool.cc:254] collecting diagnostics on the listening RPC socket unix:/tmp/dist-test-taskzpNd26/test-tmp/rpc-test-f2a1efc5c7644dc0bb6420fbf71094a4.sock every 8 connection(s)
W20260926 21:57:33.087689 1523 rpcz_store.cc:267] Call kudu.rpc_test.CalculatorService.Sleep from unix:<unnamed> (request call id 2) took 20 ms (client timeout 20 ms). Trace:
W20260926 21:57:33.088130 1523 rpcz_store.cc:269] 0926 21:57:33.067115 (+ 0us) service_pool.cc:170] Inserting onto call queue
0926 21:57:33.087443 (+ 20328us) service_pool.cc:214] Skipping call since client already timed out
0926 21:57:33.087567 (+ 124us) inbound_call.cc:173] Queueing failure response
Metrics: {}
[ OK ] Parameters/TestRpc.TimedOutOnResponseMetricServiceQueue/SSL_UnixSocket (112 ms)
[ RUN ] Parameters/TestRpc.RpcPendingConnectionsMetric/SSL_UnixSocket
I20260926 21:57:33.105563 1544 acceptor_pool.cc:254] collecting diagnostics on the listening RPC socket 0.0.0.0:46489 every 8 connection(s)
I20260926 21:57:33.106362 1545 acceptor_pool.cc:254] collecting diagnostics on the listening RPC socket 0.0.0.0:46489 every 8 connection(s)
W20260926 21:57:33.120119 1540 negotiation.cc:337] Failed RPC negotiation. Trace:
0926 21:57:33.118090 (+ 0us) reactor.cc:625] Submitting negotiation task for server connection from 127.0.0.1:56054 (local address 127.0.0.1:46489)
0926 21:57:33.118752 (+ 662us) server_negotiation.cc:206] Beginning negotiation
0926 21:57:33.118800 (+ 48us) server_negotiation.cc:399] Waiting for connection header
0926 21:57:33.119198 (+ 398us) negotiation.cc:327] Negotiation complete: Network error: Server connection negotiation failed: server connection from 127.0.0.1:56054: BlockingRecv error: recv got EOF from 127.0.0.1:56054 (error 108)
Metrics: {"server-negotiator.queue_time_us":135}
[ OK ] Parameters/TestRpc.RpcPendingConnectionsMetric/SSL_UnixSocket (36 ms)
[ RUN ] Parameters/TestRpc.TestRpcContextClientDeadline/SSL_UnixSocket
I20260926 21:57:33.150406 1560 acceptor_pool.cc:254] collecting diagnostics on the listening RPC socket unix:/tmp/dist-test-taskzpNd26/test-tmp/rpc-test-96b3610732254081a30daaba602e6ad7.sock every 8 connection(s)
I20260926 21:57:33.151142 1561 acceptor_pool.cc:254] collecting diagnostics on the listening RPC socket unix:/tmp/dist-test-taskzpNd26/test-tmp/rpc-test-96b3610732254081a30daaba602e6ad7.sock every 8 connection(s)
W20260926 21:57:33.214262 1557 connection.cc:196] Error closing socket: Network error: TlsSocket::Close: Broken pipe
[ OK ] Parameters/TestRpc.TestRpcContextClientDeadline/SSL_UnixSocket (86 ms)
[ RUN ] Parameters/TestRpc.TestApplicationFeatureFlagUnsupportedServer/SSL_UnixSocket
I20260926 21:57:33.243793 1585 acceptor_pool.cc:254] collecting diagnostics on the listening RPC socket unix:/tmp/dist-test-taskzpNd26/test-tmp/rpc-test-29940ac6285f4ba18ff02a453b9a2305.sock every 8 connection(s)
I20260926 21:57:33.244491 1586 acceptor_pool.cc:254] collecting diagnostics on the listening RPC socket unix:/tmp/dist-test-taskzpNd26/test-tmp/rpc-test-29940ac6285f4ba18ff02a453b9a2305.sock every 8 connection(s)
[ OK ] Parameters/TestRpc.TestApplicationFeatureFlagUnsupportedServer/SSL_UnixSocket (74 ms)
[ RUN ] Parameters/TestRpc.TestCancellationAsync/SSL_UnixSocket
I20260926 21:57:33.314087 1610 acceptor_pool.cc:254] collecting diagnostics on the listening RPC socket unix:/tmp/dist-test-taskzpNd26/test-tmp/rpc-test-7410978f848a439a8d8d1fb0a1a76edf.sock every 8 connection(s)
I20260926 21:57:33.314818 1611 acceptor_pool.cc:254] collecting diagnostics on the listening RPC socket unix:/tmp/dist-test-taskzpNd26/test-tmp/rpc-test-7410978f848a439a8d8d1fb0a1a76edf.sock every 8 connection(s)
I20260926 21:57:33.318068 1185 rpc-test.cc:1716] Connecting to unix:/tmp/dist-test-taskzpNd26/test-tmp/rpc-test-7410978f848a439a8d8d1fb0a1a76edf.sock
I20260926 21:57:33.351697 1185 test_util.cc:268] Using random seed: -343201027
I20260926 21:57:33.577191 1614 rpc-test-base.h:240] got call: sleep_micros: 500 pattern: 4294967295 num_repetitions: 2097152 sidecar_idx: 0
I20260926 21:57:33.784884 1614 rpc-test-base.h:240] got call: sleep_micros: 500 pattern: 4294967295 num_repetitions: 2097152 sidecar_idx: 0
I20260926 21:57:33.987396 1613 rpc-test-base.h:240] got call: sleep_micros: 500 pattern: 4294967295 num_repetitions: 2097152 sidecar_idx: 0
I20260926 21:57:34.208230 1613 rpc-test-base.h:240] got call: sleep_micros: 500 pattern: 4294967295 num_repetitions: 2097152 sidecar_idx: 0
I20260926 21:57:34.416567 1614 rpc-test-base.h:240] got call: sleep_micros: 500 pattern: 4294967295 num_repetitions: 2097152 sidecar_idx: 0
I20260926 21:57:34.617512 1613 rpc-test-base.h:240] got call: sleep_micros: 500 pattern: 4294967295 num_repetitions: 2097152 sidecar_idx: 0
I20260926 21:57:34.834108 1613 rpc-test-base.h:240] got call: sleep_micros: 500 pattern: 4294967295 num_repetitions: 2097152 sidecar_idx: 0
I20260926 21:57:35.053800 1613 rpc-test-base.h:240] got call: sleep_micros: 500 pattern: 4294967295 num_repetitions: 2097152 sidecar_idx: 0
I20260926 21:57:35.263195 1613 rpc-test-base.h:240] got call: sleep_micros: 500 pattern: 4294967295 num_repetitions: 2097152 sidecar_idx: 0
W20260926 21:57:35.277853 1607 connection.cc:196] Error closing socket: Network error: TlsSocket::Close: Broken pipe
W20260926 21:57:35.395888 1607 connection.cc:441] server connection from unix:<unnamed> torn down before Call kudu.rpc.GenericCalculatorService.SleepWithSidecar from unix:<unnamed> (request call id 9) could send its response
[ OK ] Parameters/TestRpc.TestCancellationAsync/SSL_UnixSocket (2111 ms)
[ RUN ] Parameters/TestRpc.TestPerformanceBySocketType/SSL_UnixSocket
I20260926 21:57:35.487946 1635 acceptor_pool.cc:254] collecting diagnostics on the listening RPC socket unix:/tmp/dist-test-taskzpNd26/test-tmp/rpc-test-dedfe9aa3f014f388f43986a039a305b.sock every 8 connection(s)
I20260926 21:57:35.488669 1636 acceptor_pool.cc:254] collecting diagnostics on the listening RPC socket unix:/tmp/dist-test-taskzpNd26/test-tmp/rpc-test-dedfe9aa3f014f388f43986a039a305b.sock every 8 connection(s)
I20260926 21:57:35.491670 1185 rpc-test.cc:1846] Connecting to unix:/tmp/dist-test-taskzpNd26/test-tmp/rpc-test-dedfe9aa3f014f388f43986a039a305b.sock
I20260926 21:57:56.888761 1185 rpc-test.cc:1859] Sending 1024MB via ssl-enabled unix socket: real 21.345s user 19.157s sys 12.983s
I20260926 21:58:18.028484 1185 rpc-test.cc:1859] Sending 1024MB via ssl-enabled unix socket: real 21.139s user 18.559s sys 13.162s
I20260926 21:58:39.590008 1185 rpc-test.cc:1859] Sending 1024MB via ssl-enabled unix socket: real 21.561s user 19.611s sys 12.911s
I20260926 21:59:00.659688 1185 rpc-test.cc:1859] Sending 1024MB via ssl-enabled unix socket: real 21.069s user 18.732s sys 12.754s
I20260926 21:59:21.845764 1185 rpc-test.cc:1859] Sending 1024MB via ssl-enabled unix socket: real 21.186s user 18.811s sys 12.974s
W20260926 21:59:21.850631 1632 connection.cc:196] Error closing socket: Network error: TlsSocket::Close: Broken pipe
[ OK ] Parameters/TestRpc.TestPerformanceBySocketType/SSL_UnixSocket (106458 ms)
[----------] 20 tests from Parameters/TestRpc (269358 ms total)
[----------] 1 test from Parameters/TestRpcSocketTxRxQueue
[ RUN ] Parameters/TestRpcSocketTxRxQueue.AcceptorRxQueueSizeMetric/0
I20260926 21:59:21.873730 1670 acceptor_pool.cc:254] collecting diagnostics on the listening RPC socket 0.0.0.0:37053 every 1 connection(s)
I20260926 21:59:21.874608 1671 acceptor_pool.cc:254] collecting diagnostics on the listening RPC socket 0.0.0.0:37053 every 1 connection(s)
W20260926 21:59:21.879977 1666 negotiation.cc:337] Failed RPC negotiation. Trace:
0926 21:59:21.878364 (+ 0us) reactor.cc:625] Submitting negotiation task for server connection from 127.0.0.1:44886 (local address 127.0.0.1:37053)
0926 21:59:21.878841 (+ 477us) server_negotiation.cc:206] Beginning negotiation
0926 21:59:21.878864 (+ 23us) server_negotiation.cc:399] Waiting for connection header
0926 21:59:21.879120 (+ 256us) negotiation.cc:327] Negotiation complete: Network error: Server connection negotiation failed: server connection from 127.0.0.1:44886: BlockingRecv error: recv got EOF from 127.0.0.1:44886 (error 108)
Metrics: {"server-negotiator.queue_time_us":115}
[ OK ] Parameters/TestRpcSocketTxRxQueue.AcceptorRxQueueSizeMetric/0 (23 ms)
[----------] 1 test from Parameters/TestRpcSocketTxRxQueue (23 ms total)
[----------] Global test environment tear-down
[==========] 21 tests from 2 test suites ran. (269383 ms total)
[ PASSED ] 20 tests.
[ FAILED ] 1 test, listed below:
[ FAILED ] Parameters/TestRpc.TestCallWithChainCertAndChainCA/SSL_UnixSocket, where GetParam() = (true, true)
1 FAILED TEST