Parameters/TestRpc.TestCallWithChainCertAndRootCA/SSL_UnixSocket: /data0/somelongdirectorytoavoidrpathissues/src/kudu/src/kudu/rpc/rpc-test.cc:303: Failure
Failed
Bad status: Runtime error: could not verify certificate chain (error with cert: subject=CN = localhost, ST = sadfjas, C = AS, emailAddress = sdflkdsajf, O = lskdfjlsad, OU = sldfkja, issuer=C = AS, ST = ASDfkjdhf, L = lskdjf, O = saldfja, OU = skdjf, CN = localhost, emailAddress = sadjflkadsj): : certificate has expired
Google Test trace:
/data0/somelongdirectorytoavoidrpathissues/src/kudu/src/kudu/rpc/rpc-test.cc:300: Connecting to unix:/tmp/dist-test-taskUQIDGT/test-tmp/rpc-test-8a3ad4c9727a4bd1a2386c159aead163.sock
I20260928 23:50:53.748658 2670 test_util.cc:175] -----------------------------------------------
I20260928 23:50:53.748845 2670 test_util.cc:176] Had fatal failures, leaving test files at /tmp/dist-test-taskUQIDGT/test-tmp/rpc-test.2.Parameters_TestRpc.TestCallWithChainCertAndRootCA_SSL_UnixSocket.1790639450368220-2670-0
Note: This is test shard 3 of 8.
[==========] Running 21 tests from 2 test suites.
[----------] Global test environment set-up.
[----------] 1 test from TestRpc
[ RUN ] TestRpc.TestNegotiationTimeout
WARNING: Logging before InitGoogleLogging() is written to STDERR
I20260928 23:50:50.555874 2670 rpc-test-base.h:595] status: Timed out: connection negotiation to 0.0.0.0:46441 for RPC Sleep timed out after 0.100s (ON_OUTBOUND_QUEUE), seconds elapsed: 0.101758
W20260928 23:50:53.465999 2680 negotiation.cc:337] Failed RPC negotiation. Trace:
0928 23:50:50.454949 (+ 0us) reactor.cc:625] Submitting negotiation task for client connection to 0.0.0.0:46441 (local address 127.0.0.1:50644)
0928 23:50:50.455713 (+ 764us) negotiation.cc:107] Waiting for socket to connect
0928 23:50:50.455762 (+ 49us) client_negotiation.cc:174] Beginning negotiation
0928 23:50:50.467699 (+ 11937us) client_negotiation.cc:252] Sending NEGOTIATE NegotiatePB request
0928 23:50:53.464893 (+2997194us) negotiation.cc:327] Negotiation complete: Timed out: Client connection negotiation failed: client connection to 0.0.0.0:46441: received 0 of 4 requested bytes
Metrics: {"client-negotiator.queue_time_us":203}
[ OK ] TestRpc.TestNegotiationTimeout (3054 ms)
[----------] 1 test from TestRpc (3054 ms total)
[----------] 20 tests from Parameters/TestRpc
[ RUN ] Parameters/TestRpc.TestAcceptorPoolStartStop/SSL_UnixSocket
I20260928 23:50:53.510047 2696 acceptor_pool.cc:254] collecting diagnostics on the listening RPC socket unix:/tmp/dist-test-taskUQIDGT/test-tmp/rpc-test-a70f7995a3c840bb918107aeafbb1880.sock every 8 connection(s)
I20260928 23:50:53.511483 2697 acceptor_pool.cc:254] collecting diagnostics on the listening RPC socket unix:/tmp/dist-test-taskUQIDGT/test-tmp/rpc-test-a70f7995a3c840bb918107aeafbb1880.sock every 8 connection(s)
I20260928 23:50:53.545799 2707 acceptor_pool.cc:254] collecting diagnostics on the listening RPC socket unix:/tmp/dist-test-taskUQIDGT/test-tmp/rpc-test-a70f7995a3c840bb918107aeafbb1880.sock every 8 connection(s)
I20260928 23:50:53.547035 2708 acceptor_pool.cc:254] collecting diagnostics on the listening RPC socket unix:/tmp/dist-test-taskUQIDGT/test-tmp/rpc-test-a70f7995a3c840bb918107aeafbb1880.sock every 8 connection(s)
I20260928 23:50:53.563921 2718 acceptor_pool.cc:254] collecting diagnostics on the listening RPC socket unix:/tmp/dist-test-taskUQIDGT/test-tmp/rpc-test-a70f7995a3c840bb918107aeafbb1880.sock every 8 connection(s)
I20260928 23:50:53.564600 2719 acceptor_pool.cc:254] collecting diagnostics on the listening RPC socket unix:/tmp/dist-test-taskUQIDGT/test-tmp/rpc-test-a70f7995a3c840bb918107aeafbb1880.sock every 8 connection(s)
I20260928 23:50:53.598589 2729 acceptor_pool.cc:254] collecting diagnostics on the listening RPC socket unix:/tmp/dist-test-taskUQIDGT/test-tmp/rpc-test-a70f7995a3c840bb918107aeafbb1880.sock every 8 connection(s)
I20260928 23:50:53.599352 2730 acceptor_pool.cc:254] collecting diagnostics on the listening RPC socket unix:/tmp/dist-test-taskUQIDGT/test-tmp/rpc-test-a70f7995a3c840bb918107aeafbb1880.sock every 8 connection(s)
I20260928 23:50:53.624475 2740 acceptor_pool.cc:254] collecting diagnostics on the listening RPC socket unix:/tmp/dist-test-taskUQIDGT/test-tmp/rpc-test-a70f7995a3c840bb918107aeafbb1880.sock every 8 connection(s)
I20260928 23:50:53.625130 2741 acceptor_pool.cc:254] collecting diagnostics on the listening RPC socket unix:/tmp/dist-test-taskUQIDGT/test-tmp/rpc-test-a70f7995a3c840bb918107aeafbb1880.sock every 8 connection(s)
[ OK ] Parameters/TestRpc.TestAcceptorPoolStartStop/SSL_UnixSocket (154 ms)
[ RUN ] Parameters/TestRpc.TestCall/SSL_UnixSocket
I20260928 23:50:53.649138 2753 acceptor_pool.cc:254] collecting diagnostics on the listening RPC socket unix:/tmp/dist-test-taskUQIDGT/test-tmp/rpc-test-0d5244e9c39844d8b1ea8a22dd7349e4.sock every 8 connection(s)
I20260928 23:50:53.650972 2754 acceptor_pool.cc:254] collecting diagnostics on the listening RPC socket unix:/tmp/dist-test-taskUQIDGT/test-tmp/rpc-test-0d5244e9c39844d8b1ea8a22dd7349e4.sock every 8 connection(s)
I20260928 23:50:53.655642 2670 rpc-test.cc:234] Connecting to unix:/tmp/dist-test-taskUQIDGT/test-tmp/rpc-test-0d5244e9c39844d8b1ea8a22dd7349e4.sock
W20260928 23:50:53.698303 2750 connection.cc:196] Error closing socket: Network error: TlsSocket::Close: Broken pipe
[ OK ] Parameters/TestRpc.TestCall/SSL_UnixSocket (73 ms)
[ RUN ] Parameters/TestRpc.TestCallWithChainCertAndRootCA/SSL_UnixSocket
I20260928 23:50:53.728399 2778 acceptor_pool.cc:254] collecting diagnostics on the listening RPC socket unix:/tmp/dist-test-taskUQIDGT/test-tmp/rpc-test-8a3ad4c9727a4bd1a2386c159aead163.sock every 8 connection(s)
I20260928 23:50:53.729046 2779 acceptor_pool.cc:254] collecting diagnostics on the listening RPC socket unix:/tmp/dist-test-taskUQIDGT/test-tmp/rpc-test-8a3ad4c9727a4bd1a2386c159aead163.sock every 8 connection(s)
/data0/somelongdirectorytoavoidrpathissues/src/kudu/src/kudu/rpc/rpc-test.cc:303: Failure
Failed
Bad status: Runtime error: could not verify certificate chain (error with cert: subject=CN = localhost, ST = sadfjas, C = AS, emailAddress = sdflkdsajf, O = lskdfjlsad, OU = sldfkja, issuer=C = AS, ST = ASDfkjdhf, L = lskdjf, O = saldfja, OU = skdjf, CN = localhost, emailAddress = sadjflkadsj): : certificate has expired
Google Test trace:
/data0/somelongdirectorytoavoidrpathissues/src/kudu/src/kudu/rpc/rpc-test.cc:300: Connecting to unix:/tmp/dist-test-taskUQIDGT/test-tmp/rpc-test-8a3ad4c9727a4bd1a2386c159aead163.sock
I20260928 23:50:53.748658 2670 test_util.cc:175] -----------------------------------------------
I20260928 23:50:53.748845 2670 test_util.cc:176] Had fatal failures, leaving test files at /tmp/dist-test-taskUQIDGT/test-tmp/rpc-test.2.Parameters_TestRpc.TestCallWithChainCertAndRootCA_SSL_UnixSocket.1790639450368220-2670-0
[ FAILED ] Parameters/TestRpc.TestCallWithChainCertAndRootCA/SSL_UnixSocket, where GetParam() = (true, true) (46 ms)
[ RUN ] Parameters/TestRpc.TestCallWithBadPasswordProtectedKey/SSL_UnixSocket
[ OK ] Parameters/TestRpc.TestCallWithBadPasswordProtectedKey/SSL_UnixSocket (29 ms)
[ RUN ] Parameters/TestRpc.TestInvalidMethodCall/SSL_UnixSocket
I20260928 23:50:53.805605 2815 acceptor_pool.cc:254] collecting diagnostics on the listening RPC socket unix:/tmp/dist-test-taskUQIDGT/test-tmp/rpc-test-bf8cdd55a00343dbb146c66390aa8d61.sock every 8 connection(s)
I20260928 23:50:53.806370 2816 acceptor_pool.cc:254] collecting diagnostics on the listening RPC socket unix:/tmp/dist-test-taskUQIDGT/test-tmp/rpc-test-bf8cdd55a00343dbb146c66390aa8d61.sock every 8 connection(s)
I20260928 23:50:53.809875 2670 rpc-test.cc:406] Connecting to unix:/tmp/dist-test-taskUQIDGT/test-tmp/rpc-test-bf8cdd55a00343dbb146c66390aa8d61.sock
W20260928 23:50:53.837937 2812 connection.cc:196] Error closing socket: Network error: TlsSocket::Close: Broken pipe
[ OK ] Parameters/TestRpc.TestInvalidMethodCall/SSL_UnixSocket (63 ms)
[ RUN ] Parameters/TestRpc.TestHighFDs/SSL_UnixSocket
I20260928 23:50:54.071254 2840 acceptor_pool.cc:254] collecting diagnostics on the listening RPC socket unix:/tmp/dist-test-taskUQIDGT/test-tmp/rpc-test-19dcf90988c94437aeeff24c15dd913c.sock every 8 connection(s)
I20260928 23:50:54.071919 2841 acceptor_pool.cc:254] collecting diagnostics on the listening RPC socket unix:/tmp/dist-test-taskUQIDGT/test-tmp/rpc-test-19dcf90988c94437aeeff24c15dd913c.sock every 8 connection(s)
W20260928 23:50:54.124936 2837 connection.cc:196] Error closing socket: Network error: TlsSocket::Close: Broken pipe
[ OK ] Parameters/TestRpc.TestHighFDs/SSL_UnixSocket (292 ms)
[ RUN ] Parameters/TestRpc.TestConnectionAlwaysKeepalive/SSL_UnixSocket
I20260928 23:50:54.150854 2863 acceptor_pool.cc:254] collecting diagnostics on the listening RPC socket unix:/tmp/dist-test-taskUQIDGT/test-tmp/rpc-test-7e273126200444eea1447ae7dbd5a95e.sock every 8 connection(s)
I20260928 23:50:54.151569 2864 acceptor_pool.cc:254] collecting diagnostics on the listening RPC socket unix:/tmp/dist-test-taskUQIDGT/test-tmp/rpc-test-7e273126200444eea1447ae7dbd5a95e.sock every 8 connection(s)
I20260928 23:50:54.154703 2670 rpc-test.cc:532] Connecting to unix:/tmp/dist-test-taskUQIDGT/test-tmp/rpc-test-7e273126200444eea1447ae7dbd5a95e.sock
[ OK ] Parameters/TestRpc.TestConnectionAlwaysKeepalive/SSL_UnixSocket (3065 ms)
[ RUN ] Parameters/TestRpc.TestReopenOutboundConnections/SSL_UnixSocket
I20260928 23:50:57.223282 2886 acceptor_pool.cc:254] collecting diagnostics on the listening RPC socket unix:/tmp/dist-test-taskUQIDGT/test-tmp/rpc-test-b26e3e8e926a4f7e9c0112bd34c88a1b.sock every 8 connection(s)
I20260928 23:50:57.223963 2887 acceptor_pool.cc:254] collecting diagnostics on the listening RPC socket unix:/tmp/dist-test-taskUQIDGT/test-tmp/rpc-test-b26e3e8e926a4f7e9c0112bd34c88a1b.sock every 8 connection(s)
I20260928 23:50:57.226815 2670 rpc-test.cc:658] Connecting to unix:/tmp/dist-test-taskUQIDGT/test-tmp/rpc-test-b26e3e8e926a4f7e9c0112bd34c88a1b.sock
W20260928 23:50:57.257671 2885 connection.cc:196] Error closing socket: Network error: TlsSocket::Close: Broken pipe
W20260928 23:50:57.266752 2885 connection.cc:196] Error closing socket: Network error: TlsSocket::Close: Broken pipe
W20260928 23:50:57.276017 2885 connection.cc:196] Error closing socket: Network error: TlsSocket::Close: Broken pipe
W20260928 23:50:57.285830 2885 connection.cc:196] Error closing socket: Network error: TlsSocket::Close: Broken pipe
W20260928 23:50:57.295429 2885 connection.cc:196] Error closing socket: Network error: TlsSocket::Close: Broken pipe
W20260928 23:50:57.304582 2885 connection.cc:196] Error closing socket: Network error: TlsSocket::Close: Broken pipe
W20260928 23:50:57.313992 2885 connection.cc:196] Error closing socket: Network error: TlsSocket::Close: Broken pipe
W20260928 23:50:57.323503 2885 connection.cc:196] Error closing socket: Network error: TlsSocket::Close: Broken pipe
W20260928 23:50:57.333091 2885 connection.cc:196] Error closing socket: Network error: TlsSocket::Close: Broken pipe
W20260928 23:50:57.342490 2885 connection.cc:196] Error closing socket: Network error: TlsSocket::Close: Broken pipe
W20260928 23:50:57.351621 2885 connection.cc:196] Error closing socket: Network error: TlsSocket::Close: Broken pipe
W20260928 23:50:57.361083 2885 connection.cc:196] Error closing socket: Network error: TlsSocket::Close: Broken pipe
W20260928 23:50:57.370620 2885 connection.cc:196] Error closing socket: Network error: TlsSocket::Close: Broken pipe
W20260928 23:50:57.379180 2885 connection.cc:196] Error closing socket: Network error: TlsSocket::Close: Broken pipe
W20260928 23:50:57.379231 2886 acceptor_pool.cc:285] unable to collect diagnostics on RPC socket unix:/tmp/dist-test-taskUQIDGT/test-tmp/rpc-test-b26e3e8e926a4f7e9c0112bd34c88a1b.sock: Not implemented: netlink diagnostics is currently supported only on IPv4 TCP sockets
W20260928 23:50:57.388603 2885 connection.cc:196] Error closing socket: Network error: TlsSocket::Close: Broken pipe
W20260928 23:50:57.397544 2885 connection.cc:196] Error closing socket: Network error: TlsSocket::Close: Broken pipe
W20260928 23:50:57.406589 2885 connection.cc:196] Error closing socket: Network error: TlsSocket::Close: Broken pipe
W20260928 23:50:57.415565 2885 connection.cc:196] Error closing socket: Network error: TlsSocket::Close: Broken pipe
W20260928 23:50:57.424453 2885 connection.cc:196] Error closing socket: Network error: TlsSocket::Close: Broken pipe
W20260928 23:50:57.433005 2885 connection.cc:196] Error closing socket: Network error: TlsSocket::Close: Broken pipe
W20260928 23:50:57.441740 2885 connection.cc:196] Error closing socket: Network error: TlsSocket::Close: Broken pipe
W20260928 23:50:57.450742 2885 connection.cc:196] Error closing socket: Network error: TlsSocket::Close: Broken pipe
W20260928 23:50:57.459689 2885 connection.cc:196] Error closing socket: Network error: TlsSocket::Close: Broken pipe
W20260928 23:50:57.468612 2885 connection.cc:196] Error closing socket: Network error: TlsSocket::Close: Broken pipe
W20260928 23:50:57.477988 2885 connection.cc:196] Error closing socket: Network error: TlsSocket::Close: Broken pipe
W20260928 23:50:57.487367 2885 connection.cc:196] Error closing socket: Network error: TlsSocket::Close: Broken pipe
W20260928 23:50:57.496553 2885 connection.cc:196] Error closing socket: Network error: TlsSocket::Close: Broken pipe
W20260928 23:50:57.504813 2885 connection.cc:196] Error closing socket: Network error: TlsSocket::Close: Broken pipe
W20260928 23:50:57.514119 2885 connection.cc:196] Error closing socket: Network error: TlsSocket::Close: Broken pipe
W20260928 23:50:57.522428 2885 connection.cc:196] Error closing socket: Network error: TlsSocket::Close: Broken pipe
W20260928 23:50:57.530501 2885 connection.cc:196] Error closing socket: Network error: TlsSocket::Close: Broken pipe
W20260928 23:50:57.540793 2885 connection.cc:196] Error closing socket: Network error: TlsSocket::Close: Broken pipe
[ OK ] Parameters/TestRpc.TestReopenOutboundConnections/SSL_UnixSocket (345 ms)
[ RUN ] Parameters/TestRpc.TestConnectionNetworkPlane/SSL_UnixSocket
I20260928 23:50:57.571368 2909 acceptor_pool.cc:254] collecting diagnostics on the listening RPC socket unix:/tmp/dist-test-taskUQIDGT/test-tmp/rpc-test-27b4c57b8f444f3f996ea03358766d2f.sock every 8 connection(s)
I20260928 23:50:57.572027 2910 acceptor_pool.cc:254] collecting diagnostics on the listening RPC socket unix:/tmp/dist-test-taskUQIDGT/test-tmp/rpc-test-27b4c57b8f444f3f996ea03358766d2f.sock every 8 connection(s)
I20260928 23:50:57.575140 2670 rpc-test.cc:772] Connecting to unix:/tmp/dist-test-taskUQIDGT/test-tmp/rpc-test-27b4c57b8f444f3f996ea03358766d2f.sock
W20260928 23:50:57.612802 2908 connection.cc:196] Error closing socket: Network error: TlsSocket::Close: Broken pipe
W20260928 23:50:57.613511 2908 connection.cc:196] Error closing socket: Network error: TlsSocket::Close: Broken pipe
[ OK ] Parameters/TestRpc.TestConnectionNetworkPlane/SSL_UnixSocket (71 ms)
[ RUN ] Parameters/TestRpc.TestTCPKeepalive/SSL_UnixSocket
I20260928 23:50:57.647756 2934 acceptor_pool.cc:254] collecting diagnostics on the listening RPC socket unix:/tmp/dist-test-taskUQIDGT/test-tmp/rpc-test-37ca025c390944ceb267164bb0c2be2b.sock every 8 connection(s)
I20260928 23:50:57.648546 2935 acceptor_pool.cc:254] collecting diagnostics on the listening RPC socket unix:/tmp/dist-test-taskUQIDGT/test-tmp/rpc-test-37ca025c390944ceb267164bb0c2be2b.sock every 8 connection(s)
I20260928 23:50:57.678408 2938 rpc-test-base.h:222] got call: sleep_micros: 8000000 deferred: true
I20260928 23:51:05.682287 2938 rpcz_store.cc:275] Call kudu.rpc.GenericCalculatorService.Sleep from unix:<unnamed> (request call id 0) took 8003 ms. Trace:
I20260928 23:51:05.682680 2938 rpcz_store.cc:276] 0928 23:50:57.678257 (+ 0us) service_pool.cc:170] Inserting onto call queue
0928 23:50:57.678354 (+ 97us) service_pool.cc:227] Handling call
0928 23:51:05.682118 (+8003764us) inbound_call.cc:173] Queueing success response
Metrics: {}
W20260928 23:51:05.688721 2931 connection.cc:196] Error closing socket: Network error: TlsSocket::Close: Broken pipe
[ OK ] Parameters/TestRpc.TestTCPKeepalive/SSL_UnixSocket (8077 ms)
[ RUN ] Parameters/TestRpc.TestMaxSmallSidecars/SSL_UnixSocket
I20260928 23:51:05.732201 2960 acceptor_pool.cc:254] collecting diagnostics on the listening RPC socket unix:/tmp/dist-test-taskUQIDGT/test-tmp/rpc-test-ebd3f1b8b3994c20b45802231b5c68af.sock every 8 connection(s)
I20260928 23:51:05.733071 2961 acceptor_pool.cc:254] collecting diagnostics on the listening RPC socket unix:/tmp/dist-test-taskUQIDGT/test-tmp/rpc-test-ebd3f1b8b3994c20b45802231b5c68af.sock every 8 connection(s)
W20260928 23:51:05.889627 2957 connection.cc:196] Error closing socket: Network error: TlsSocket::Close: Broken pipe
[ OK ] Parameters/TestRpc.TestMaxSmallSidecars/SSL_UnixSocket (199 ms)
[ RUN ] Parameters/TestRpc.TestCallTimeout/SSL_UnixSocket
I20260928 23:51:05.919782 2985 acceptor_pool.cc:254] collecting diagnostics on the listening RPC socket unix:/tmp/dist-test-taskUQIDGT/test-tmp/rpc-test-94d2f6e8f9614bce9a6bd1ad86dde3b2.sock every 8 connection(s)
I20260928 23:51:05.920540 2986 acceptor_pool.cc:254] collecting diagnostics on the listening RPC socket unix:/tmp/dist-test-taskUQIDGT/test-tmp/rpc-test-94d2f6e8f9614bce9a6bd1ad86dde3b2.sock every 8 connection(s)
I20260928 23:51:05.978613 2670 rpc-test-base.h:595] status: Timed out: connection negotiation to unix:/tmp/dist-test-taskUQIDGT/test-tmp/rpc-test-94d2f6e8f9614bce9a6bd1ad86dde3b2.sock for RPC Sleep timed out after 0.000s (ON_OUTBOUND_QUEUE), seconds elapsed: 0.00240816
I20260928 23:51:05.986017 2989 rpc-test-base.h:222] got call: sleep_micros: 700000
I20260928 23:51:06.179709 2670 rpc-test-base.h:595] status: Timed out: Sleep RPC to unix:/tmp/dist-test-taskUQIDGT/test-tmp/rpc-test-94d2f6e8f9614bce9a6bd1ad86dde3b2.sock timed out after 0.200s (SENT), seconds elapsed: 0.200742
I20260928 23:51:06.181165 2988 rpc-test-base.h:222] got call: sleep_micros: 2000000
W20260928 23:51:06.686652 2989 rpcz_store.cc:267] Call kudu.rpc.GenericCalculatorService.Sleep from unix:<unnamed> (request call id 1) took 700 ms (client timeout 200 ms). Trace:
W20260928 23:51:06.687031 2989 rpcz_store.cc:269] 0928 23:51:05.985847 (+ 0us) service_pool.cc:170] Inserting onto call queue
0928 23:51:05.985968 (+ 121us) service_pool.cc:227] Handling call
0928 23:51:06.686596 (+700628us) inbound_call.cc:173] Queueing success response
Metrics: {}
I20260928 23:51:07.682307 2670 rpc-test-base.h:595] status: Timed out: Sleep RPC to unix:/tmp/dist-test-taskUQIDGT/test-tmp/rpc-test-94d2f6e8f9614bce9a6bd1ad86dde3b2.sock timed out after 1.500s (SENT), seconds elapsed: 1.50226
W20260928 23:51:08.181676 2988 rpcz_store.cc:267] Call kudu.rpc.GenericCalculatorService.Sleep from unix:<unnamed> (request call id 2) took 2000 ms (client timeout 1500 ms). Trace:
W20260928 23:51:08.181974 2988 rpcz_store.cc:269] 0928 23:51:06.180875 (+ 0us) service_pool.cc:170] Inserting onto call queue
0928 23:51:06.181015 (+ 140us) service_pool.cc:227] Handling call
0928 23:51:08.181621 (+2000606us) inbound_call.cc:173] Queueing success response
Metrics: {}
W20260928 23:51:08.182519 2982 connection.cc:441] server connection from unix:<unnamed> torn down before Call kudu.rpc.GenericCalculatorService.Sleep from unix:<unnamed> (request call id 2) could send its response
[ OK ] Parameters/TestRpc.TestCallTimeout/SSL_UnixSocket (2292 ms)
[ RUN ] Parameters/TestRpc.TestServerShutsDown/SSL_UnixSocket
I20260928 23:51:08.189191 2670 rpc-test.cc:1125] Connecting to 0.0.0.0:39355
W20260928 23:51:08.198756 3002 negotiation.cc:337] Failed RPC negotiation. Trace:
0928 23:51:08.197286 (+ 0us) reactor.cc:625] Submitting negotiation task for client connection to 0.0.0.0:39355 (local address 127.0.0.1:36798)
0928 23:51:08.197772 (+ 486us) negotiation.cc:107] Waiting for socket to connect
0928 23:51:08.197813 (+ 41us) client_negotiation.cc:174] Beginning negotiation
0928 23:51:08.198033 (+ 220us) client_negotiation.cc:252] Sending NEGOTIATE NegotiatePB request
0928 23:51:08.198259 (+ 226us) negotiation.cc:327] Negotiation complete: Network error: Client connection negotiation failed: client connection to 0.0.0.0:39355: BlockingWrite error: write error: Broken pipe (error 32)
Metrics: {"client-negotiator.queue_time_us":127}
[ OK ] Parameters/TestRpc.TestServerShutsDown/SSL_UnixSocket (13 ms)
[ RUN ] Parameters/TestRpc.TimedOutOnResponseMetric/SSL_UnixSocket
I20260928 23:51:08.230957 3019 acceptor_pool.cc:254] collecting diagnostics on the listening RPC socket unix:/tmp/dist-test-taskUQIDGT/test-tmp/rpc-test-d4c1643730b545beb09ae3f2ab3e30a3.sock every 8 connection(s)
I20260928 23:51:08.231618 3020 acceptor_pool.cc:254] collecting diagnostics on the listening RPC socket unix:/tmp/dist-test-taskUQIDGT/test-tmp/rpc-test-d4c1643730b545beb09ae3f2ab3e30a3.sock every 8 connection(s)
W20260928 23:51:08.490108 3023 rpcz_store.cc:267] Call kudu.rpc_test.CalculatorService.Sleep from unix:<unnamed> (request call id 3) took 50 ms (client timeout 25 ms). Trace:
W20260928 23:51:08.490401 3023 rpcz_store.cc:269] 0928 23:51:08.439478 (+ 0us) service_pool.cc:170] Inserting onto call queue
0928 23:51:08.439612 (+ 134us) service_pool.cc:227] Handling call
0928 23:51:08.490026 (+ 50414us) inbound_call.cc:173] Queueing success response
Related trace 'test_child':
Metrics: {"test_sleep_us":50000,"child_traces":[["test_child",{"related_trace_metric":1}]]}
W20260928 23:51:08.549196 3023 rpcz_store.cc:267] Call kudu.rpc_test.CalculatorService.Sleep from unix:<unnamed> (request call id 4) took 50 ms (client timeout 50 ms). Trace:
W20260928 23:51:08.549515 3023 rpcz_store.cc:269] 0928 23:51:08.498642 (+ 0us) service_pool.cc:170] Inserting onto call queue
0928 23:51:08.498769 (+ 127us) service_pool.cc:227] Handling call
0928 23:51:08.549123 (+ 50354us) inbound_call.cc:173] Queueing success response
Related trace 'test_child':
Metrics: {"test_sleep_us":50000,"child_traces":[["test_child",{"related_trace_metric":1}]]}
W20260928 23:51:08.551748 3016 connection.cc:196] Error closing socket: Network error: TlsSocket::Close: Broken pipe
[ OK ] Parameters/TestRpc.TimedOutOnResponseMetric/SSL_UnixSocket (355 ms)
[ RUN ] Parameters/TestRpc.AcceptorDispatchingTimesMetric/SSL_UnixSocket
I20260928 23:51:08.568053 3044 acceptor_pool.cc:254] collecting diagnostics on the listening RPC socket 0.0.0.0:35221 every 8 connection(s)
I20260928 23:51:08.568676 3045 acceptor_pool.cc:254] collecting diagnostics on the listening RPC socket 0.0.0.0:35221 every 8 connection(s)
W20260928 23:51:08.574345 3040 negotiation.cc:337] Failed RPC negotiation. Trace:
0928 23:51:08.572683 (+ 0us) reactor.cc:625] Submitting negotiation task for server connection from 127.0.0.1:32832 (local address 127.0.0.1:35221)
0928 23:51:08.573245 (+ 562us) server_negotiation.cc:206] Beginning negotiation
0928 23:51:08.573272 (+ 27us) server_negotiation.cc:399] Waiting for connection header
0928 23:51:08.573624 (+ 352us) negotiation.cc:327] Negotiation complete: Network error: Server connection negotiation failed: server connection from 127.0.0.1:32832: BlockingRecv error: recv got EOF from 127.0.0.1:32832 (error 108)
Metrics: {"server-negotiator.queue_time_us":156}
[ OK ] Parameters/TestRpc.AcceptorDispatchingTimesMetric/SSL_UnixSocket (20 ms)
[ RUN ] Parameters/TestRpc.TestRpcCallbackDestroysMessenger/SSL_UnixSocket
[ OK ] Parameters/TestRpc.TestRpcCallbackDestroysMessenger/SSL_UnixSocket (37 ms)
[ RUN ] Parameters/TestRpc.TestApplicationFeatureFlag/SSL_UnixSocket
I20260928 23:51:08.649353 3069 acceptor_pool.cc:254] collecting diagnostics on the listening RPC socket unix:/tmp/dist-test-taskUQIDGT/test-tmp/rpc-test-949d567d58654bfb846a160dad1860e4.sock every 8 connection(s)
I20260928 23:51:08.649992 3070 acceptor_pool.cc:254] collecting diagnostics on the listening RPC socket unix:/tmp/dist-test-taskUQIDGT/test-tmp/rpc-test-949d567d58654bfb846a160dad1860e4.sock every 8 connection(s)
W20260928 23:51:08.682163 3066 messenger.cc:357] Unable to handle RPC call: Not implemented: call requires unsupported application feature flags: 99
W20260928 23:51:08.685173 3066 connection.cc:196] Error closing socket: Network error: TlsSocket::Close: Broken pipe
[ OK ] Parameters/TestRpc.TestApplicationFeatureFlag/SSL_UnixSocket (74 ms)
[ RUN ] Parameters/TestRpc.TestCancellation/SSL_UnixSocket
I20260928 23:51:08.713209 3094 acceptor_pool.cc:254] collecting diagnostics on the listening RPC socket unix:/tmp/dist-test-taskUQIDGT/test-tmp/rpc-test-6b924be19061476a95c4c8a6508a85f1.sock every 8 connection(s)
I20260928 23:51:08.713902 3095 acceptor_pool.cc:254] collecting diagnostics on the listening RPC socket unix:/tmp/dist-test-taskUQIDGT/test-tmp/rpc-test-6b924be19061476a95c4c8a6508a85f1.sock every 8 connection(s)
I20260928 23:51:08.717056 2670 rpc-test.cc:1648] Connecting to unix:/tmp/dist-test-taskUQIDGT/test-tmp/rpc-test-6b924be19061476a95c4c8a6508a85f1.sock
I20260928 23:51:08.819129 2670 rpc-test-base.h:595] status: Aborted: Sleep RPC to unix:/tmp/dist-test-taskUQIDGT/test-tmp/rpc-test-6b924be19061476a95c4c8a6508a85f1.sock is cancelled in state READY, seconds elapsed: 0.000346699
I20260928 23:51:08.988977 2670 rpc-test-base.h:595] status: Aborted: Sleep RPC to unix:/tmp/dist-test-taskUQIDGT/test-tmp/rpc-test-6b924be19061476a95c4c8a6508a85f1.sock is cancelled in state SENT, seconds elapsed: 0.00092343
I20260928 23:51:08.989197 3097 rpc-test-base.h:222] got call: sleep_micros: 510000
I20260928 23:51:09.155078 2670 rpc-test-base.h:595] status: Aborted: Sleep RPC to unix:/tmp/dist-test-taskUQIDGT/test-tmp/rpc-test-6b924be19061476a95c4c8a6508a85f1.sock is cancelled in state SENT, seconds elapsed: 0.000896831
I20260928 23:51:09.155315 3096 rpc-test-base.h:222] got call: sleep_micros: 510000
I20260928 23:51:09.318495 2670 rpc-test-base.h:595] status: Aborted: Sleep RPC to unix:/tmp/dist-test-taskUQIDGT/test-tmp/rpc-test-6b924be19061476a95c4c8a6508a85f1.sock is cancelled in state SENT, seconds elapsed: 0.000968636
W20260928 23:51:09.329237 3098 rpcz_store.cc:267] Call kudu.rpc.GenericCalculatorService.Sleep from unix:<unnamed> (request call id 11) took 10 ms (client timeout 10 ms). Trace:
W20260928 23:51:09.329522 3098 rpcz_store.cc:269] 0928 23:51:09.318796 (+ 0us) service_pool.cc:170] Inserting onto call queue
0928 23:51:09.328972 (+ 10176us) service_pool.cc:214] Skipping call since client already timed out
0928 23:51:09.329075 (+ 103us) inbound_call.cc:173] Queueing failure response
Metrics: {}
I20260928 23:51:09.330024 3098 rpc-test-base.h:222] got call: sleep_micros: 1500000
W20260928 23:51:09.499756 3097 rpcz_store.cc:267] Call kudu.rpc.GenericCalculatorService.Sleep from unix:<unnamed> (request call id 3) took 510 ms (client timeout 10 ms). Trace:
W20260928 23:51:09.500100 3097 rpcz_store.cc:269] 0928 23:51:08.989035 (+ 0us) service_pool.cc:170] Inserting onto call queue
0928 23:51:08.989149 (+ 114us) service_pool.cc:227] Handling call
0928 23:51:09.499698 (+510549us) inbound_call.cc:173] Queueing success response
Metrics: {}
W20260928 23:51:09.665983 3096 rpcz_store.cc:267] Call kudu.rpc.GenericCalculatorService.Sleep from unix:<unnamed> (request call id 7) took 510 ms (client timeout 10 ms). Trace:
W20260928 23:51:09.666287 3096 rpcz_store.cc:269] 0928 23:51:09.155115 (+ 0us) service_pool.cc:170] Inserting onto call queue
0928 23:51:09.155252 (+ 137us) service_pool.cc:227] Handling call
0928 23:51:09.665893 (+510641us) inbound_call.cc:173] Queueing success response
Metrics: {}
I20260928 23:51:10.320291 2670 rpc-test-base.h:595] status: Timed out: Sleep RPC to unix:/tmp/dist-test-taskUQIDGT/test-tmp/rpc-test-6b924be19061476a95c4c8a6508a85f1.sock timed out after 1.000s (SENT), seconds elapsed: 1.00147
I20260928 23:51:10.321605 3096 rpc-test-base.h:222] got call: sleep_micros: 1500000
W20260928 23:51:10.830729 3098 rpcz_store.cc:267] Call kudu.rpc.GenericCalculatorService.Sleep from unix:<unnamed> (request call id 12) took 1511 ms (client timeout 1000 ms). Trace:
W20260928 23:51:10.831136 3098 rpcz_store.cc:269] 0928 23:51:09.319512 (+ 0us) service_pool.cc:170] Inserting onto call queue
0928 23:51:09.329983 (+ 10471us) service_pool.cc:227] Handling call
0928 23:51:10.830566 (+1500583us) inbound_call.cc:173] Queueing success response
Metrics: {}
I20260928 23:51:11.321933 2670 rpc-test-base.h:595] status: Timed out: Sleep RPC to unix:/tmp/dist-test-taskUQIDGT/test-tmp/rpc-test-6b924be19061476a95c4c8a6508a85f1.sock timed out after 1.000s (SENT), seconds elapsed: 1.00116
W20260928 23:51:11.323472 3091 messenger.cc:357] Unable to handle RPC call: Not implemented: call requires unsupported application feature flags: 99, 1
W20260928 23:51:11.324922 3091 messenger.cc:357] Unable to handle RPC call: Not implemented: call requires unsupported application feature flags: 99, 1
W20260928 23:51:11.557914 3091 connection.cc:196] Error closing socket: Network error: TlsSocket::Close: Broken pipe
W20260928 23:51:11.822239 3096 rpcz_store.cc:267] Call kudu.rpc.GenericCalculatorService.Sleep from unix:<unnamed> (request call id 13) took 1500 ms (client timeout 1000 ms). Trace:
W20260928 23:51:11.822569 3096 rpcz_store.cc:269] 0928 23:51:10.321421 (+ 0us) service_pool.cc:170] Inserting onto call queue
0928 23:51:10.321554 (+ 133us) service_pool.cc:227] Handling call
0928 23:51:11.822096 (+1500542us) inbound_call.cc:173] Queueing success response
Metrics: {}
W20260928 23:51:11.823117 3091 connection.cc:441] server connection from unix:<unnamed> torn down before Call kudu.rpc.GenericCalculatorService.Sleep from unix:<unnamed> (request call id 13) could send its response
[ OK ] Parameters/TestRpc.TestCancellation/SSL_UnixSocket (3140 ms)
[ RUN ] Parameters/TestRpc.TestCancellationMultiThreads/SSL_UnixSocket
I20260928 23:51:11.849176 3120 acceptor_pool.cc:254] collecting diagnostics on the listening RPC socket unix:/tmp/dist-test-taskUQIDGT/test-tmp/rpc-test-ace0ad0b14454071b754638bc8a7385b.sock every 8 connection(s)
I20260928 23:51:11.849948 3121 acceptor_pool.cc:254] collecting diagnostics on the listening RPC socket unix:/tmp/dist-test-taskUQIDGT/test-tmp/rpc-test-ace0ad0b14454071b754638bc8a7385b.sock every 8 connection(s)
I20260928 23:51:11.852906 2670 rpc-test.cc:1808] Connecting to unix:/tmp/dist-test-taskUQIDGT/test-tmp/rpc-test-ace0ad0b14454071b754638bc8a7385b.sock
I20260928 23:51:11.989146 3134 test_util.cc:268] Using random seed: -1113190124
I20260928 23:51:11.990432 3135 test_util.cc:268] Using random seed: -1113188737
I20260928 23:51:11.991964 3136 test_util.cc:268] Using random seed: -1113187303
I20260928 23:51:11.993291 3137 test_util.cc:268] Using random seed: -1113185889
I20260928 23:51:11.994884 3138 test_util.cc:268] Using random seed: -1113184410
I20260928 23:51:11.996217 3139 test_util.cc:268] Using random seed: -1113183081
I20260928 23:51:11.997787 3140 test_util.cc:268] Using random seed: -1113181510
I20260928 23:51:11.999326 3141 test_util.cc:268] Using random seed: -1113179952
I20260928 23:51:12.000718 3142 test_util.cc:268] Using random seed: -1113178580
I20260928 23:51:12.002019 3143 test_util.cc:268] Using random seed: -1113177231
I20260928 23:51:12.003497 3144 test_util.cc:268] Using random seed: -1113175770
I20260928 23:51:12.005019 3145 test_util.cc:268] Using random seed: -1113174310
I20260928 23:51:12.006814 3146 test_util.cc:268] Using random seed: -1113172474
I20260928 23:51:12.008795 3147 test_util.cc:268] Using random seed: -1113170481
I20260928 23:51:12.010349 3148 test_util.cc:268] Using random seed: -1113168950
I20260928 23:51:12.011801 3149 test_util.cc:268] Using random seed: -1113167485
I20260928 23:51:12.013693 3150 test_util.cc:268] Using random seed: -1113165587
I20260928 23:51:12.015233 3151 test_util.cc:268] Using random seed: -1113164081
I20260928 23:51:12.016798 3152 test_util.cc:268] Using random seed: -1113162536
I20260928 23:51:12.018787 3153 test_util.cc:268] Using random seed: -1113160501
I20260928 23:51:12.021009 3154 test_util.cc:268] Using random seed: -1113158355
I20260928 23:51:12.025049 3155 test_util.cc:268] Using random seed: -1113154266
I20260928 23:51:12.026722 3156 test_util.cc:268] Using random seed: -1113152586
I20260928 23:51:12.029096 3157 test_util.cc:268] Using random seed: -1113150238
I20260928 23:51:12.033119 3158 test_util.cc:268] Using random seed: -1113146265
I20260928 23:51:12.034629 3159 test_util.cc:268] Using random seed: -1113144685
I20260928 23:51:12.036859 3160 test_util.cc:268] Using random seed: -1113142588
I20260928 23:51:12.039330 3161 test_util.cc:268] Using random seed: -1113140033
I20260928 23:51:12.041074 3162 test_util.cc:268] Using random seed: -1113138250
I20260928 23:51:12.045060 3163 test_util.cc:268] Using random seed: -1113134229
W20260928 23:51:30.921911 3117 connection.cc:196] Error closing socket: Network error: TlsSocket::Close: Broken pipe
[ OK ] Parameters/TestRpc.TestCancellationMultiThreads/SSL_UnixSocket (19107 ms)
[ RUN ] Parameters/TestRpc.TestCallId/SSL_UnixSocket
I20260928 23:51:30.963831 3177 acceptor_pool.cc:254] collecting diagnostics on the listening RPC socket unix:/tmp/dist-test-taskUQIDGT/test-tmp/rpc-test-47de8e047a8c474b913d0f19e01a9b63.sock every 8 connection(s)
I20260928 23:51:30.964639 3178 acceptor_pool.cc:254] collecting diagnostics on the listening RPC socket unix:/tmp/dist-test-taskUQIDGT/test-tmp/rpc-test-47de8e047a8c474b913d0f19e01a9b63.sock every 8 connection(s)
[ OK ] Parameters/TestRpc.TestCallId/SSL_UnixSocket (74 ms)
[----------] 20 tests from Parameters/TestRpc (37538 ms total)
[----------] Global test environment tear-down
[==========] 21 tests from 2 test suites ran. (40594 ms total)
[ PASSED ] 20 tests.
[ FAILED ] 1 test, listed below:
[ FAILED ] Parameters/TestRpc.TestCallWithChainCertAndRootCA/SSL_UnixSocket, where GetParam() = (true, true)
1 FAILED TEST
I20260928 23:51:31.029247 2670 logging.cc:424] LogThrottler /data0/somelongdirectorytoavoidrpathissues/src/kudu/src/kudu/rpc/acceptor_pool.cc:285: suppressed but not reported on 3 messages since previous log ~33 seconds ago