Diagnosed failure
Parameters/TestRpc.TestCallWithChainCertAndChainCA/SSL_UnixSocket: /data0/somelongdirectorytoavoidrpathissues/src/kudu/src/kudu/rpc/rpc-test.cc:270: Failure
Failed
Bad status: Runtime error: could not verify certificate chain (error with cert: subject=CN = localhost, ST = sadfjas, C = AS, emailAddress = sdflkdsajf, O = lskdfjlsad, OU = sldfkja, issuer=C = AS, ST = ASDfkjdhf, L = lskdjf, O = saldfja, OU = skdjf, CN = localhost, emailAddress = sadjflkadsj): : certificate has expired
Google Test trace:
/data0/somelongdirectorytoavoidrpathissues/src/kudu/src/kudu/rpc/rpc-test.cc:267: Connecting to unix:/tmp/dist-test-taskzIXQue/test-tmp/rpc-test-23ee86360d2147e2ad3ba5a5c6be9945.sock
I20260925 10:10:53.762918 8027 test_util.cc:175] -----------------------------------------------
I20260925 10:10:53.763039 8027 test_util.cc:176] Had fatal failures, leaving test files at /tmp/dist-test-taskzIXQue/test-tmp/rpc-test.6.Parameters_TestRpc.TestCallWithChainCertAndChainCA_SSL_UnixSocket.1790331053620729-8027-0
Full log
Note: This is test shard 7 of 8.
[==========] Running 21 tests from 2 test suites.
[----------] Global test environment set-up.
[----------] 20 tests from Parameters/TestRpc
[ RUN ] Parameters/TestRpc.TestMessengerCreateDestroy/SSL_UnixSocket
WARNING: Logging before InitGoogleLogging() is written to STDERR
I20260925 10:10:53.676030 8027 rpc-test.cc:169] started messenger TestCreateDestroy
[ OK ] Parameters/TestRpc.TestMessengerCreateDestroy/SSL_UnixSocket (36 ms)
[ RUN ] Parameters/TestRpc.TestNegotiationDeadlock/SSL_UnixSocket
I20260925 10:10:53.698987 8047 acceptor_pool.cc:254] collecting diagnostics on the listening RPC socket unix:/tmp/dist-test-taskzIXQue/test-tmp/rpc-test-30115e63069349f2bf264f31850faf47.sock every 8 connection(s)
I20260925 10:10:53.699458 8048 acceptor_pool.cc:254] collecting diagnostics on the listening RPC socket unix:/tmp/dist-test-taskzIXQue/test-tmp/rpc-test-30115e63069349f2bf264f31850faf47.sock every 8 connection(s)
[ OK ] Parameters/TestRpc.TestNegotiationDeadlock/SSL_UnixSocket (47 ms)
[ RUN ] Parameters/TestRpc.TestCallWithChainCertAndChainCA/SSL_UnixSocket
I20260925 10:10:53.747674 8063 acceptor_pool.cc:254] collecting diagnostics on the listening RPC socket unix:/tmp/dist-test-taskzIXQue/test-tmp/rpc-test-23ee86360d2147e2ad3ba5a5c6be9945.sock every 8 connection(s)
I20260925 10:10:53.748199 8064 acceptor_pool.cc:254] collecting diagnostics on the listening RPC socket unix:/tmp/dist-test-taskzIXQue/test-tmp/rpc-test-23ee86360d2147e2ad3ba5a5c6be9945.sock every 8 connection(s)
/data0/somelongdirectorytoavoidrpathissues/src/kudu/src/kudu/rpc/rpc-test.cc:270: Failure
Failed
Bad status: Runtime error: could not verify certificate chain (error with cert: subject=CN = localhost, ST = sadfjas, C = AS, emailAddress = sdflkdsajf, O = lskdfjlsad, OU = sldfkja, issuer=C = AS, ST = ASDfkjdhf, L = lskdjf, O = saldfja, OU = skdjf, CN = localhost, emailAddress = sadjflkadsj): : certificate has expired
Google Test trace:
/data0/somelongdirectorytoavoidrpathissues/src/kudu/src/kudu/rpc/rpc-test.cc:267: Connecting to unix:/tmp/dist-test-taskzIXQue/test-tmp/rpc-test-23ee86360d2147e2ad3ba5a5c6be9945.sock
I20260925 10:10:53.762918 8027 test_util.cc:175] -----------------------------------------------
I20260925 10:10:53.763039 8027 test_util.cc:176] Had fatal failures, leaving test files at /tmp/dist-test-taskzIXQue/test-tmp/rpc-test.6.Parameters_TestRpc.TestCallWithChainCertAndChainCA_SSL_UnixSocket.1790331053620729-8027-0
[ FAILED ] Parameters/TestRpc.TestCallWithChainCertAndChainCA/SSL_UnixSocket, where GetParam() = (true, true) (35 ms)
[ RUN ] Parameters/TestRpc.TestCallWithPasswordProtectedKey/SSL_UnixSocket
I20260925 10:10:53.789889 8088 acceptor_pool.cc:254] collecting diagnostics on the listening RPC socket unix:/tmp/dist-test-taskzIXQue/test-tmp/rpc-test-5230137fcaab4490be2cb5789ff2dc9e.sock every 8 connection(s)
I20260925 10:10:53.790177 8089 acceptor_pool.cc:254] collecting diagnostics on the listening RPC socket unix:/tmp/dist-test-taskzIXQue/test-tmp/rpc-test-5230137fcaab4490be2cb5789ff2dc9e.sock every 8 connection(s)
[ OK ] Parameters/TestRpc.TestCallWithPasswordProtectedKey/SSL_UnixSocket (87 ms)
[ RUN ] Parameters/TestRpc.TestCallToBadServer/SSL_UnixSocket
I20260925 10:10:53.883249 8027 rpc-test.cc:394] Status: Network error: Client connection negotiation failed: client connection to 0.0.0.0:0: connect: Connection refused (error 111)
I20260925 10:10:53.884685 8027 rpc-test.cc:394] Status: Network error: Client connection negotiation failed: client connection to 0.0.0.0:0: connect: Connection refused (error 111)
I20260925 10:10:53.885802 8027 rpc-test.cc:394] Status: Network error: Client connection negotiation failed: client connection to 0.0.0.0:0: connect: Connection refused (error 111)
I20260925 10:10:53.886721 8027 rpc-test.cc:394] Status: Network error: Client connection negotiation failed: client connection to 0.0.0.0:0: connect: Connection refused (error 111)
I20260925 10:10:53.887522 8027 rpc-test.cc:394] Status: Network error: Client connection negotiation failed: client connection to 0.0.0.0:0: connect: Connection refused (error 111)
[ OK ] Parameters/TestRpc.TestCallToBadServer/SSL_UnixSocket (41 ms)
[ RUN ] Parameters/TestRpc.TestWrongService/SSL_UnixSocket
I20260925 10:10:53.921543 8123 acceptor_pool.cc:254] collecting diagnostics on the listening RPC socket unix:/tmp/dist-test-taskzIXQue/test-tmp/rpc-test-bcddf464fc324ce8b5b791fb9a339b13.sock every 8 connection(s)
I20260925 10:10:53.922324 8124 acceptor_pool.cc:254] collecting diagnostics on the listening RPC socket unix:/tmp/dist-test-taskzIXQue/test-tmp/rpc-test-bcddf464fc324ce8b5b791fb9a339b13.sock every 8 connection(s)
I20260925 10:10:54.004544 8120 messenger.cc:345] service WrongServiceName not registered on TestServer
[ OK ] Parameters/TestRpc.TestWrongService/SSL_UnixSocket (118 ms)
[ RUN ] Parameters/TestRpc.TestConnectionKeepalive/SSL_UnixSocket
I20260925 10:10:54.032303 8146 acceptor_pool.cc:254] collecting diagnostics on the listening RPC socket unix:/tmp/dist-test-taskzIXQue/test-tmp/rpc-test-9714fccbaefe4f0693786950669c3dbc.sock every 8 connection(s)
I20260925 10:10:54.032819 8147 acceptor_pool.cc:254] collecting diagnostics on the listening RPC socket unix:/tmp/dist-test-taskzIXQue/test-tmp/rpc-test-9714fccbaefe4f0693786950669c3dbc.sock every 8 connection(s)
I20260925 10:10:54.033890 8027 rpc-test.cc:488] Connecting to unix:/tmp/dist-test-taskzIXQue/test-tmp/rpc-test-9714fccbaefe4f0693786950669c3dbc.sock
W20260925 10:10:54.514887 8159 connection.cc:196] Error closing socket: Network error: TlsSocket::Close: Broken pipe
[ OK ] Parameters/TestRpc.TestConnectionKeepalive/SSL_UnixSocket (1087 ms)
[ RUN ] Parameters/TestRpc.TestClientConnectionMetrics/SSL_UnixSocket
I20260925 10:10:55.123356 8171 acceptor_pool.cc:254] collecting diagnostics on the listening RPC socket unix:/tmp/dist-test-taskzIXQue/test-tmp/rpc-test-95ccb99a85cb4cbcb04dca1f6da092a8.sock every 8 connection(s)
I20260925 10:10:55.123618 8172 acceptor_pool.cc:254] collecting diagnostics on the listening RPC socket unix:/tmp/dist-test-taskzIXQue/test-tmp/rpc-test-95ccb99a85cb4cbcb04dca1f6da092a8.sock every 8 connection(s)
I20260925 10:10:55.124756 8027 rpc-test.cc:569] Connecting to unix:/tmp/dist-test-taskzIXQue/test-tmp/rpc-test-95ccb99a85cb4cbcb04dca1f6da092a8.sock
W20260925 10:11:19.614643 8168 connection.cc:196] Error closing socket: Network error: TlsSocket::Close: Broken pipe
[ OK ] Parameters/TestRpc.TestClientConnectionMetrics/SSL_UnixSocket (24524 ms)
[ RUN ] Parameters/TestRpc.TestCredentialsPolicy/SSL_UnixSocket
I20260925 10:11:19.646130 8194 acceptor_pool.cc:254] collecting diagnostics on the listening RPC socket unix:/tmp/dist-test-taskzIXQue/test-tmp/rpc-test-199e2f41e1c64f778a8addf6d4a54464.sock every 8 connection(s)
I20260925 10:11:19.646377 8195 acceptor_pool.cc:254] collecting diagnostics on the listening RPC socket unix:/tmp/dist-test-taskzIXQue/test-tmp/rpc-test-199e2f41e1c64f778a8addf6d4a54464.sock every 8 connection(s)
I20260925 10:11:19.647430 8027 rpc-test.cc:700] Connecting to unix:/tmp/dist-test-taskzIXQue/test-tmp/rpc-test-199e2f41e1c64f778a8addf6d4a54464.sock
W20260925 10:11:19.671483 8193 connection.cc:196] Error closing socket: Network error: TlsSocket::Close: Broken pipe
[ OK ] Parameters/TestRpc.TestCredentialsPolicy/SSL_UnixSocket (60 ms)
[ RUN ] Parameters/TestRpc.TestCallLongerThanKeepalive/SSL_UnixSocket
I20260925 10:11:19.705252 8219 acceptor_pool.cc:254] collecting diagnostics on the listening RPC socket unix:/tmp/dist-test-taskzIXQue/test-tmp/rpc-test-993d7d98437449eaa1ad9f48f0d464d0.sock every 8 connection(s)
I20260925 10:11:19.705464 8220 acceptor_pool.cc:254] collecting diagnostics on the listening RPC socket unix:/tmp/dist-test-taskzIXQue/test-tmp/rpc-test-993d7d98437449eaa1ad9f48f0d464d0.sock every 8 connection(s)
I20260925 10:11:19.732313 8223 rpc-test-base.h:222] got call: sleep_micros: 3000000 deferred: true
I20260925 10:11:22.734196 8223 rpcz_store.cc:275] Call kudu.rpc.GenericCalculatorService.Sleep from unix:<unnamed> (request call id 0) took 3002 ms. Trace:
I20260925 10:11:22.734372 8223 rpcz_store.cc:276] 0925 10:11:19.732199 (+ 0us) service_pool.cc:170] Inserting onto call queue
0925 10:11:19.732265 (+ 66us) service_pool.cc:227] Handling call
0925 10:11:22.734137 (+3001872us) inbound_call.cc:173] Queueing success response
Metrics: {}
[ OK ] Parameters/TestRpc.TestCallLongerThanKeepalive/SSL_UnixSocket (3057 ms)
[ RUN ] Parameters/TestRpc.TestRpcSidecar/SSL_UnixSocket
I20260925 10:11:22.756035 8244 acceptor_pool.cc:254] collecting diagnostics on the listening RPC socket unix:/tmp/dist-test-taskzIXQue/test-tmp/rpc-test-990b046b4a094f148d19da385c5a5f08.sock every 8 connection(s)
I20260925 10:11:22.756526 8245 acceptor_pool.cc:254] collecting diagnostics on the listening RPC socket unix:/tmp/dist-test-taskzIXQue/test-tmp/rpc-test-990b046b4a094f148d19da385c5a5f08.sock every 8 connection(s)
W20260925 10:11:22.888010 8241 connection.cc:196] Error closing socket: Network error: TlsSocket::Close: Broken pipe
[ OK ] Parameters/TestRpc.TestRpcSidecar/SSL_UnixSocket (149 ms)
[ RUN ] Parameters/TestRpc.TestRpcSidecarLimits/SSL_UnixSocket
I20260925 10:11:25.686697 8269 acceptor_pool.cc:254] collecting diagnostics on the listening RPC socket unix:/tmp/dist-test-taskzIXQue/test-tmp/rpc-test-f780ef32d131488f90ce7c329312da3f.sock every 8 connection(s)
I20260925 10:11:25.686920 8270 acceptor_pool.cc:254] collecting diagnostics on the listening RPC socket unix:/tmp/dist-test-taskzIXQue/test-tmp/rpc-test-f780ef32d131488f90ce7c329312da3f.sock every 8 connection(s)
W20260925 10:11:25.703610 8027 serialization.cc:72] Serialized kudu.rpc_test.PushStringsRequestPB (2147483654 bytes) is larger than the maximum configured RPC message size (52428800 bytes). Sending anyway, but peer may reject the data.
W20260925 10:11:25.710930 8266 connection.cc:535] server connection from unix:<unnamed> recv error: Network error: RPC frame had a length of 2147483714, but we only support messages up to 52428800 bytes long.
W20260925 10:11:25.711097 8266 connection.cc:158] shutting down server connection from unix:<unnamed> with pending inbound data: 4/2147483714 bytes received; last active 0 ns ago: status Network error: RPC frame had a length of 2147483714, but we only support messages up to 52428800 bytes long.
W20260925 10:11:25.711580 8282 connection.cc:196] Error closing socket: Network error: TlsSocket::Close: Broken pipe
I20260925 10:11:25.740247 8294 acceptor_pool.cc:254] collecting diagnostics on the listening RPC socket unix:/tmp/dist-test-taskzIXQue/test-tmp/rpc-test-f780ef32d131488f90ce7c329312da3f.sock every 8 connection(s)
I20260925 10:11:25.740358 8295 acceptor_pool.cc:254] collecting diagnostics on the listening RPC socket unix:/tmp/dist-test-taskzIXQue/test-tmp/rpc-test-f780ef32d131488f90ce7c329312da3f.sock every 8 connection(s)
W20260925 10:11:33.491086 8291 connection.cc:577] server connection from unix:<unnamed>: received bad data: 'Corruption: Invalid packet: message had a length of 2147483710, but we only support messages up to 2147483647 bytes
'
W20260925 10:11:33.491750 8307 connection.cc:196] Error closing socket: Network error: TlsSocket::Close: Broken pipe
[ OK ] Parameters/TestRpc.TestRpcSidecarLimits/SSL_UnixSocket (11127 ms)
[ RUN ] Parameters/TestRpc.TestCallTimeoutDoesntAffectNegotiation/SSL_UnixSocket
I20260925 10:11:34.045347 8319 acceptor_pool.cc:254] collecting diagnostics on the listening RPC socket unix:/tmp/dist-test-taskzIXQue/test-tmp/rpc-test-1ebf4754ea8b495ba10e5521731d6e67.sock every 8 connection(s)
I20260925 10:11:34.045650 8320 acceptor_pool.cc:254] collecting diagnostics on the listening RPC socket unix:/tmp/dist-test-taskzIXQue/test-tmp/rpc-test-1ebf4754ea8b495ba10e5521731d6e67.sock every 8 connection(s)
W20260925 10:11:34.063012 8315 negotiation.cc:266] Injecting 500ms delay in negotiation
I20260925 10:11:34.113487 8027 rpc-test-base.h:595] status: Timed out: connection negotiation to unix:/tmp/dist-test-taskzIXQue/test-tmp/rpc-test-1ebf4754ea8b495ba10e5521731d6e67.sock for RPC Sleep timed out after 0.050s (ON_OUTBOUND_QUEUE), seconds elapsed: 0.051289
[ OK ] Parameters/TestRpc.TestCallTimeoutDoesntAffectNegotiation/SSL_UnixSocket (555 ms)
[ RUN ] Parameters/TestRpc.TestRpcHandlerLatencyMetric/SSL_UnixSocket
I20260925 10:11:34.596607 8344 acceptor_pool.cc:254] collecting diagnostics on the listening RPC socket unix:/tmp/dist-test-taskzIXQue/test-tmp/rpc-test-f15f1e15cd8542b2b43882c714f1f09d.sock every 8 connection(s)
I20260925 10:11:34.596905 8345 acceptor_pool.cc:254] collecting diagnostics on the listening RPC socket unix:/tmp/dist-test-taskzIXQue/test-tmp/rpc-test-f15f1e15cd8542b2b43882c714f1f09d.sock every 8 connection(s)
I20260925 10:11:34.652127 8027 rpc-test.cc:1236] Sleep() min lat: 20802
I20260925 10:11:34.652238 8027 rpc-test.cc:1237] Sleep() mean lat: 20802
I20260925 10:11:34.652287 8027 rpc-test.cc:1238] Sleep() max lat: 20802
I20260925 10:11:34.652307 8027 rpc-test.cc:1239] Sleep() #calls: 1
W20260925 10:11:34.654030 8341 connection.cc:196] Error closing socket: Network error: TlsSocket::Close: Broken pipe
[ OK ] Parameters/TestRpc.TestRpcHandlerLatencyMetric/SSL_UnixSocket (83 ms)
[ RUN ] Parameters/TestRpc.TimedOutOnResponseMetricServiceQueue/SSL_UnixSocket
I20260925 10:11:34.675923 8370 acceptor_pool.cc:254] collecting diagnostics on the listening RPC socket unix:/tmp/dist-test-taskzIXQue/test-tmp/rpc-test-e93cf62746ba42b98b66da0031481f3c.sock every 8 connection(s)
I20260925 10:11:34.676103 8371 acceptor_pool.cc:254] collecting diagnostics on the listening RPC socket unix:/tmp/dist-test-taskzIXQue/test-tmp/rpc-test-e93cf62746ba42b98b66da0031481f3c.sock every 8 connection(s)
W20260925 10:11:34.736838 8372 rpcz_store.cc:267] Call kudu.rpc_test.CalculatorService.Sleep from unix:<unnamed> (request call id 2) took 20 ms (client timeout 20 ms). Trace:
W20260925 10:11:34.737032 8372 rpcz_store.cc:269] 0925 10:11:34.716116 (+ 0us) service_pool.cc:170] Inserting onto call queue
0925 10:11:34.736641 (+ 20525us) service_pool.cc:214] Skipping call since client already timed out
0925 10:11:34.736805 (+ 164us) inbound_call.cc:173] Queueing failure response
Metrics: {}
[ OK ] Parameters/TestRpc.TimedOutOnResponseMetricServiceQueue/SSL_UnixSocket (83 ms)
[ RUN ] Parameters/TestRpc.RpcPendingConnectionsMetric/SSL_UnixSocket
I20260925 10:11:34.748801 8393 acceptor_pool.cc:254] collecting diagnostics on the listening RPC socket 0.0.0.0:40757 every 8 connection(s)
I20260925 10:11:34.749162 8394 acceptor_pool.cc:254] collecting diagnostics on the listening RPC socket 0.0.0.0:40757 every 8 connection(s)
W20260925 10:11:34.751972 8389 negotiation.cc:337] Failed RPC negotiation. Trace:
0925 10:11:34.751026 (+ 0us) reactor.cc:625] Submitting negotiation task for server connection from 127.0.0.1:47400 (local address 127.0.0.1:40757)
0925 10:11:34.751228 (+ 202us) server_negotiation.cc:206] Beginning negotiation
0925 10:11:34.751235 (+ 7us) server_negotiation.cc:399] Waiting for connection header
0925 10:11:34.751484 (+ 249us) negotiation.cc:327] Negotiation complete: Network error: Server connection negotiation failed: server connection from 127.0.0.1:47400: BlockingRecv error: recv got EOF from 127.0.0.1:47400 (error 108)
Metrics: {"server-negotiator.queue_time_us":57}
[ OK ] Parameters/TestRpc.RpcPendingConnectionsMetric/SSL_UnixSocket (23 ms)
[ RUN ] Parameters/TestRpc.TestRpcContextClientDeadline/SSL_UnixSocket
I20260925 10:11:34.803275 8409 acceptor_pool.cc:254] collecting diagnostics on the listening RPC socket unix:/tmp/dist-test-taskzIXQue/test-tmp/rpc-test-b6fe1856f4604d3a9b43279092ba2957.sock every 8 connection(s)
I20260925 10:11:34.803623 8410 acceptor_pool.cc:254] collecting diagnostics on the listening RPC socket unix:/tmp/dist-test-taskzIXQue/test-tmp/rpc-test-b6fe1856f4604d3a9b43279092ba2957.sock every 8 connection(s)
W20260925 10:11:34.869843 8406 connection.cc:196] Error closing socket: Network error: TlsSocket::Close: Broken pipe
[ OK ] Parameters/TestRpc.TestRpcContextClientDeadline/SSL_UnixSocket (109 ms)
[ RUN ] Parameters/TestRpc.TestApplicationFeatureFlagUnsupportedServer/SSL_UnixSocket
I20260925 10:11:34.895012 8434 acceptor_pool.cc:254] collecting diagnostics on the listening RPC socket unix:/tmp/dist-test-taskzIXQue/test-tmp/rpc-test-2164b787d27e4936a2c5890530bbdc03.sock every 8 connection(s)
I20260925 10:11:34.895340 8435 acceptor_pool.cc:254] collecting diagnostics on the listening RPC socket unix:/tmp/dist-test-taskzIXQue/test-tmp/rpc-test-2164b787d27e4936a2c5890530bbdc03.sock every 8 connection(s)
W20260925 10:11:34.918813 8431 connection.cc:196] Error closing socket: Network error: TlsSocket::Close: Broken pipe
[ OK ] Parameters/TestRpc.TestApplicationFeatureFlagUnsupportedServer/SSL_UnixSocket (48 ms)
[ RUN ] Parameters/TestRpc.TestCancellationAsync/SSL_UnixSocket
I20260925 10:11:34.947096 8459 acceptor_pool.cc:254] collecting diagnostics on the listening RPC socket unix:/tmp/dist-test-taskzIXQue/test-tmp/rpc-test-d3e82ed850064f3daf5b1d40fc62d1f5.sock every 8 connection(s)
I20260925 10:11:34.947420 8460 acceptor_pool.cc:254] collecting diagnostics on the listening RPC socket unix:/tmp/dist-test-taskzIXQue/test-tmp/rpc-test-d3e82ed850064f3daf5b1d40fc62d1f5.sock every 8 connection(s)
I20260925 10:11:34.948436 8027 rpc-test.cc:1716] Connecting to unix:/tmp/dist-test-taskzIXQue/test-tmp/rpc-test-d3e82ed850064f3daf5b1d40fc62d1f5.sock
I20260925 10:11:34.972363 8027 test_util.cc:268] Using random seed: -252561484
I20260925 10:11:35.015496 8463 rpc-test-base.h:240] got call: sleep_micros: 500 pattern: 4294967295 num_repetitions: 2097152 sidecar_idx: 0
I20260925 10:11:35.049229 8462 rpc-test-base.h:240] got call: sleep_micros: 500 pattern: 4294967295 num_repetitions: 2097152 sidecar_idx: 0
I20260925 10:11:35.088575 8463 rpc-test-base.h:240] got call: sleep_micros: 500 pattern: 4294967295 num_repetitions: 2097152 sidecar_idx: 0
I20260925 10:11:35.127707 8462 rpc-test-base.h:240] got call: sleep_micros: 500 pattern: 4294967295 num_repetitions: 2097152 sidecar_idx: 0
I20260925 10:11:35.166276 8463 rpc-test-base.h:240] got call: sleep_micros: 500 pattern: 4294967295 num_repetitions: 2097152 sidecar_idx: 0
I20260925 10:11:35.204473 8463 rpc-test-base.h:240] got call: sleep_micros: 500 pattern: 4294967295 num_repetitions: 2097152 sidecar_idx: 0
I20260925 10:11:35.242978 8463 rpc-test-base.h:240] got call: sleep_micros: 500 pattern: 4294967295 num_repetitions: 2097152 sidecar_idx: 0
W20260925 10:11:35.245383 8456 connection.cc:196] Error closing socket: Network error: TlsSocket::Close: Broken pipe
W20260925 10:11:35.280019 8456 connection.cc:441] server connection from unix:<unnamed> torn down before Call kudu.rpc.GenericCalculatorService.SleepWithSidecar from unix:<unnamed> (request call id 9) could send its response
[ OK ] Parameters/TestRpc.TestCancellationAsync/SSL_UnixSocket (360 ms)
[ RUN ] Parameters/TestRpc.TestPerformanceBySocketType/SSL_UnixSocket
I20260925 10:11:35.314634 8484 acceptor_pool.cc:254] collecting diagnostics on the listening RPC socket unix:/tmp/dist-test-taskzIXQue/test-tmp/rpc-test-37e6d41f7ded45fdba9aaaf73265d057.sock every 8 connection(s)
I20260925 10:11:35.314905 8485 acceptor_pool.cc:254] collecting diagnostics on the listening RPC socket unix:/tmp/dist-test-taskzIXQue/test-tmp/rpc-test-37e6d41f7ded45fdba9aaaf73265d057.sock every 8 connection(s)
I20260925 10:11:35.315910 8027 rpc-test.cc:1846] Connecting to unix:/tmp/dist-test-taskzIXQue/test-tmp/rpc-test-37e6d41f7ded45fdba9aaaf73265d057.sock
I20260925 10:11:39.072338 8027 rpc-test.cc:1859] Sending 1024MB via ssl-enabled unix socket: real 3.735s user 3.617s sys 2.658s
I20260925 10:11:42.601871 8027 rpc-test.cc:1859] Sending 1024MB via ssl-enabled unix socket: real 3.529s user 3.448s sys 2.456s
I20260925 10:11:46.324882 8027 rpc-test.cc:1859] Sending 1024MB via ssl-enabled unix socket: real 3.723s user 3.622s sys 2.605s
I20260925 10:11:49.713016 8027 rpc-test.cc:1859] Sending 1024MB via ssl-enabled unix socket: real 3.388s user 3.341s sys 2.325s
I20260925 10:11:53.123579 8027 rpc-test.cc:1859] Sending 1024MB via ssl-enabled unix socket: real 3.410s user 3.366s sys 2.362s
W20260925 10:11:53.124804 8481 connection.cc:196] Error closing socket: Network error: TlsSocket::Close: Broken pipe
[ OK ] Parameters/TestRpc.TestPerformanceBySocketType/SSL_UnixSocket (17846 ms)
[----------] 20 tests from Parameters/TestRpc (59487 ms total)
[----------] 1 test from Parameters/TestRpcSocketTxRxQueue
[ RUN ] Parameters/TestRpcSocketTxRxQueue.AcceptorRxQueueSizeMetric/0
I20260925 10:11:53.135489 8509 acceptor_pool.cc:254] collecting diagnostics on the listening RPC socket 0.0.0.0:33157 every 1 connection(s)
I20260925 10:11:53.135695 8510 acceptor_pool.cc:254] collecting diagnostics on the listening RPC socket 0.0.0.0:33157 every 1 connection(s)
W20260925 10:11:53.137435 8505 negotiation.cc:337] Failed RPC negotiation. Trace:
0925 10:11:53.137070 (+ 0us) reactor.cc:625] Submitting negotiation task for server connection from 127.0.0.1:52990 (local address 127.0.0.1:33157)
0925 10:11:53.137204 (+ 134us) server_negotiation.cc:206] Beginning negotiation
0925 10:11:53.137208 (+ 4us) server_negotiation.cc:399] Waiting for connection header
0925 10:11:53.137328 (+ 120us) negotiation.cc:327] Negotiation complete: Network error: Server connection negotiation failed: server connection from 127.0.0.1:52990: BlockingRecv error: recv got EOF from 127.0.0.1:52990 (error 108)
Metrics: {"server-negotiator.queue_time_us":35}
[ OK ] Parameters/TestRpcSocketTxRxQueue.AcceptorRxQueueSizeMetric/0 (10 ms)
[----------] 1 test from Parameters/TestRpcSocketTxRxQueue (10 ms total)
[----------] Global test environment tear-down
[==========] 21 tests from 2 test suites ran. (59498 ms total)
[ PASSED ] 20 tests.
[ FAILED ] 1 test, listed below:
[ FAILED ] Parameters/TestRpc.TestCallWithChainCertAndChainCA/SSL_UnixSocket, where GetParam() = (true, true)
1 FAILED TEST