Diagnosed failure
Parameters/TestRpc.TestCallWithChainCertAndChainCA/SSL_TCP: /data0/somelongdirectorytoavoidrpathissues/src/kudu/src/kudu/rpc/rpc-test.cc:270: Failure
Failed
Bad status: Runtime error: could not verify certificate chain (error with cert: subject=CN = localhost, ST = sadfjas, C = AS, emailAddress = sdflkdsajf, O = lskdfjlsad, OU = sldfkja, issuer=C = AS, ST = ASDfkjdhf, L = lskdjf, O = saldfja, OU = skdjf, CN = localhost, emailAddress = sadjflkadsj): : certificate has expired
Google Test trace:
/data0/somelongdirectorytoavoidrpathissues/src/kudu/src/kudu/rpc/rpc-test.cc:267: Connecting to 0.0.0.0:40521
I20260924 10:33:56.354627 8248 test_util.cc:175] -----------------------------------------------
I20260924 10:33:56.354684 8248 test_util.cc:176] Had fatal failures, leaving test files at /tmp/dist-test-taskUayhz9/test-tmp/rpc-test.5.Parameters_TestRpc.TestCallWithChainCertAndChainCA_SSL_TCP.1790246036292837-8248-0
Full log
Note: This is test shard 6 of 8.
[==========] Running 21 tests from 2 test suites.
[----------] Global test environment set-up.
[----------] 20 tests from Parameters/TestRpc
[ RUN ] Parameters/TestRpc.TestMessengerCreateDestroy/SSL_TCP
WARNING: Logging before InitGoogleLogging() is written to STDERR
I20260924 10:33:56.314702 8248 rpc-test.cc:169] started messenger TestCreateDestroy
[ OK ] Parameters/TestRpc.TestMessengerCreateDestroy/SSL_TCP (17 ms)
[ RUN ] Parameters/TestRpc.TestNegotiationDeadlock/SSL_TCP
I20260924 10:33:56.329668 8269 acceptor_pool.cc:254] collecting diagnostics on the listening RPC socket 0.0.0.0:41429 every 8 connection(s)
I20260924 10:33:56.329668 8268 acceptor_pool.cc:254] collecting diagnostics on the listening RPC socket 0.0.0.0:41429 every 8 connection(s)
[ OK ] Parameters/TestRpc.TestNegotiationDeadlock/SSL_TCP (23 ms)
[ RUN ] Parameters/TestRpc.TestCallWithChainCertAndChainCA/SSL_TCP
I20260924 10:33:56.350045 8284 acceptor_pool.cc:254] collecting diagnostics on the listening RPC socket 0.0.0.0:40521 every 8 connection(s)
I20260924 10:33:56.350062 8285 acceptor_pool.cc:254] collecting diagnostics on the listening RPC socket 0.0.0.0:40521 every 8 connection(s)
/data0/somelongdirectorytoavoidrpathissues/src/kudu/src/kudu/rpc/rpc-test.cc:270: Failure
Failed
Bad status: Runtime error: could not verify certificate chain (error with cert: subject=CN = localhost, ST = sadfjas, C = AS, emailAddress = sdflkdsajf, O = lskdfjlsad, OU = sldfkja, issuer=C = AS, ST = ASDfkjdhf, L = lskdjf, O = saldfja, OU = skdjf, CN = localhost, emailAddress = sadjflkadsj): : certificate has expired
Google Test trace:
/data0/somelongdirectorytoavoidrpathissues/src/kudu/src/kudu/rpc/rpc-test.cc:267: Connecting to 0.0.0.0:40521
I20260924 10:33:56.354627 8248 test_util.cc:175] -----------------------------------------------
I20260924 10:33:56.354684 8248 test_util.cc:176] Had fatal failures, leaving test files at /tmp/dist-test-taskUayhz9/test-tmp/rpc-test.5.Parameters_TestRpc.TestCallWithChainCertAndChainCA_SSL_TCP.1790246036292837-8248-0
[ FAILED ] Parameters/TestRpc.TestCallWithChainCertAndChainCA/SSL_TCP, where GetParam() = (true, false) (14 ms)
[ RUN ] Parameters/TestRpc.TestCallWithPasswordProtectedKey/SSL_TCP
I20260924 10:33:56.363282 8309 acceptor_pool.cc:254] collecting diagnostics on the listening RPC socket 0.0.0.0:39817 every 8 connection(s)
I20260924 10:33:56.363333 8310 acceptor_pool.cc:254] collecting diagnostics on the listening RPC socket 0.0.0.0:39817 every 8 connection(s)
[ OK ] Parameters/TestRpc.TestCallWithPasswordProtectedKey/SSL_TCP (21 ms)
[ RUN ] Parameters/TestRpc.TestCallToBadServer/SSL_TCP
I20260924 10:33:56.388916 8248 rpc-test.cc:394] Status: Network error: Client connection negotiation failed: client connection to 0.0.0.0:0: connect: Connection refused (error 111)
I20260924 10:33:56.389308 8248 rpc-test.cc:394] Status: Network error: Client connection negotiation failed: client connection to 0.0.0.0:0: connect: Connection refused (error 111)
I20260924 10:33:56.389693 8248 rpc-test.cc:394] Status: Network error: Client connection negotiation failed: client connection to 0.0.0.0:0: connect: Connection refused (error 111)
I20260924 10:33:56.390071 8248 rpc-test.cc:394] Status: Network error: Client connection negotiation failed: client connection to 0.0.0.0:0: connect: Connection refused (error 111)
I20260924 10:33:56.390424 8248 rpc-test.cc:394] Status: Network error: Client connection negotiation failed: client connection to 0.0.0.0:0: connect: Connection refused (error 111)
[ OK ] Parameters/TestRpc.TestCallToBadServer/SSL_TCP (14 ms)
[ RUN ] Parameters/TestRpc.TestWrongService/SSL_TCP
I20260924 10:33:56.404074 8344 acceptor_pool.cc:254] collecting diagnostics on the listening RPC socket 0.0.0.0:45031 every 8 connection(s)
I20260924 10:33:56.404074 8345 acceptor_pool.cc:254] collecting diagnostics on the listening RPC socket 0.0.0.0:45031 every 8 connection(s)
I20260924 10:33:56.424458 8342 messenger.cc:345] service WrongServiceName not registered on TestServer
[ OK ] Parameters/TestRpc.TestWrongService/SSL_TCP (35 ms)
[ RUN ] Parameters/TestRpc.TestConnectionKeepalive/SSL_TCP
I20260924 10:33:56.436896 8368 acceptor_pool.cc:254] collecting diagnostics on the listening RPC socket 0.0.0.0:40231 every 8 connection(s)
I20260924 10:33:56.436872 8367 acceptor_pool.cc:254] collecting diagnostics on the listening RPC socket 0.0.0.0:40231 every 8 connection(s)
I20260924 10:33:56.437124 8248 rpc-test.cc:488] Connecting to 0.0.0.0:40231
[ OK ] Parameters/TestRpc.TestConnectionKeepalive/SSL_TCP (1025 ms)
[ RUN ] Parameters/TestRpc.TestClientConnectionMetrics/SSL_TCP
I20260924 10:33:57.476631 8392 acceptor_pool.cc:254] collecting diagnostics on the listening RPC socket 0.0.0.0:44261 every 8 connection(s)
I20260924 10:33:57.476647 8393 acceptor_pool.cc:254] collecting diagnostics on the listening RPC socket 0.0.0.0:44261 every 8 connection(s)
I20260924 10:33:57.476902 8248 rpc-test.cc:569] Connecting to 0.0.0.0:44261
[ OK ] Parameters/TestRpc.TestClientConnectionMetrics/SSL_TCP (13617 ms)
[ RUN ] Parameters/TestRpc.TestCredentialsPolicy/SSL_TCP
I20260924 10:34:11.087572 8415 acceptor_pool.cc:254] collecting diagnostics on the listening RPC socket 0.0.0.0:42267 every 8 connection(s)
I20260924 10:34:11.087618 8416 acceptor_pool.cc:254] collecting diagnostics on the listening RPC socket 0.0.0.0:42267 every 8 connection(s)
I20260924 10:34:11.087854 8248 rpc-test.cc:700] Connecting to 0.0.0.0:42267
[ OK ] Parameters/TestRpc.TestCredentialsPolicy/SSL_TCP (42 ms)
[ RUN ] Parameters/TestRpc.TestCallLongerThanKeepalive/SSL_TCP
I20260924 10:34:11.125110 8440 acceptor_pool.cc:254] collecting diagnostics on the listening RPC socket 0.0.0.0:33499 every 8 connection(s)
I20260924 10:34:11.125149 8441 acceptor_pool.cc:254] collecting diagnostics on the listening RPC socket 0.0.0.0:33499 every 8 connection(s)
I20260924 10:34:11.144480 8444 rpc-test-base.h:222] got call: sleep_micros: 3000000 deferred: true
I20260924 10:34:14.145376 8444 rpcz_store.cc:275] Call kudu.rpc.GenericCalculatorService.Sleep from 127.0.0.1:39760 (request call id 0) took 3001 ms. Trace:
I20260924 10:34:14.145509 8444 rpcz_store.cc:276] 0924 10:34:11.144399 (+ 0us) service_pool.cc:170] Inserting onto call queue
0924 10:34:11.144447 (+ 48us) service_pool.cc:227] Handling call
0924 10:34:14.145355 (+3000908us) inbound_call.cc:173] Queueing success response
Metrics: {}
[ OK ] Parameters/TestRpc.TestCallLongerThanKeepalive/SSL_TCP (3036 ms)
[ RUN ] Parameters/TestRpc.TestRpcSidecar/SSL_TCP
I20260924 10:34:14.169982 8465 acceptor_pool.cc:254] collecting diagnostics on the listening RPC socket 0.0.0.0:41249 every 8 connection(s)
I20260924 10:34:14.170022 8466 acceptor_pool.cc:254] collecting diagnostics on the listening RPC socket 0.0.0.0:41249 every 8 connection(s)
[ OK ] Parameters/TestRpc.TestRpcSidecar/SSL_TCP (79 ms)
[ RUN ] Parameters/TestRpc.TestRpcSidecarLimits/SSL_TCP
I20260924 10:34:15.920290 8490 acceptor_pool.cc:254] collecting diagnostics on the listening RPC socket 0.0.0.0:33293 every 8 connection(s)
I20260924 10:34:15.920392 8491 acceptor_pool.cc:254] collecting diagnostics on the listening RPC socket 0.0.0.0:33293 every 8 connection(s)
W20260924 10:34:15.928632 8248 serialization.cc:72] Serialized kudu.rpc_test.PushStringsRequestPB (2147483654 bytes) is larger than the maximum configured RPC message size (52428800 bytes). Sending anyway, but peer may reject the data.
W20260924 10:34:15.932235 8487 connection.cc:535] server connection from 127.0.0.1:59964 recv error: Network error: RPC frame had a length of 2147483714, but we only support messages up to 52428800 bytes long.
W20260924 10:34:15.932298 8487 connection.cc:158] shutting down server connection from 127.0.0.1:59964 with pending inbound data: 4/2147483714 bytes received; last active 0 ns ago: status Network error: RPC frame had a length of 2147483714, but we only support messages up to 52428800 bytes long.
W20260924 10:34:15.932497 8503 connection.cc:698] client connection to 0.0.0.0:33293 send error: Network error: failed to write to TLS socket: Connection reset by peer
W20260924 10:34:15.932660 8503 connection.cc:196] Error closing socket: Network error: TlsSocket::Close: Success
I20260924 10:34:15.948383 8516 acceptor_pool.cc:254] collecting diagnostics on the listening RPC socket 0.0.0.0:41485 every 8 connection(s)
I20260924 10:34:15.948335 8515 acceptor_pool.cc:254] collecting diagnostics on the listening RPC socket 0.0.0.0:41485 every 8 connection(s)
W20260924 10:34:20.120193 8513 connection.cc:577] server connection from 127.0.0.1:39450: received bad data: 'Corruption: Invalid packet: message had a length of 2147483710, but we only support messages up to 2147483647 bytes
'
[ OK ] Parameters/TestRpc.TestRpcSidecarLimits/SSL_TCP (5894 ms)
[ RUN ] Parameters/TestRpc.TestCallTimeoutDoesntAffectNegotiation/SSL_TCP
I20260924 10:34:20.142555 8540 acceptor_pool.cc:254] collecting diagnostics on the listening RPC socket 0.0.0.0:37091 every 8 connection(s)
I20260924 10:34:20.142578 8541 acceptor_pool.cc:254] collecting diagnostics on the listening RPC socket 0.0.0.0:37091 every 8 connection(s)
W20260924 10:34:20.166467 8536 negotiation.cc:266] Injecting 500ms delay in negotiation
I20260924 10:34:20.216825 8248 rpc-test-base.h:595] status: Timed out: connection negotiation to 0.0.0.0:37091 for RPC Sleep timed out after 0.050s (ON_OUTBOUND_QUEUE), seconds elapsed: 0.0508078
[ OK ] Parameters/TestRpc.TestCallTimeoutDoesntAffectNegotiation/SSL_TCP (549 ms)
[ RUN ] Parameters/TestRpc.TestRpcHandlerLatencyMetric/SSL_TCP
I20260924 10:34:20.680598 8565 acceptor_pool.cc:254] collecting diagnostics on the listening RPC socket 0.0.0.0:43221 every 8 connection(s)
I20260924 10:34:20.680658 8566 acceptor_pool.cc:254] collecting diagnostics on the listening RPC socket 0.0.0.0:43221 every 8 connection(s)
I20260924 10:34:20.717038 8248 rpc-test.cc:1236] Sleep() min lat: 20436
I20260924 10:34:20.717104 8248 rpc-test.cc:1237] Sleep() mean lat: 20436
I20260924 10:34:20.717131 8248 rpc-test.cc:1238] Sleep() max lat: 20436
I20260924 10:34:20.717144 8248 rpc-test.cc:1239] Sleep() #calls: 1
[ OK ] Parameters/TestRpc.TestRpcHandlerLatencyMetric/SSL_TCP (46 ms)
[ RUN ] Parameters/TestRpc.TimedOutOnResponseMetricServiceQueue/SSL_TCP
I20260924 10:34:20.726140 8591 acceptor_pool.cc:254] collecting diagnostics on the listening RPC socket 0.0.0.0:38067 every 8 connection(s)
I20260924 10:34:20.726177 8592 acceptor_pool.cc:254] collecting diagnostics on the listening RPC socket 0.0.0.0:38067 every 8 connection(s)
W20260924 10:34:20.785490 8593 rpcz_store.cc:267] Call kudu.rpc_test.CalculatorService.Sleep from 127.0.0.1:53524 (request call id 2) took 20 ms (client timeout 20 ms). Trace:
W20260924 10:34:20.785595 8593 rpcz_store.cc:269] 0924 10:34:20.765065 (+ 0us) service_pool.cc:170] Inserting onto call queue
0924 10:34:20.785407 (+ 20342us) service_pool.cc:214] Skipping call since client already timed out
0924 10:34:20.785439 (+ 32us) inbound_call.cc:173] Queueing failure response
Metrics: {}
[ OK ] Parameters/TestRpc.TimedOutOnResponseMetricServiceQueue/SSL_TCP (68 ms)
[ RUN ] Parameters/TestRpc.RpcPendingConnectionsMetric/SSL_TCP
I20260924 10:34:20.789438 8614 acceptor_pool.cc:254] collecting diagnostics on the listening RPC socket 0.0.0.0:43261 every 8 connection(s)
I20260924 10:34:20.789484 8615 acceptor_pool.cc:254] collecting diagnostics on the listening RPC socket 0.0.0.0:43261 every 8 connection(s)
W20260924 10:34:20.800611 8610 negotiation.cc:337] Failed RPC negotiation. Trace:
0924 10:34:20.799817 (+ 0us) reactor.cc:625] Submitting negotiation task for server connection from 127.0.0.1:56222 (local address 127.0.0.1:43261)
0924 10:34:20.800031 (+ 214us) server_negotiation.cc:206] Beginning negotiation
0924 10:34:20.800035 (+ 4us) server_negotiation.cc:399] Waiting for connection header
0924 10:34:20.800230 (+ 195us) negotiation.cc:327] Negotiation complete: Network error: Server connection negotiation failed: server connection from 127.0.0.1:56222: BlockingRecv error: recv got EOF from 127.0.0.1:56222 (error 108)
Metrics: {"server-negotiator.queue_time_us":46}
[ OK ] Parameters/TestRpc.RpcPendingConnectionsMetric/SSL_TCP (23 ms)
[ RUN ] Parameters/TestRpc.TestRpcContextClientDeadline/SSL_TCP
I20260924 10:34:20.825670 8630 acceptor_pool.cc:254] collecting diagnostics on the listening RPC socket 0.0.0.0:34383 every 8 connection(s)
I20260924 10:34:20.825686 8631 acceptor_pool.cc:254] collecting diagnostics on the listening RPC socket 0.0.0.0:34383 every 8 connection(s)
[ OK ] Parameters/TestRpc.TestRpcContextClientDeadline/SSL_TCP (51 ms)
[ RUN ] Parameters/TestRpc.TestApplicationFeatureFlagUnsupportedServer/SSL_TCP
I20260924 10:34:20.878448 8655 acceptor_pool.cc:254] collecting diagnostics on the listening RPC socket 0.0.0.0:45007 every 8 connection(s)
I20260924 10:34:20.878511 8656 acceptor_pool.cc:254] collecting diagnostics on the listening RPC socket 0.0.0.0:45007 every 8 connection(s)
[ OK ] Parameters/TestRpc.TestApplicationFeatureFlagUnsupportedServer/SSL_TCP (28 ms)
[ RUN ] Parameters/TestRpc.TestCancellationAsync/SSL_TCP
I20260924 10:34:20.923702 8680 acceptor_pool.cc:254] collecting diagnostics on the listening RPC socket 0.0.0.0:46797 every 8 connection(s)
I20260924 10:34:20.923719 8681 acceptor_pool.cc:254] collecting diagnostics on the listening RPC socket 0.0.0.0:46797 every 8 connection(s)
I20260924 10:34:20.923944 8248 rpc-test.cc:1716] Connecting to 0.0.0.0:46797
I20260924 10:34:20.950968 8248 test_util.cc:268] Using random seed: 612763059
I20260924 10:34:20.968719 8684 rpc-test-base.h:240] got call: sleep_micros: 500 pattern: 4294967295 num_repetitions: 2097152 sidecar_idx: 0
I20260924 10:34:20.984671 8683 rpc-test-base.h:240] got call: sleep_micros: 500 pattern: 4294967295 num_repetitions: 2097152 sidecar_idx: 0
I20260924 10:34:21.001199 8684 rpc-test-base.h:240] got call: sleep_micros: 500 pattern: 4294967295 num_repetitions: 2097152 sidecar_idx: 0
I20260924 10:34:21.018690 8683 rpc-test-base.h:240] got call: sleep_micros: 500 pattern: 4294967295 num_repetitions: 2097152 sidecar_idx: 0
I20260924 10:34:21.037421 8684 rpc-test-base.h:240] got call: sleep_micros: 500 pattern: 4294967295 num_repetitions: 2097152 sidecar_idx: 0
I20260924 10:34:21.054865 8683 rpc-test-base.h:240] got call: sleep_micros: 500 pattern: 4294967295 num_repetitions: 2097152 sidecar_idx: 0
I20260924 10:34:21.074219 8684 rpc-test-base.h:240] got call: sleep_micros: 500 pattern: 4294967295 num_repetitions: 2097152 sidecar_idx: 0
I20260924 10:34:21.092067 8683 rpc-test-base.h:240] got call: sleep_micros: 500 pattern: 4294967295 num_repetitions: 2097152 sidecar_idx: 0
W20260924 10:34:21.098266 8679 connection.cc:441] server connection from 127.0.0.1:46046 torn down before Call kudu.rpc.GenericCalculatorService.SleepWithSidecar from 127.0.0.1:46046 (request call id 8) could send its response
W20260924 10:34:21.109472 8679 connection.cc:441] server connection from 127.0.0.1:46046 torn down before Call kudu.rpc.GenericCalculatorService.SleepWithSidecar from 127.0.0.1:46046 (request call id 9) could send its response
[ OK ] Parameters/TestRpc.TestCancellationAsync/SSL_TCP (219 ms)
[ RUN ] Parameters/TestRpc.TestPerformanceBySocketType/SSL_TCP
I20260924 10:34:21.126349 8705 acceptor_pool.cc:254] collecting diagnostics on the listening RPC socket 0.0.0.0:37607 every 8 connection(s)
I20260924 10:34:21.126385 8706 acceptor_pool.cc:254] collecting diagnostics on the listening RPC socket 0.0.0.0:37607 every 8 connection(s)
I20260924 10:34:21.126612 8248 rpc-test.cc:1846] Connecting to 0.0.0.0:37607
I20260924 10:34:23.338493 8248 rpc-test.cc:1859] Sending 1024MB via ssl-enabled tcp socket: real 2.207s user 2.390s sys 1.520s
I20260924 10:34:25.421672 8248 rpc-test.cc:1859] Sending 1024MB via ssl-enabled tcp socket: real 2.083s user 2.302s sys 1.375s
I20260924 10:34:27.487726 8248 rpc-test.cc:1859] Sending 1024MB via ssl-enabled tcp socket: real 2.066s user 2.163s sys 1.477s
I20260924 10:34:29.520813 8248 rpc-test.cc:1859] Sending 1024MB via ssl-enabled tcp socket: real 2.033s user 2.089s sys 1.491s
I20260924 10:34:31.677436 8248 rpc-test.cc:1859] Sending 1024MB via ssl-enabled tcp socket: real 2.157s user 2.344s sys 1.476s
[ OK ] Parameters/TestRpc.TestPerformanceBySocketType/SSL_TCP (10568 ms)
[----------] 20 tests from Parameters/TestRpc (35380 ms total)
[----------] 1 test from Parameters/TestRpcSocketTxRxQueue
[ RUN ] Parameters/TestRpcSocketTxRxQueue.OverCapacity/0
W20260924 10:34:31.950253 8740 negotiation.cc:337] Failed RPC negotiation. Trace:
0924 10:34:31.687155 (+ 0us) reactor.cc:625] Submitting negotiation task for client connection to 0.0.0.0:46501 (local address 127.0.0.1:46224)
0924 10:34:31.687252 (+ 97us) negotiation.cc:107] Waiting for socket to connect
0924 10:34:31.687265 (+ 13us) client_negotiation.cc:174] Beginning negotiation
0924 10:34:31.687350 (+ 85us) client_negotiation.cc:252] Sending NEGOTIATE NegotiatePB request
0924 10:34:31.950015 (+262665us) negotiation.cc:327] Negotiation complete: Network error: Client connection negotiation failed: client connection to 0.0.0.0:46501: BlockingRecv error: recv error from unknown peer: Transport endpoint is not connected (error 107)
Metrics: {"client-negotiator.queue_time_us":33}
W20260924 10:34:31.950256 8758 negotiation.cc:337] Failed RPC negotiation. Trace:
0924 10:34:31.689254 (+ 0us) reactor.cc:625] Submitting negotiation task for client connection to 0.0.0.0:46501 (local address 127.0.0.1:46234)
0924 10:34:31.689356 (+ 102us) negotiation.cc:107] Waiting for socket to connect
0924 10:34:31.689368 (+ 12us) client_negotiation.cc:174] Beginning negotiation
0924 10:34:31.689442 (+ 74us) client_negotiation.cc:252] Sending NEGOTIATE NegotiatePB request
0924 10:34:31.950163 (+260721us) negotiation.cc:327] Negotiation complete: Network error: Client connection negotiation failed: client connection to 0.0.0.0:46501: BlockingRecv error: recv error from unknown peer: Transport endpoint is not connected (error 107)
Metrics: {"client-negotiator.queue_time_us":22}
W20260924 10:34:31.950415 8767 negotiation.cc:337] Failed RPC negotiation. Trace:
0924 10:34:31.690224 (+ 0us) reactor.cc:625] Submitting negotiation task for client connection to 0.0.0.0:46501 (local address 127.0.0.1:46246)
0924 10:34:31.690310 (+ 86us) negotiation.cc:107] Waiting for socket to connect
0924 10:34:31.690322 (+ 12us) client_negotiation.cc:174] Beginning negotiation
0924 10:34:31.690394 (+ 72us) client_negotiation.cc:252] Sending NEGOTIATE NegotiatePB request
0924 10:34:31.950364 (+259970us) negotiation.cc:327] Negotiation complete: Network error: Client connection negotiation failed: client connection to 0.0.0.0:46501: BlockingRecv error: recv error from unknown peer: Transport endpoint is not connected (error 107)
Metrics: {"client-negotiator.queue_time_us":24}
W20260924 10:34:31.950256 8749 negotiation.cc:337] Failed RPC negotiation. Trace:
0924 10:34:31.688272 (+ 0us) reactor.cc:625] Submitting negotiation task for client connection to 0.0.0.0:46501 (local address 127.0.0.1:46232)
0924 10:34:31.688351 (+ 79us) negotiation.cc:107] Waiting for socket to connect
0924 10:34:31.688379 (+ 28us) client_negotiation.cc:174] Beginning negotiation
0924 10:34:31.688457 (+ 78us) client_negotiation.cc:252] Sending NEGOTIATE NegotiatePB request
0924 10:34:31.950015 (+261558us) negotiation.cc:327] Negotiation complete: Network error: Client connection negotiation failed: client connection to 0.0.0.0:46501: BlockingRecv error: recv error from unknown peer: Transport endpoint is not connected (error 107)
Metrics: {"client-negotiator.queue_time_us":23}
W20260924 10:34:31.950294 8722 negotiation.cc:337] Failed RPC negotiation. Trace:
0924 10:34:31.684957 (+ 0us) reactor.cc:625] Submitting negotiation task for client connection to 0.0.0.0:46501 (local address 127.0.0.1:46198)
0924 10:34:31.685077 (+ 120us) negotiation.cc:107] Waiting for socket to connect
0924 10:34:31.685093 (+ 16us) client_negotiation.cc:174] Beginning negotiation
0924 10:34:31.685176 (+ 83us) client_negotiation.cc:252] Sending NEGOTIATE NegotiatePB request
0924 10:34:31.950016 (+264840us) negotiation.cc:327] Negotiation complete: Network error: Client connection negotiation failed: client connection to 0.0.0.0:46501: BlockingRecv error: recv error from unknown peer: Transport endpoint is not connected (error 107)
Metrics: {"client-negotiator.queue_time_us":44}
W20260924 10:34:31.950253 8731 negotiation.cc:337] Failed RPC negotiation. Trace:
0924 10:34:31.686039 (+ 0us) reactor.cc:625] Submitting negotiation task for client connection to 0.0.0.0:46501 (local address 127.0.0.1:46214)
0924 10:34:31.686159 (+ 120us) negotiation.cc:107] Waiting for socket to connect
0924 10:34:31.686172 (+ 13us) client_negotiation.cc:174] Beginning negotiation
0924 10:34:31.686249 (+ 77us) client_negotiation.cc:252] Sending NEGOTIATE NegotiatePB request
0924 10:34:31.950016 (+263767us) negotiation.cc:327] Negotiation complete: Network error: Client connection negotiation failed: client connection to 0.0.0.0:46501: BlockingRecv error: recv error from unknown peer: Transport endpoint is not connected (error 107)
Metrics: {"client-negotiator.queue_time_us":41}
[ OK ] Parameters/TestRpcSocketTxRxQueue.OverCapacity/0 (1041 ms)
[----------] 1 test from Parameters/TestRpcSocketTxRxQueue (1041 ms total)
[----------] Global test environment tear-down
[==========] 21 tests from 2 test suites ran. (36422 ms total)
[ PASSED ] 20 tests.
[ FAILED ] 1 test, listed below:
[ FAILED ] Parameters/TestRpc.TestCallWithChainCertAndChainCA/SSL_TCP, where GetParam() = (true, false)
1 FAILED TEST