Parameters/TestRpc.TestCallWithChainCertAndRootCA/SSL_TCP: /data0/somelongdirectorytoavoidrpathissues/src/kudu/src/kudu/rpc/rpc-test.cc:303: Failure
Failed
Bad status: Runtime error: could not verify certificate chain (error with cert: subject=CN = localhost, ST = sadfjas, C = AS, emailAddress = sdflkdsajf, O = lskdfjlsad, OU = sldfkja, issuer=C = AS, ST = ASDfkjdhf, L = lskdjf, O = saldfja, OU = skdjf, CN = localhost, emailAddress = sadjflkadsj): : certificate has expired
Google Test trace:
/data0/somelongdirectorytoavoidrpathissues/src/kudu/src/kudu/rpc/rpc-test.cc:300: Connecting to 0.0.0.0:38779
I20260927 23:30:36.980850 390 test_util.cc:175] -----------------------------------------------
I20260927 23:30:36.981066 390 test_util.cc:176] Had fatal failures, leaving test files at /tmp/dist-test-taskD3r9ks/test-tmp/rpc-test.1.Parameters_TestRpc.TestCallWithChainCertAndRootCA_SSL_TCP.1790551835366162-390-0
Note: This is test shard 2 of 8.
[==========] Running 21 tests from 2 test suites.
[----------] Global test environment set-up.
[----------] 1 test from TestRpc
[ RUN ] TestRpc.TestMethodsByName
[ OK ] TestRpc.TestMethodsByName (7 ms)
[----------] 1 test from TestRpc (7 ms total)
[----------] 20 tests from Parameters/TestRpc
[ RUN ] Parameters/TestRpc.TestAcceptorPoolStartStop/SSL_TCP
WARNING: Logging before InitGoogleLogging() is written to STDERR
I20260927 23:30:35.488508 405 acceptor_pool.cc:254] collecting diagnostics on the listening RPC socket 0.0.0.0:40785 every 8 connection(s)
W20260927 23:30:36.490855 390 thread.cc:536] Waited for 1000ms trying to join with acceptor (tid 406)
I20260927 23:30:35.490185 406 acceptor_pool.cc:254] collecting diagnostics on the listening RPC socket 0.0.0.0:40785 every 8 connection(s)
I20260927 23:30:36.666991 417 acceptor_pool.cc:254] collecting diagnostics on the listening RPC socket 0.0.0.0:43419 every 8 connection(s)
I20260927 23:30:36.668911 418 acceptor_pool.cc:254] collecting diagnostics on the listening RPC socket 0.0.0.0:43419 every 8 connection(s)
I20260927 23:30:36.689373 428 acceptor_pool.cc:254] collecting diagnostics on the listening RPC socket 0.0.0.0:34335 every 8 connection(s)
I20260927 23:30:36.691254 429 acceptor_pool.cc:254] collecting diagnostics on the listening RPC socket 0.0.0.0:34335 every 8 connection(s)
I20260927 23:30:36.716032 439 acceptor_pool.cc:254] collecting diagnostics on the listening RPC socket 0.0.0.0:36501 every 8 connection(s)
I20260927 23:30:36.717438 440 acceptor_pool.cc:254] collecting diagnostics on the listening RPC socket 0.0.0.0:36501 every 8 connection(s)
I20260927 23:30:36.754105 450 acceptor_pool.cc:254] collecting diagnostics on the listening RPC socket 0.0.0.0:40807 every 8 connection(s)
I20260927 23:30:36.754848 451 acceptor_pool.cc:254] collecting diagnostics on the listening RPC socket 0.0.0.0:40807 every 8 connection(s)
[ OK ] Parameters/TestRpc.TestAcceptorPoolStartStop/SSL_TCP (1330 ms)
[ RUN ] Parameters/TestRpc.TestCall/SSL_TCP
I20260927 23:30:36.795809 463 acceptor_pool.cc:254] collecting diagnostics on the listening RPC socket 0.0.0.0:34693 every 8 connection(s)
I20260927 23:30:36.798301 464 acceptor_pool.cc:254] collecting diagnostics on the listening RPC socket 0.0.0.0:34693 every 8 connection(s)
I20260927 23:30:36.804491 390 rpc-test.cc:234] Connecting to 0.0.0.0:34693
[ OK ] Parameters/TestRpc.TestCall/SSL_TCP (174 ms)
[ RUN ] Parameters/TestRpc.TestCallWithChainCertAndRootCA/SSL_TCP
I20260927 23:30:36.953965 488 acceptor_pool.cc:254] collecting diagnostics on the listening RPC socket 0.0.0.0:38779 every 8 connection(s)
I20260927 23:30:36.954720 489 acceptor_pool.cc:254] collecting diagnostics on the listening RPC socket 0.0.0.0:38779 every 8 connection(s)
/data0/somelongdirectorytoavoidrpathissues/src/kudu/src/kudu/rpc/rpc-test.cc:303: Failure
Failed
Bad status: Runtime error: could not verify certificate chain (error with cert: subject=CN = localhost, ST = sadfjas, C = AS, emailAddress = sdflkdsajf, O = lskdfjlsad, OU = sldfkja, issuer=C = AS, ST = ASDfkjdhf, L = lskdjf, O = saldfja, OU = skdjf, CN = localhost, emailAddress = sadjflkadsj): : certificate has expired
Google Test trace:
/data0/somelongdirectorytoavoidrpathissues/src/kudu/src/kudu/rpc/rpc-test.cc:300: Connecting to 0.0.0.0:38779
I20260927 23:30:36.980850 390 test_util.cc:175] -----------------------------------------------
I20260927 23:30:36.981066 390 test_util.cc:176] Had fatal failures, leaving test files at /tmp/dist-test-taskD3r9ks/test-tmp/rpc-test.1.Parameters_TestRpc.TestCallWithChainCertAndRootCA_SSL_TCP.1790551835366162-390-0
[ FAILED ] Parameters/TestRpc.TestCallWithChainCertAndRootCA/SSL_TCP, where GetParam() = (true, false) (47 ms)
[ RUN ] Parameters/TestRpc.TestCallWithBadPasswordProtectedKey/SSL_TCP
[ OK ] Parameters/TestRpc.TestCallWithBadPasswordProtectedKey/SSL_TCP (34 ms)
[ RUN ] Parameters/TestRpc.TestInvalidMethodCall/SSL_TCP
I20260927 23:30:37.047652 525 acceptor_pool.cc:254] collecting diagnostics on the listening RPC socket 0.0.0.0:43339 every 8 connection(s)
I20260927 23:30:37.048491 526 acceptor_pool.cc:254] collecting diagnostics on the listening RPC socket 0.0.0.0:43339 every 8 connection(s)
I20260927 23:30:37.052016 390 rpc-test.cc:406] Connecting to 0.0.0.0:43339
[ OK ] Parameters/TestRpc.TestInvalidMethodCall/SSL_TCP (80 ms)
[ RUN ] Parameters/TestRpc.TestHighFDs/SSL_TCP
I20260927 23:30:37.309774 550 acceptor_pool.cc:254] collecting diagnostics on the listening RPC socket 0.0.0.0:38315 every 8 connection(s)
I20260927 23:30:37.310473 551 acceptor_pool.cc:254] collecting diagnostics on the listening RPC socket 0.0.0.0:38315 every 8 connection(s)
[ OK ] Parameters/TestRpc.TestHighFDs/SSL_TCP (263 ms)
[ RUN ] Parameters/TestRpc.TestConnectionAlwaysKeepalive/SSL_TCP
I20260927 23:30:37.382107 573 acceptor_pool.cc:254] collecting diagnostics on the listening RPC socket 0.0.0.0:45423 every 8 connection(s)
I20260927 23:30:37.382862 574 acceptor_pool.cc:254] collecting diagnostics on the listening RPC socket 0.0.0.0:45423 every 8 connection(s)
I20260927 23:30:37.385967 390 rpc-test.cc:532] Connecting to 0.0.0.0:45423
[ OK ] Parameters/TestRpc.TestConnectionAlwaysKeepalive/SSL_TCP (3067 ms)
[ RUN ] Parameters/TestRpc.TestReopenOutboundConnections/SSL_TCP
I20260927 23:30:40.456897 596 acceptor_pool.cc:254] collecting diagnostics on the listening RPC socket 0.0.0.0:42835 every 8 connection(s)
I20260927 23:30:40.457633 597 acceptor_pool.cc:254] collecting diagnostics on the listening RPC socket 0.0.0.0:42835 every 8 connection(s)
I20260927 23:30:40.460681 390 rpc-test.cc:658] Connecting to 0.0.0.0:42835
[ OK ] Parameters/TestRpc.TestReopenOutboundConnections/SSL_TCP (433 ms)
[ RUN ] Parameters/TestRpc.TestConnectionNetworkPlane/SSL_TCP
I20260927 23:30:40.898361 619 acceptor_pool.cc:254] collecting diagnostics on the listening RPC socket 0.0.0.0:39443 every 8 connection(s)
I20260927 23:30:40.899061 620 acceptor_pool.cc:254] collecting diagnostics on the listening RPC socket 0.0.0.0:39443 every 8 connection(s)
I20260927 23:30:40.903208 390 rpc-test.cc:772] Connecting to 0.0.0.0:39443
[ OK ] Parameters/TestRpc.TestConnectionNetworkPlane/SSL_TCP (108 ms)
[ RUN ] Parameters/TestRpc.TestTCPKeepalive/SSL_TCP
I20260927 23:30:40.991650 644 acceptor_pool.cc:254] collecting diagnostics on the listening RPC socket 0.0.0.0:43259 every 8 connection(s)
I20260927 23:30:40.992345 645 acceptor_pool.cc:254] collecting diagnostics on the listening RPC socket 0.0.0.0:43259 every 8 connection(s)
I20260927 23:30:41.047151 648 rpc-test-base.h:222] got call: sleep_micros: 8000000 deferred: true
I20260927 23:30:49.051340 648 rpcz_store.cc:275] Call kudu.rpc.GenericCalculatorService.Sleep from 127.0.0.1:49914 (request call id 0) took 8004 ms. Trace:
I20260927 23:30:49.051795 648 rpcz_store.cc:276] 0927 23:30:41.046862 (+ 0us) service_pool.cc:170] Inserting onto call queue
0927 23:30:41.046989 (+ 127us) service_pool.cc:227] Handling call
0927 23:30:49.051165 (+8004176us) inbound_call.cc:173] Queueing success response
Metrics: {}
[ OK ] Parameters/TestRpc.TestTCPKeepalive/SSL_TCP (8096 ms)
[ RUN ] Parameters/TestRpc.TestMaxSmallSidecars/SSL_TCP
I20260927 23:30:49.091842 670 acceptor_pool.cc:254] collecting diagnostics on the listening RPC socket 0.0.0.0:37977 every 8 connection(s)
I20260927 23:30:49.092685 671 acceptor_pool.cc:254] collecting diagnostics on the listening RPC socket 0.0.0.0:37977 every 8 connection(s)
[ OK ] Parameters/TestRpc.TestMaxSmallSidecars/SSL_TCP (204 ms)
[ RUN ] Parameters/TestRpc.TestCallTimeout/SSL_TCP
I20260927 23:30:49.286175 695 acceptor_pool.cc:254] collecting diagnostics on the listening RPC socket 0.0.0.0:40407 every 8 connection(s)
I20260927 23:30:49.286897 696 acceptor_pool.cc:254] collecting diagnostics on the listening RPC socket 0.0.0.0:40407 every 8 connection(s)
I20260927 23:30:49.313493 390 rpc-test-base.h:595] status: Timed out: connection negotiation to 0.0.0.0:40407 for RPC Sleep timed out after 0.000s (ON_OUTBOUND_QUEUE), seconds elapsed: 0.00238461
I20260927 23:30:49.322386 699 rpc-test-base.h:222] got call: sleep_micros: 700000
I20260927 23:30:49.515168 390 rpc-test-base.h:595] status: Timed out: Sleep RPC to 0.0.0.0:40407 timed out after 0.200s (SENT), seconds elapsed: 0.201335
I20260927 23:30:49.516672 698 rpc-test-base.h:222] got call: sleep_micros: 2000000
W20260927 23:30:50.023116 699 rpcz_store.cc:267] Call kudu.rpc.GenericCalculatorService.Sleep from 127.0.0.1:56684 (request call id 1) took 701 ms (client timeout 200 ms). Trace:
W20260927 23:30:50.023473 699 rpcz_store.cc:269] 0927 23:30:49.322169 (+ 0us) service_pool.cc:170] Inserting onto call queue
0927 23:30:49.322322 (+ 153us) service_pool.cc:227] Handling call
0927 23:30:50.023052 (+700730us) inbound_call.cc:173] Queueing success response
Metrics: {}
I20260927 23:30:51.018046 390 rpc-test-base.h:595] status: Timed out: Sleep RPC to 0.0.0.0:40407 timed out after 1.500s (SENT), seconds elapsed: 1.50256
W20260927 23:30:51.517222 698 rpcz_store.cc:267] Call kudu.rpc.GenericCalculatorService.Sleep from 127.0.0.1:56684 (request call id 2) took 2001 ms (client timeout 1500 ms). Trace:
W20260927 23:30:51.517565 698 rpcz_store.cc:269] 0927 23:30:49.516294 (+ 0us) service_pool.cc:170] Inserting onto call queue
0927 23:30:49.516440 (+ 146us) service_pool.cc:227] Handling call
0927 23:30:51.517169 (+2000729us) inbound_call.cc:173] Queueing success response
Metrics: {}
W20260927 23:30:51.518184 694 connection.cc:441] server connection from 127.0.0.1:56684 torn down before Call kudu.rpc.GenericCalculatorService.Sleep from 127.0.0.1:56684 (request call id 2) could send its response
[ OK ] Parameters/TestRpc.TestCallTimeout/SSL_TCP (2252 ms)
[ RUN ] Parameters/TestRpc.TestServerShutsDown/SSL_TCP
I20260927 23:30:51.525179 390 rpc-test.cc:1125] Connecting to 0.0.0.0:35683
W20260927 23:30:51.534801 712 negotiation.cc:337] Failed RPC negotiation. Trace:
0927 23:30:51.533270 (+ 0us) reactor.cc:625] Submitting negotiation task for client connection to 0.0.0.0:35683 (local address 127.0.0.1:45712)
0927 23:30:51.533713 (+ 443us) negotiation.cc:107] Waiting for socket to connect
0927 23:30:51.533744 (+ 31us) client_negotiation.cc:174] Beginning negotiation
0927 23:30:51.533986 (+ 242us) client_negotiation.cc:252] Sending NEGOTIATE NegotiatePB request
0927 23:30:51.534211 (+ 225us) negotiation.cc:327] Negotiation complete: Network error: Client connection negotiation failed: client connection to 0.0.0.0:35683: BlockingWrite error: write error: Broken pipe (error 32)
Metrics: {"client-negotiator.queue_time_us":119}
[ OK ] Parameters/TestRpc.TestServerShutsDown/SSL_TCP (14 ms)
[ RUN ] Parameters/TestRpc.TimedOutOnResponseMetric/SSL_TCP
I20260927 23:30:51.565495 729 acceptor_pool.cc:254] collecting diagnostics on the listening RPC socket 0.0.0.0:40069 every 8 connection(s)
I20260927 23:30:51.566196 730 acceptor_pool.cc:254] collecting diagnostics on the listening RPC socket 0.0.0.0:40069 every 8 connection(s)
W20260927 23:30:51.821075 733 rpcz_store.cc:267] Call kudu.rpc_test.CalculatorService.Sleep from 127.0.0.1:33374 (request call id 3) took 50 ms (client timeout 25 ms). Trace:
W20260927 23:30:51.821424 733 rpcz_store.cc:269] 0927 23:30:51.770450 (+ 0us) service_pool.cc:170] Inserting onto call queue
0927 23:30:51.770586 (+ 136us) service_pool.cc:227] Handling call
0927 23:30:51.820989 (+ 50403us) inbound_call.cc:173] Queueing success response
Related trace 'test_child':
Metrics: {"test_sleep_us":50000,"child_traces":[["test_child",{"related_trace_metric":1}]]}
W20260927 23:30:51.880764 733 rpcz_store.cc:267] Call kudu.rpc_test.CalculatorService.Sleep from 127.0.0.1:33374 (request call id 4) took 50 ms (client timeout 50 ms). Trace:
W20260927 23:30:51.881090 733 rpcz_store.cc:269] 0927 23:30:51.830060 (+ 0us) service_pool.cc:170] Inserting onto call queue
0927 23:30:51.830222 (+ 162us) service_pool.cc:227] Handling call
0927 23:30:51.880688 (+ 50466us) inbound_call.cc:173] Queueing success response
Related trace 'test_child':
Metrics: {"test_sleep_us":50000,"child_traces":[["test_child",{"related_trace_metric":1}]]}
W20260927 23:30:51.883544 726 connection.cc:441] server connection from 127.0.0.1:33374 torn down before Call kudu.rpc_test.CalculatorService.Sleep from 127.0.0.1:33374 (request call id 4) could send its response
[ OK ] Parameters/TestRpc.TimedOutOnResponseMetric/SSL_TCP (351 ms)
[ RUN ] Parameters/TestRpc.AcceptorDispatchingTimesMetric/SSL_TCP
I20260927 23:30:51.902220 754 acceptor_pool.cc:254] collecting diagnostics on the listening RPC socket 0.0.0.0:35507 every 8 connection(s)
I20260927 23:30:51.903119 755 acceptor_pool.cc:254] collecting diagnostics on the listening RPC socket 0.0.0.0:35507 every 8 connection(s)
W20260927 23:30:51.908331 750 negotiation.cc:337] Failed RPC negotiation. Trace:
0927 23:30:51.907182 (+ 0us) reactor.cc:625] Submitting negotiation task for server connection from 127.0.0.1:38750 (local address 127.0.0.1:35507)
0927 23:30:51.907616 (+ 434us) server_negotiation.cc:206] Beginning negotiation
0927 23:30:51.907632 (+ 16us) server_negotiation.cc:399] Waiting for connection header
0927 23:30:51.907874 (+ 242us) negotiation.cc:327] Negotiation complete: Network error: Server connection negotiation failed: server connection from 127.0.0.1:38750: BlockingRecv error: recv got EOF from 127.0.0.1:38750 (error 108)
Metrics: {"server-negotiator.queue_time_us":126}
[ OK ] Parameters/TestRpc.AcceptorDispatchingTimesMetric/SSL_TCP (25 ms)
[ RUN ] Parameters/TestRpc.TestRpcCallbackDestroysMessenger/SSL_TCP
[ OK ] Parameters/TestRpc.TestRpcCallbackDestroysMessenger/SSL_TCP (22 ms)
[ RUN ] Parameters/TestRpc.TestApplicationFeatureFlag/SSL_TCP
I20260927 23:30:51.972544 779 acceptor_pool.cc:254] collecting diagnostics on the listening RPC socket 0.0.0.0:42777 every 8 connection(s)
I20260927 23:30:51.973332 780 acceptor_pool.cc:254] collecting diagnostics on the listening RPC socket 0.0.0.0:42777 every 8 connection(s)
W20260927 23:30:52.014099 777 messenger.cc:357] Unable to handle RPC call: Not implemented: call requires unsupported application feature flags: 99
[ OK ] Parameters/TestRpc.TestApplicationFeatureFlag/SSL_TCP (84 ms)
[ RUN ] Parameters/TestRpc.TestCancellation/SSL_TCP
I20260927 23:30:52.059180 804 acceptor_pool.cc:254] collecting diagnostics on the listening RPC socket 0.0.0.0:44255 every 8 connection(s)
I20260927 23:30:52.059900 805 acceptor_pool.cc:254] collecting diagnostics on the listening RPC socket 0.0.0.0:44255 every 8 connection(s)
I20260927 23:30:52.063134 390 rpc-test.cc:1648] Connecting to 0.0.0.0:44255
I20260927 23:30:52.172336 390 rpc-test-base.h:595] status: Aborted: Sleep RPC to 0.0.0.0:44255 is cancelled in state READY, seconds elapsed: 0.000411483
I20260927 23:30:52.313859 390 rpc-test-base.h:595] status: Aborted: Sleep RPC to 0.0.0.0:44255 is cancelled in state SENT, seconds elapsed: 0.0009821
I20260927 23:30:52.358866 807 rpc-test-base.h:222] got call: sleep_micros: 510000
I20260927 23:30:52.501448 390 rpc-test-base.h:595] status: Aborted: Sleep RPC to 0.0.0.0:44255 is cancelled in state SENT, seconds elapsed: 0.00104437
I20260927 23:30:52.540834 806 rpc-test-base.h:222] got call: sleep_micros: 510000
I20260927 23:30:52.676676 390 rpc-test-base.h:595] status: Aborted: Sleep RPC to 0.0.0.0:44255 is cancelled in state SENT, seconds elapsed: 0.000852338
W20260927 23:30:52.715145 808 rpcz_store.cc:267] Call kudu.rpc.GenericCalculatorService.Sleep from 127.0.0.1:54126 (request call id 11) took 14 ms (client timeout 10 ms). Trace:
W20260927 23:30:52.715512 808 rpcz_store.cc:269] 0927 23:30:52.700154 (+ 0us) service_pool.cc:170] Inserting onto call queue
0927 23:30:52.714848 (+ 14694us) service_pool.cc:214] Skipping call since client already timed out
0927 23:30:52.714928 (+ 80us) inbound_call.cc:173] Queueing failure response
Metrics: {}
I20260927 23:30:52.716091 808 rpc-test-base.h:222] got call: sleep_micros: 1500000
W20260927 23:30:52.869599 807 rpcz_store.cc:267] Call kudu.rpc.GenericCalculatorService.Sleep from 127.0.0.1:54126 (request call id 3) took 511 ms (client timeout 10 ms). Trace:
W20260927 23:30:52.869906 807 rpcz_store.cc:269] 0927 23:30:52.358645 (+ 0us) service_pool.cc:170] Inserting onto call queue
0927 23:30:52.358794 (+ 149us) service_pool.cc:227] Handling call
0927 23:30:52.869543 (+510749us) inbound_call.cc:173] Queueing success response
Metrics: {}
W20260927 23:30:53.051482 806 rpcz_store.cc:267] Call kudu.rpc.GenericCalculatorService.Sleep from 127.0.0.1:54126 (request call id 7) took 513 ms (client timeout 10 ms). Trace:
W20260927 23:30:53.051942 806 rpcz_store.cc:269] 0927 23:30:52.538138 (+ 0us) service_pool.cc:170] Inserting onto call queue
0927 23:30:52.540773 (+ 2635us) service_pool.cc:227] Handling call
0927 23:30:53.051430 (+510657us) inbound_call.cc:173] Queueing success response
Metrics: {}
I20260927 23:30:53.678319 390 rpc-test-base.h:595] status: Timed out: Sleep RPC to 0.0.0.0:44255 timed out after 1.000s (SENT), seconds elapsed: 1.00131
I20260927 23:30:53.679728 806 rpc-test-base.h:222] got call: sleep_micros: 1500000
W20260927 23:30:54.216640 808 rpcz_store.cc:267] Call kudu.rpc.GenericCalculatorService.Sleep from 127.0.0.1:54126 (request call id 12) took 1516 ms (client timeout 1000 ms). Trace:
W20260927 23:30:54.216974 808 rpcz_store.cc:269] 0927 23:30:52.700363 (+ 0us) service_pool.cc:170] Inserting onto call queue
0927 23:30:52.716062 (+ 15699us) service_pool.cc:227] Handling call
0927 23:30:54.216566 (+1500504us) inbound_call.cc:173] Queueing success response
Metrics: {}
I20260927 23:30:54.680471 390 rpc-test-base.h:595] status: Timed out: Sleep RPC to 0.0.0.0:44255 timed out after 1.000s (SENT), seconds elapsed: 1.00183
W20260927 23:30:54.681977 803 messenger.cc:357] Unable to handle RPC call: Not implemented: call requires unsupported application feature flags: 99, 1
W20260927 23:30:54.683559 803 messenger.cc:357] Unable to handle RPC call: Not implemented: call requires unsupported application feature flags: 99, 1
W20260927 23:30:55.180274 806 rpcz_store.cc:267] Call kudu.rpc.GenericCalculatorService.Sleep from 127.0.0.1:54126 (request call id 13) took 1500 ms (client timeout 1000 ms). Trace:
W20260927 23:30:55.180583 806 rpcz_store.cc:269] 0927 23:30:53.679498 (+ 0us) service_pool.cc:170] Inserting onto call queue
0927 23:30:53.679681 (+ 183us) service_pool.cc:227] Handling call
0927 23:30:55.180222 (+1500541us) inbound_call.cc:173] Queueing success response
Metrics: {}
W20260927 23:30:55.181128 803 connection.cc:441] server connection from 127.0.0.1:54126 torn down before Call kudu.rpc.GenericCalculatorService.Sleep from 127.0.0.1:54126 (request call id 13) could send its response
[ OK ] Parameters/TestRpc.TestCancellation/SSL_TCP (3164 ms)
[ RUN ] Parameters/TestRpc.TestCancellationMultiThreads/SSL_TCP
I20260927 23:30:55.223832 829 acceptor_pool.cc:254] collecting diagnostics on the listening RPC socket 0.0.0.0:36761 every 8 connection(s)
I20260927 23:30:55.224583 830 acceptor_pool.cc:254] collecting diagnostics on the listening RPC socket 0.0.0.0:36761 every 8 connection(s)
I20260927 23:30:55.227849 390 rpc-test.cc:1808] Connecting to 0.0.0.0:36761
I20260927 23:30:55.377596 843 test_util.cc:268] Using random seed: 1464511648
I20260927 23:30:55.378708 844 test_util.cc:268] Using random seed: 1464512765
I20260927 23:30:55.380043 845 test_util.cc:268] Using random seed: 1464514100
I20260927 23:30:55.381358 846 test_util.cc:268] Using random seed: 1464515401
I20260927 23:30:55.382953 847 test_util.cc:268] Using random seed: 1464516792
I20260927 23:30:55.384560 848 test_util.cc:268] Using random seed: 1464518457
I20260927 23:30:55.385938 849 test_util.cc:268] Using random seed: 1464519858
I20260927 23:30:55.387966 850 test_util.cc:268] Using random seed: 1464521864
I20260927 23:30:55.389875 851 test_util.cc:268] Using random seed: 1464523803
I20260927 23:30:55.391628 852 test_util.cc:268] Using random seed: 1464525546
I20260927 23:30:55.395004 853 test_util.cc:268] Using random seed: 1464527548
I20260927 23:30:55.397341 854 test_util.cc:268] Using random seed: 1464531240
I20260927 23:30:55.401381 855 test_util.cc:268] Using random seed: 1464535277
I20260927 23:30:55.405438 856 test_util.cc:268] Using random seed: 1464539316
I20260927 23:30:55.407805 857 test_util.cc:268] Using random seed: 1464541703
I20260927 23:30:55.411082 858 test_util.cc:268] Using random seed: 1464544997
I20260927 23:30:55.413690 859 test_util.cc:268] Using random seed: 1464547596
I20260927 23:30:55.415812 860 test_util.cc:268] Using random seed: 1464549736
I20260927 23:30:55.418883 861 test_util.cc:268] Using random seed: 1464552272
I20260927 23:30:55.420843 862 test_util.cc:268] Using random seed: 1464554335
I20260927 23:30:55.423322 863 test_util.cc:268] Using random seed: 1464557212
I20260927 23:30:55.426357 864 test_util.cc:268] Using random seed: 1464560264
I20260927 23:30:55.428328 865 test_util.cc:268] Using random seed: 1464561813
I20260927 23:30:55.430439 866 test_util.cc:268] Using random seed: 1464564321
I20260927 23:30:55.433176 867 test_util.cc:268] Using random seed: 1464567074
I20260927 23:30:55.435817 868 test_util.cc:268] Using random seed: 1464569734
I20260927 23:30:55.438099 869 test_util.cc:268] Using random seed: 1464571927
I20260927 23:30:55.440179 870 test_util.cc:268] Using random seed: 1464574104
I20260927 23:30:55.442328 871 test_util.cc:268] Using random seed: 1464576255
I20260927 23:30:55.443840 872 test_util.cc:268] Using random seed: 1464577736
[ OK ] Parameters/TestRpc.TestCancellationMultiThreads/SSL_TCP (17848 ms)
[ RUN ] Parameters/TestRpc.TestCallId/SSL_TCP
I20260927 23:31:13.071059 886 acceptor_pool.cc:254] collecting diagnostics on the listening RPC socket 0.0.0.0:43367 every 8 connection(s)
I20260927 23:31:13.071871 887 acceptor_pool.cc:254] collecting diagnostics on the listening RPC socket 0.0.0.0:43367 every 8 connection(s)
[ OK ] Parameters/TestRpc.TestCallId/SSL_TCP (90 ms)
[----------] 20 tests from Parameters/TestRpc (37698 ms total)
[----------] Global test environment tear-down
[==========] 21 tests from 2 test suites ran. (37706 ms total)
[ PASSED ] 20 tests.
[ FAILED ] 1 test, listed below:
[ FAILED ] Parameters/TestRpc.TestCallWithChainCertAndRootCA/SSL_TCP, where GetParam() = (true, false)
1 FAILED TEST