Diagnosed failure
Parameters/TestRpc.TestCallWithChainCertAndChainCA/SSL_UnixSocket: /data0/somelongdirectorytoavoidrpathissues/src/kudu/src/kudu/rpc/rpc-test.cc:270: Failure
Failed
Bad status: Runtime error: could not verify certificate chain (error with cert: subject=CN = localhost, ST = sadfjas, C = AS, emailAddress = sdflkdsajf, O = lskdfjlsad, OU = sldfkja, issuer=C = AS, ST = ASDfkjdhf, L = lskdjf, O = saldfja, OU = skdjf, CN = localhost, emailAddress = sadjflkadsj): : certificate has expired
Google Test trace:
/data0/somelongdirectorytoavoidrpathissues/src/kudu/src/kudu/rpc/rpc-test.cc:267: Connecting to unix:/tmp/dist-test-taskzuEkni/test-tmp/rpc-test-0ad51f37f62c4b178d08343f132a5db5.sock
I20260927 18:37:12.405648 16809 test_util.cc:175] -----------------------------------------------
I20260927 18:37:12.405699 16809 test_util.cc:176] Had fatal failures, leaving test files at /tmp/dist-test-taskzuEkni/test-tmp/rpc-test.6.Parameters_TestRpc.TestCallWithChainCertAndChainCA_SSL_UnixSocket.1790534232309923-16809-0
Full log
Note: This is test shard 7 of 8.
[==========] Running 21 tests from 2 test suites.
[----------] Global test environment set-up.
[----------] 20 tests from Parameters/TestRpc
[ RUN ] Parameters/TestRpc.TestMessengerCreateDestroy/SSL_UnixSocket
WARNING: Logging before InitGoogleLogging() is written to STDERR
I20260927 18:37:12.348382 16809 rpc-test.cc:169] started messenger TestCreateDestroy
[ OK ] Parameters/TestRpc.TestMessengerCreateDestroy/SSL_UnixSocket (33 ms)
[ RUN ] Parameters/TestRpc.TestNegotiationDeadlock/SSL_UnixSocket
I20260927 18:37:12.374766 16830 acceptor_pool.cc:254] collecting diagnostics on the listening RPC socket unix:/tmp/dist-test-taskzuEkni/test-tmp/rpc-test-6ec32c7ec1e0443d90938348c58e1dee.sock every 8 connection(s)
I20260927 18:37:12.374776 16829 acceptor_pool.cc:254] collecting diagnostics on the listening RPC socket unix:/tmp/dist-test-taskzuEkni/test-tmp/rpc-test-6ec32c7ec1e0443d90938348c58e1dee.sock every 8 connection(s)
[ OK ] Parameters/TestRpc.TestNegotiationDeadlock/SSL_UnixSocket (35 ms)
[ RUN ] Parameters/TestRpc.TestCallWithChainCertAndChainCA/SSL_UnixSocket
I20260927 18:37:12.399705 16845 acceptor_pool.cc:254] collecting diagnostics on the listening RPC socket unix:/tmp/dist-test-taskzuEkni/test-tmp/rpc-test-0ad51f37f62c4b178d08343f132a5db5.sock every 8 connection(s)
I20260927 18:37:12.399763 16846 acceptor_pool.cc:254] collecting diagnostics on the listening RPC socket unix:/tmp/dist-test-taskzuEkni/test-tmp/rpc-test-0ad51f37f62c4b178d08343f132a5db5.sock every 8 connection(s)
/data0/somelongdirectorytoavoidrpathissues/src/kudu/src/kudu/rpc/rpc-test.cc:270: Failure
Failed
Bad status: Runtime error: could not verify certificate chain (error with cert: subject=CN = localhost, ST = sadfjas, C = AS, emailAddress = sdflkdsajf, O = lskdfjlsad, OU = sldfkja, issuer=C = AS, ST = ASDfkjdhf, L = lskdjf, O = saldfja, OU = skdjf, CN = localhost, emailAddress = sadjflkadsj): : certificate has expired
Google Test trace:
/data0/somelongdirectorytoavoidrpathissues/src/kudu/src/kudu/rpc/rpc-test.cc:267: Connecting to unix:/tmp/dist-test-taskzuEkni/test-tmp/rpc-test-0ad51f37f62c4b178d08343f132a5db5.sock
I20260927 18:37:12.405648 16809 test_util.cc:175] -----------------------------------------------
I20260927 18:37:12.405699 16809 test_util.cc:176] Had fatal failures, leaving test files at /tmp/dist-test-taskzuEkni/test-tmp/rpc-test.6.Parameters_TestRpc.TestCallWithChainCertAndChainCA_SSL_UnixSocket.1790534232309923-16809-0
[ FAILED ] Parameters/TestRpc.TestCallWithChainCertAndChainCA/SSL_UnixSocket, where GetParam() = (true, true) (20 ms)
[ RUN ] Parameters/TestRpc.TestCallWithPasswordProtectedKey/SSL_UnixSocket
I20260927 18:37:12.414631 16870 acceptor_pool.cc:254] collecting diagnostics on the listening RPC socket unix:/tmp/dist-test-taskzuEkni/test-tmp/rpc-test-215d4540b4ba421681f7c925c8acc618.sock every 8 connection(s)
I20260927 18:37:12.414712 16871 acceptor_pool.cc:254] collecting diagnostics on the listening RPC socket unix:/tmp/dist-test-taskzuEkni/test-tmp/rpc-test-215d4540b4ba421681f7c925c8acc618.sock every 8 connection(s)
W20260927 18:37:12.428797 16867 connection.cc:196] Error closing socket: Network error: TlsSocket::Close: Broken pipe
[ OK ] Parameters/TestRpc.TestCallWithPasswordProtectedKey/SSL_UnixSocket (24 ms)
[ RUN ] Parameters/TestRpc.TestCallToBadServer/SSL_UnixSocket
I20260927 18:37:12.446170 16809 rpc-test.cc:394] Status: Network error: Client connection negotiation failed: client connection to 0.0.0.0:0: connect: Connection refused (error 111)
I20260927 18:37:12.446709 16809 rpc-test.cc:394] Status: Network error: Client connection negotiation failed: client connection to 0.0.0.0:0: connect: Connection refused (error 111)
I20260927 18:37:12.447188 16809 rpc-test.cc:394] Status: Network error: Client connection negotiation failed: client connection to 0.0.0.0:0: connect: Connection refused (error 111)
I20260927 18:37:12.447688 16809 rpc-test.cc:394] Status: Network error: Client connection negotiation failed: client connection to 0.0.0.0:0: connect: Connection refused (error 111)
I20260927 18:37:12.448181 16809 rpc-test.cc:394] Status: Network error: Client connection negotiation failed: client connection to 0.0.0.0:0: connect: Connection refused (error 111)
[ OK ] Parameters/TestRpc.TestCallToBadServer/SSL_UnixSocket (18 ms)
[ RUN ] Parameters/TestRpc.TestWrongService/SSL_UnixSocket
I20260927 18:37:12.464284 16905 acceptor_pool.cc:254] collecting diagnostics on the listening RPC socket unix:/tmp/dist-test-taskzuEkni/test-tmp/rpc-test-efb45cdbab9143a69115c4398dfcb212.sock every 8 connection(s)
I20260927 18:37:12.464322 16906 acceptor_pool.cc:254] collecting diagnostics on the listening RPC socket unix:/tmp/dist-test-taskzuEkni/test-tmp/rpc-test-efb45cdbab9143a69115c4398dfcb212.sock every 8 connection(s)
I20260927 18:37:12.484253 16902 messenger.cc:345] service WrongServiceName not registered on TestServer
W20260927 18:37:12.485158 16902 connection.cc:196] Error closing socket: Network error: TlsSocket::Close: Broken pipe
[ OK ] Parameters/TestRpc.TestWrongService/SSL_UnixSocket (37 ms)
[ RUN ] Parameters/TestRpc.TestConnectionKeepalive/SSL_UnixSocket
I20260927 18:37:12.501843 16928 acceptor_pool.cc:254] collecting diagnostics on the listening RPC socket unix:/tmp/dist-test-taskzuEkni/test-tmp/rpc-test-ae8ce887ab8b4575a047b4e15433d9b5.sock every 8 connection(s)
I20260927 18:37:12.501875 16929 acceptor_pool.cc:254] collecting diagnostics on the listening RPC socket unix:/tmp/dist-test-taskzuEkni/test-tmp/rpc-test-ae8ce887ab8b4575a047b4e15433d9b5.sock every 8 connection(s)
I20260927 18:37:12.502151 16809 rpc-test.cc:488] Connecting to unix:/tmp/dist-test-taskzuEkni/test-tmp/rpc-test-ae8ce887ab8b4575a047b4e15433d9b5.sock
W20260927 18:37:12.988516 16941 connection.cc:196] Error closing socket: Network error: TlsSocket::Close: Broken pipe
[ OK ] Parameters/TestRpc.TestConnectionKeepalive/SSL_UnixSocket (1042 ms)
[ RUN ] Parameters/TestRpc.TestClientConnectionMetrics/SSL_UnixSocket
I20260927 18:37:13.568159 16953 acceptor_pool.cc:254] collecting diagnostics on the listening RPC socket unix:/tmp/dist-test-taskzuEkni/test-tmp/rpc-test-af82be45be6d4a7fbc1dca07faacbb7d.sock every 8 connection(s)
I20260927 18:37:13.568185 16954 acceptor_pool.cc:254] collecting diagnostics on the listening RPC socket unix:/tmp/dist-test-taskzuEkni/test-tmp/rpc-test-af82be45be6d4a7fbc1dca07faacbb7d.sock every 8 connection(s)
I20260927 18:37:13.568485 16809 rpc-test.cc:569] Connecting to unix:/tmp/dist-test-taskzuEkni/test-tmp/rpc-test-af82be45be6d4a7fbc1dca07faacbb7d.sock
W20260927 18:37:23.965193 16950 connection.cc:196] Error closing socket: Network error: TlsSocket::Close: Broken pipe
[ OK ] Parameters/TestRpc.TestClientConnectionMetrics/SSL_UnixSocket (10437 ms)
[ RUN ] Parameters/TestRpc.TestCredentialsPolicy/SSL_UnixSocket
I20260927 18:37:23.977005 16976 acceptor_pool.cc:254] collecting diagnostics on the listening RPC socket unix:/tmp/dist-test-taskzuEkni/test-tmp/rpc-test-a59f2610634942bd8779fa82407084e7.sock every 8 connection(s)
I20260927 18:37:23.977049 16977 acceptor_pool.cc:254] collecting diagnostics on the listening RPC socket unix:/tmp/dist-test-taskzuEkni/test-tmp/rpc-test-a59f2610634942bd8779fa82407084e7.sock every 8 connection(s)
I20260927 18:37:23.977381 16809 rpc-test.cc:700] Connecting to unix:/tmp/dist-test-taskzuEkni/test-tmp/rpc-test-a59f2610634942bd8779fa82407084e7.sock
W20260927 18:37:23.996732 16975 connection.cc:196] Error closing socket: Network error: TlsSocket::Close: Broken pipe
W20260927 18:37:24.002619 16975 connection.cc:196] Error closing socket: Network error: TlsSocket::Close: Broken pipe
[ OK ] Parameters/TestRpc.TestCredentialsPolicy/SSL_UnixSocket (37 ms)
[ RUN ] Parameters/TestRpc.TestCallLongerThanKeepalive/SSL_UnixSocket
I20260927 18:37:24.030050 17001 acceptor_pool.cc:254] collecting diagnostics on the listening RPC socket unix:/tmp/dist-test-taskzuEkni/test-tmp/rpc-test-d1f1140df253403c9dc1a4147c87a267.sock every 8 connection(s)
I20260927 18:37:24.030054 17002 acceptor_pool.cc:254] collecting diagnostics on the listening RPC socket unix:/tmp/dist-test-taskzuEkni/test-tmp/rpc-test-d1f1140df253403c9dc1a4147c87a267.sock every 8 connection(s)
I20260927 18:37:24.055830 17005 rpc-test-base.h:222] got call: sleep_micros: 3000000 deferred: true
I20260927 18:37:27.056864 17005 rpcz_store.cc:275] Call kudu.rpc.GenericCalculatorService.Sleep from unix:<unnamed> (request call id 0) took 3001 ms. Trace:
I20260927 18:37:27.057034 17005 rpcz_store.cc:276] 0927 18:37:24.055719 (+ 0us) service_pool.cc:170] Inserting onto call queue
0927 18:37:24.055806 (+ 87us) service_pool.cc:227] Handling call
0927 18:37:27.056841 (+3001035us) inbound_call.cc:173] Queueing success response
Metrics: {}
[ OK ] Parameters/TestRpc.TestCallLongerThanKeepalive/SSL_UnixSocket (3056 ms)
[ RUN ] Parameters/TestRpc.TestRpcSidecar/SSL_UnixSocket
I20260927 18:37:27.080407 17026 acceptor_pool.cc:254] collecting diagnostics on the listening RPC socket unix:/tmp/dist-test-taskzuEkni/test-tmp/rpc-test-1f23bc11eaa64917af0fa22ce43015ec.sock every 8 connection(s)
I20260927 18:37:27.080554 17027 acceptor_pool.cc:254] collecting diagnostics on the listening RPC socket unix:/tmp/dist-test-taskzuEkni/test-tmp/rpc-test-1f23bc11eaa64917af0fa22ce43015ec.sock every 8 connection(s)
W20260927 18:37:27.143925 17023 connection.cc:196] Error closing socket: Network error: TlsSocket::Close: Broken pipe
[ OK ] Parameters/TestRpc.TestRpcSidecar/SSL_UnixSocket (85 ms)
[ RUN ] Parameters/TestRpc.TestRpcSidecarLimits/SSL_UnixSocket
I20260927 18:37:28.847718 17051 acceptor_pool.cc:254] collecting diagnostics on the listening RPC socket unix:/tmp/dist-test-taskzuEkni/test-tmp/rpc-test-22c356b014514e2bb181a819f731c8dc.sock every 8 connection(s)
I20260927 18:37:28.847766 17052 acceptor_pool.cc:254] collecting diagnostics on the listening RPC socket unix:/tmp/dist-test-taskzuEkni/test-tmp/rpc-test-22c356b014514e2bb181a819f731c8dc.sock every 8 connection(s)
W20260927 18:37:28.874202 16809 serialization.cc:72] Serialized kudu.rpc_test.PushStringsRequestPB (2147483654 bytes) is larger than the maximum configured RPC message size (52428800 bytes). Sending anyway, but peer may reject the data.
W20260927 18:37:28.878940 17048 connection.cc:535] server connection from unix:<unnamed> recv error: Network error: RPC frame had a length of 2147483714, but we only support messages up to 52428800 bytes long.
W20260927 18:37:28.879041 17048 connection.cc:158] shutting down server connection from unix:<unnamed> with pending inbound data: 4/2147483714 bytes received; last active 0 ns ago: status Network error: RPC frame had a length of 2147483714, but we only support messages up to 52428800 bytes long.
W20260927 18:37:28.879311 17064 connection.cc:196] Error closing socket: Network error: TlsSocket::Close: Broken pipe
I20260927 18:37:28.894778 17076 acceptor_pool.cc:254] collecting diagnostics on the listening RPC socket unix:/tmp/dist-test-taskzuEkni/test-tmp/rpc-test-22c356b014514e2bb181a819f731c8dc.sock every 8 connection(s)
I20260927 18:37:28.894796 17077 acceptor_pool.cc:254] collecting diagnostics on the listening RPC socket unix:/tmp/dist-test-taskzuEkni/test-tmp/rpc-test-22c356b014514e2bb181a819f731c8dc.sock every 8 connection(s)
W20260927 18:37:33.760887 17073 connection.cc:577] server connection from unix:<unnamed>: received bad data: 'Corruption: Invalid packet: message had a length of 2147483710, but we only support messages up to 2147483647 bytes
'
W20260927 18:37:33.761364 17089 connection.cc:196] Error closing socket: Network error: TlsSocket::Close: Broken pipe
[ OK ] Parameters/TestRpc.TestRpcSidecarLimits/SSL_UnixSocket (6618 ms)
[ RUN ] Parameters/TestRpc.TestCallTimeoutDoesntAffectNegotiation/SSL_UnixSocket
I20260927 18:37:33.779857 17101 acceptor_pool.cc:254] collecting diagnostics on the listening RPC socket unix:/tmp/dist-test-taskzuEkni/test-tmp/rpc-test-4f7e57b27d134fbba968b8cf49b43fac.sock every 8 connection(s)
I20260927 18:37:33.779973 17102 acceptor_pool.cc:254] collecting diagnostics on the listening RPC socket unix:/tmp/dist-test-taskzuEkni/test-tmp/rpc-test-4f7e57b27d134fbba968b8cf49b43fac.sock every 8 connection(s)
W20260927 18:37:33.796644 17095 negotiation.cc:266] Injecting 500ms delay in negotiation
I20260927 18:37:33.846958 16809 rpc-test-base.h:595] status: Timed out: connection negotiation to unix:/tmp/dist-test-taskzuEkni/test-tmp/rpc-test-4f7e57b27d134fbba968b8cf49b43fac.sock for RPC Sleep timed out after 0.050s (ON_OUTBOUND_QUEUE), seconds elapsed: 0.0508506
W20260927 18:37:34.302803 17098 connection.cc:196] Error closing socket: Network error: TlsSocket::Close: Broken pipe
[ OK ] Parameters/TestRpc.TestCallTimeoutDoesntAffectNegotiation/SSL_UnixSocket (540 ms)
[ RUN ] Parameters/TestRpc.TestRpcHandlerLatencyMetric/SSL_UnixSocket
I20260927 18:37:34.352092 17127 acceptor_pool.cc:254] collecting diagnostics on the listening RPC socket unix:/tmp/dist-test-taskzuEkni/test-tmp/rpc-test-198a6a932f4c40af927b484ec1f843a3.sock every 8 connection(s)
I20260927 18:37:34.352092 17126 acceptor_pool.cc:254] collecting diagnostics on the listening RPC socket unix:/tmp/dist-test-taskzuEkni/test-tmp/rpc-test-198a6a932f4c40af927b484ec1f843a3.sock every 8 connection(s)
I20260927 18:37:34.394533 16809 rpc-test.cc:1236] Sleep() min lat: 20407
I20260927 18:37:34.394605 16809 rpc-test.cc:1237] Sleep() mean lat: 20407
I20260927 18:37:34.394634 16809 rpc-test.cc:1238] Sleep() max lat: 20407
I20260927 18:37:34.394647 16809 rpc-test.cc:1239] Sleep() #calls: 1
[ OK ] Parameters/TestRpc.TestRpcHandlerLatencyMetric/SSL_UnixSocket (94 ms)
[ RUN ] Parameters/TestRpc.TimedOutOnResponseMetricServiceQueue/SSL_UnixSocket
I20260927 18:37:34.406324 17152 acceptor_pool.cc:254] collecting diagnostics on the listening RPC socket unix:/tmp/dist-test-taskzuEkni/test-tmp/rpc-test-4678c46479514a6c8c3a6aaa61ef1126.sock every 8 connection(s)
I20260927 18:37:34.406379 17153 acceptor_pool.cc:254] collecting diagnostics on the listening RPC socket unix:/tmp/dist-test-taskzuEkni/test-tmp/rpc-test-4678c46479514a6c8c3a6aaa61ef1126.sock every 8 connection(s)
W20260927 18:37:34.471419 17154 rpcz_store.cc:267] Call kudu.rpc_test.CalculatorService.Sleep from unix:<unnamed> (request call id 2) took 20 ms (client timeout 20 ms). Trace:
W20260927 18:37:34.471522 17154 rpcz_store.cc:269] 0927 18:37:34.450967 (+ 0us) service_pool.cc:170] Inserting onto call queue
0927 18:37:34.471333 (+ 20366us) service_pool.cc:214] Skipping call since client already timed out
0927 18:37:34.471357 (+ 24us) inbound_call.cc:173] Queueing failure response
Metrics: {}
W20260927 18:37:34.472355 17149 connection.cc:196] Error closing socket: Network error: TlsSocket::Close: Broken pipe
[ OK ] Parameters/TestRpc.TimedOutOnResponseMetricServiceQueue/SSL_UnixSocket (75 ms)
[ RUN ] Parameters/TestRpc.RpcPendingConnectionsMetric/SSL_UnixSocket
I20260927 18:37:34.475827 17175 acceptor_pool.cc:254] collecting diagnostics on the listening RPC socket 0.0.0.0:35279 every 8 connection(s)
I20260927 18:37:34.475898 17176 acceptor_pool.cc:254] collecting diagnostics on the listening RPC socket 0.0.0.0:35279 every 8 connection(s)
W20260927 18:37:34.477028 17171 negotiation.cc:337] Failed RPC negotiation. Trace:
0927 18:37:34.476647 (+ 0us) reactor.cc:625] Submitting negotiation task for server connection from 127.0.0.1:34758 (local address 127.0.0.1:35279)
0927 18:37:34.476730 (+ 83us) server_negotiation.cc:206] Beginning negotiation
0927 18:37:34.476733 (+ 3us) server_negotiation.cc:399] Waiting for connection header
0927 18:37:34.476831 (+ 98us) negotiation.cc:327] Negotiation complete: Network error: Server connection negotiation failed: server connection from 127.0.0.1:34758: BlockingRecv error: recv got EOF from 127.0.0.1:34758 (error 108)
Metrics: {"server-negotiator.queue_time_us":22}
[ OK ] Parameters/TestRpc.RpcPendingConnectionsMetric/SSL_UnixSocket (14 ms)
[ RUN ] Parameters/TestRpc.TestRpcContextClientDeadline/SSL_UnixSocket
I20260927 18:37:34.511590 17191 acceptor_pool.cc:254] collecting diagnostics on the listening RPC socket unix:/tmp/dist-test-taskzuEkni/test-tmp/rpc-test-2c9239b2381249eb8cf8bcf2baba988c.sock every 8 connection(s)
I20260927 18:37:34.511621 17192 acceptor_pool.cc:254] collecting diagnostics on the listening RPC socket unix:/tmp/dist-test-taskzuEkni/test-tmp/rpc-test-2c9239b2381249eb8cf8bcf2baba988c.sock every 8 connection(s)
W20260927 18:37:34.556144 17188 connection.cc:196] Error closing socket: Network error: TlsSocket::Close: Broken pipe
[ OK ] Parameters/TestRpc.TestRpcContextClientDeadline/SSL_UnixSocket (69 ms)
[ RUN ] Parameters/TestRpc.TestApplicationFeatureFlagUnsupportedServer/SSL_UnixSocket
I20260927 18:37:34.564180 17216 acceptor_pool.cc:254] collecting diagnostics on the listening RPC socket unix:/tmp/dist-test-taskzuEkni/test-tmp/rpc-test-c709708ec29741349ac08f0545d832a7.sock every 8 connection(s)
I20260927 18:37:34.564198 17217 acceptor_pool.cc:254] collecting diagnostics on the listening RPC socket unix:/tmp/dist-test-taskzuEkni/test-tmp/rpc-test-c709708ec29741349ac08f0545d832a7.sock every 8 connection(s)
W20260927 18:37:34.580062 17213 connection.cc:196] Error closing socket: Network error: TlsSocket::Close: Broken pipe
[ OK ] Parameters/TestRpc.TestApplicationFeatureFlagUnsupportedServer/SSL_UnixSocket (23 ms)
[ RUN ] Parameters/TestRpc.TestCancellationAsync/SSL_UnixSocket
I20260927 18:37:34.599565 17241 acceptor_pool.cc:254] collecting diagnostics on the listening RPC socket unix:/tmp/dist-test-taskzuEkni/test-tmp/rpc-test-71cda13196c74622b2ac7d04783abd6a.sock every 8 connection(s)
I20260927 18:37:34.599597 17242 acceptor_pool.cc:254] collecting diagnostics on the listening RPC socket unix:/tmp/dist-test-taskzuEkni/test-tmp/rpc-test-71cda13196c74622b2ac7d04783abd6a.sock every 8 connection(s)
I20260927 18:37:34.599963 16809 rpc-test.cc:1716] Connecting to unix:/tmp/dist-test-taskzuEkni/test-tmp/rpc-test-71cda13196c74622b2ac7d04783abd6a.sock
I20260927 18:37:34.612803 16809 test_util.cc:268] Using random seed: 1043616064
I20260927 18:37:34.631934 17245 rpc-test-base.h:240] got call: sleep_micros: 500 pattern: 4294967295 num_repetitions: 2097152 sidecar_idx: 0
I20260927 18:37:34.649139 17244 rpc-test-base.h:240] got call: sleep_micros: 500 pattern: 4294967295 num_repetitions: 2097152 sidecar_idx: 0
I20260927 18:37:34.665494 17245 rpc-test-base.h:240] got call: sleep_micros: 500 pattern: 4294967295 num_repetitions: 2097152 sidecar_idx: 0
I20260927 18:37:34.681865 17244 rpc-test-base.h:240] got call: sleep_micros: 500 pattern: 4294967295 num_repetitions: 2097152 sidecar_idx: 0
I20260927 18:37:34.698616 17245 rpc-test-base.h:240] got call: sleep_micros: 500 pattern: 4294967295 num_repetitions: 2097152 sidecar_idx: 0
I20260927 18:37:34.714967 17244 rpc-test-base.h:240] got call: sleep_micros: 500 pattern: 4294967295 num_repetitions: 2097152 sidecar_idx: 0
I20260927 18:37:34.731247 17245 rpc-test-base.h:240] got call: sleep_micros: 500 pattern: 4294967295 num_repetitions: 2097152 sidecar_idx: 0
W20260927 18:37:34.732923 17238 connection.cc:196] Error closing socket: Network error: TlsSocket::Close: Broken pipe
W20260927 18:37:34.741503 17238 connection.cc:441] server connection from unix:<unnamed> torn down before Call kudu.rpc.GenericCalculatorService.SleepWithSidecar from unix:<unnamed> (request call id 8) could send its response
W20260927 18:37:34.753623 17238 connection.cc:441] server connection from unix:<unnamed> torn down before Call kudu.rpc.GenericCalculatorService.SleepWithSidecar from unix:<unnamed> (request call id 9) could send its response
[ OK ] Parameters/TestRpc.TestCancellationAsync/SSL_UnixSocket (173 ms)
[ RUN ] Parameters/TestRpc.TestPerformanceBySocketType/SSL_UnixSocket
I20260927 18:37:34.770529 17267 acceptor_pool.cc:254] collecting diagnostics on the listening RPC socket unix:/tmp/dist-test-taskzuEkni/test-tmp/rpc-test-bd5ea9efa4784506bd33a86c1cda68cb.sock every 8 connection(s)
I20260927 18:37:34.770531 17266 acceptor_pool.cc:254] collecting diagnostics on the listening RPC socket unix:/tmp/dist-test-taskzuEkni/test-tmp/rpc-test-bd5ea9efa4784506bd33a86c1cda68cb.sock every 8 connection(s)
I20260927 18:37:34.770874 16809 rpc-test.cc:1846] Connecting to unix:/tmp/dist-test-taskzuEkni/test-tmp/rpc-test-bd5ea9efa4784506bd33a86c1cda68cb.sock
I20260927 18:37:36.307605 16809 rpc-test.cc:1859] Sending 1024MB via ssl-enabled unix socket: real 1.529s user 1.747s sys 1.034s
I20260927 18:37:37.949436 16809 rpc-test.cc:1859] Sending 1024MB via ssl-enabled unix socket: real 1.642s user 2.008s sys 0.956s
I20260927 18:37:39.601963 16809 rpc-test.cc:1859] Sending 1024MB via ssl-enabled unix socket: real 1.652s user 2.089s sys 0.906s
I20260927 18:37:41.211398 16809 rpc-test.cc:1859] Sending 1024MB via ssl-enabled unix socket: real 1.609s user 1.982s sys 0.935s
I20260927 18:37:42.856678 16809 rpc-test.cc:1859] Sending 1024MB via ssl-enabled unix socket: real 1.645s user 2.031s sys 0.952s
W20260927 18:37:42.857713 17263 connection.cc:196] Error closing socket: Network error: TlsSocket::Close: Broken pipe
[ OK ] Parameters/TestRpc.TestPerformanceBySocketType/SSL_UnixSocket (8104 ms)
[----------] 20 tests from Parameters/TestRpc (30543 ms total)
[----------] 1 test from Parameters/TestRpcSocketTxRxQueue
[ RUN ] Parameters/TestRpcSocketTxRxQueue.AcceptorRxQueueSizeMetric/0
I20260927 18:37:42.862771 17292 acceptor_pool.cc:254] collecting diagnostics on the listening RPC socket 0.0.0.0:37609 every 1 connection(s)
I20260927 18:37:42.862811 17291 acceptor_pool.cc:254] collecting diagnostics on the listening RPC socket 0.0.0.0:37609 every 1 connection(s)
W20260927 18:37:42.863719 17287 negotiation.cc:337] Failed RPC negotiation. Trace:
0927 18:37:42.863391 (+ 0us) reactor.cc:625] Submitting negotiation task for server connection from 127.0.0.1:45918 (local address 127.0.0.1:37609)
0927 18:37:42.863526 (+ 135us) server_negotiation.cc:206] Beginning negotiation
0927 18:37:42.863535 (+ 9us) server_negotiation.cc:399] Waiting for connection header
0927 18:37:42.863649 (+ 114us) negotiation.cc:327] Negotiation complete: Network error: Server connection negotiation failed: server connection from 127.0.0.1:45918: BlockingRecv error: recv got EOF from 127.0.0.1:45918 (error 108)
Metrics: {"server-negotiator.queue_time_us":62}
[ OK ] Parameters/TestRpcSocketTxRxQueue.AcceptorRxQueueSizeMetric/0 (5 ms)
[----------] 1 test from Parameters/TestRpcSocketTxRxQueue (5 ms total)
[----------] Global test environment tear-down
[==========] 21 tests from 2 test suites ran. (30549 ms total)
[ PASSED ] 20 tests.
[ FAILED ] 1 test, listed below:
[ FAILED ] Parameters/TestRpc.TestCallWithChainCertAndChainCA/SSL_UnixSocket, where GetParam() = (true, true)
1 FAILED TEST