Diagnosed failure

Parameters/TestRpc.TestCallWithChainCertAndChainCA/SSL_UnixSocket: /data0/somelongdirectorytoavoidrpathissues/src/kudu/src/kudu/rpc/rpc-test.cc:270: Failure
Failed
Bad status: Runtime error: could not verify certificate chain (error with cert: subject=CN = localhost, ST = sadfjas, C = AS, emailAddress = sdflkdsajf, O = lskdfjlsad, OU = sldfkja, issuer=C = AS, ST = ASDfkjdhf, L = lskdjf, O = saldfja, OU = skdjf, CN = localhost, emailAddress = sadjflkadsj): : certificate has expired
Google Test trace:
/data0/somelongdirectorytoavoidrpathissues/src/kudu/src/kudu/rpc/rpc-test.cc:267: Connecting to unix:/tmp/dist-test-taskd8rs9A/test-tmp/rpc-test-b885dad5df9e4e479cece89de895b258.sock
I20260929 11:24:56.901275   765 test_util.cc:175] -----------------------------------------------
I20260929 11:24:56.901381   765 test_util.cc:176] Had fatal failures, leaving test files at /tmp/dist-test-taskd8rs9A/test-tmp/rpc-test.6.Parameters_TestRpc.TestCallWithChainCertAndChainCA_SSL_UnixSocket.1790681096780507-765-0

Full log

Note: This is test shard 7 of 8.
[==========] Running 21 tests from 2 test suites.
[----------] Global test environment set-up.
[----------] 20 tests from Parameters/TestRpc
[ RUN      ] Parameters/TestRpc.TestMessengerCreateDestroy/SSL_UnixSocket
WARNING: Logging before InitGoogleLogging() is written to STDERR
I20260929 11:24:56.823633   765 rpc-test.cc:169] started messenger TestCreateDestroy
[       OK ] Parameters/TestRpc.TestMessengerCreateDestroy/SSL_UnixSocket (26 ms)
[ RUN      ] Parameters/TestRpc.TestNegotiationDeadlock/SSL_UnixSocket
I20260929 11:24:56.838826   785 acceptor_pool.cc:254] collecting diagnostics on the listening RPC socket unix:/tmp/dist-test-taskd8rs9A/test-tmp/rpc-test-04cc6caa18af4285a8c03e6c53816aa0.sock every 8 connection(s)
I20260929 11:24:56.839166   786 acceptor_pool.cc:254] collecting diagnostics on the listening RPC socket unix:/tmp/dist-test-taskd8rs9A/test-tmp/rpc-test-04cc6caa18af4285a8c03e6c53816aa0.sock every 8 connection(s)
[       OK ] Parameters/TestRpc.TestNegotiationDeadlock/SSL_UnixSocket (33 ms)
[ RUN      ] Parameters/TestRpc.TestCallWithChainCertAndChainCA/SSL_UnixSocket
I20260929 11:24:56.888847   801 acceptor_pool.cc:254] collecting diagnostics on the listening RPC socket unix:/tmp/dist-test-taskd8rs9A/test-tmp/rpc-test-b885dad5df9e4e479cece89de895b258.sock every 8 connection(s)
I20260929 11:24:56.889824   802 acceptor_pool.cc:254] collecting diagnostics on the listening RPC socket unix:/tmp/dist-test-taskd8rs9A/test-tmp/rpc-test-b885dad5df9e4e479cece89de895b258.sock every 8 connection(s)
/data0/somelongdirectorytoavoidrpathissues/src/kudu/src/kudu/rpc/rpc-test.cc:270: Failure
Failed
Bad status: Runtime error: could not verify certificate chain (error with cert: subject=CN = localhost, ST = sadfjas, C = AS, emailAddress = sdflkdsajf, O = lskdfjlsad, OU = sldfkja, issuer=C = AS, ST = ASDfkjdhf, L = lskdjf, O = saldfja, OU = skdjf, CN = localhost, emailAddress = sadjflkadsj): : certificate has expired
Google Test trace:
/data0/somelongdirectorytoavoidrpathissues/src/kudu/src/kudu/rpc/rpc-test.cc:267: Connecting to unix:/tmp/dist-test-taskd8rs9A/test-tmp/rpc-test-b885dad5df9e4e479cece89de895b258.sock
I20260929 11:24:56.901275   765 test_util.cc:175] -----------------------------------------------
I20260929 11:24:56.901381   765 test_util.cc:176] Had fatal failures, leaving test files at /tmp/dist-test-taskd8rs9A/test-tmp/rpc-test.6.Parameters_TestRpc.TestCallWithChainCertAndChainCA_SSL_UnixSocket.1790681096780507-765-0
[  FAILED  ] Parameters/TestRpc.TestCallWithChainCertAndChainCA/SSL_UnixSocket, where GetParam() = (true, true) (41 ms)
[ RUN      ] Parameters/TestRpc.TestCallWithPasswordProtectedKey/SSL_UnixSocket
I20260929 11:24:56.928700   826 acceptor_pool.cc:254] collecting diagnostics on the listening RPC socket unix:/tmp/dist-test-taskd8rs9A/test-tmp/rpc-test-3b0e4544be4741a3ab578354207fd415.sock every 8 connection(s)
I20260929 11:24:56.928962   827 acceptor_pool.cc:254] collecting diagnostics on the listening RPC socket unix:/tmp/dist-test-taskd8rs9A/test-tmp/rpc-test-3b0e4544be4741a3ab578354207fd415.sock every 8 connection(s)
W20260929 11:24:56.963568   823 connection.cc:196] Error closing socket: Network error: TlsSocket::Close: Broken pipe
[       OK ] Parameters/TestRpc.TestCallWithPasswordProtectedKey/SSL_UnixSocket (66 ms)
[ RUN      ] Parameters/TestRpc.TestCallToBadServer/SSL_UnixSocket
I20260929 11:24:56.985569   765 rpc-test.cc:394] Status: Network error: Client connection negotiation failed: client connection to 0.0.0.0:0: connect: Connection refused (error 111)
I20260929 11:24:56.986255   765 rpc-test.cc:394] Status: Network error: Client connection negotiation failed: client connection to 0.0.0.0:0: connect: Connection refused (error 111)
I20260929 11:24:56.986985   765 rpc-test.cc:394] Status: Network error: Client connection negotiation failed: client connection to 0.0.0.0:0: connect: Connection refused (error 111)
I20260929 11:24:56.987658   765 rpc-test.cc:394] Status: Network error: Client connection negotiation failed: client connection to 0.0.0.0:0: connect: Connection refused (error 111)
I20260929 11:24:56.988211   765 rpc-test.cc:394] Status: Network error: Client connection negotiation failed: client connection to 0.0.0.0:0: connect: Connection refused (error 111)
[       OK ] Parameters/TestRpc.TestCallToBadServer/SSL_UnixSocket (22 ms)
[ RUN      ] Parameters/TestRpc.TestWrongService/SSL_UnixSocket
I20260929 11:24:57.016450   861 acceptor_pool.cc:254] collecting diagnostics on the listening RPC socket unix:/tmp/dist-test-taskd8rs9A/test-tmp/rpc-test-ae8efb3fc3ef4bc884bdad7d4ade0a12.sock every 8 connection(s)
I20260929 11:24:57.016706   862 acceptor_pool.cc:254] collecting diagnostics on the listening RPC socket unix:/tmp/dist-test-taskd8rs9A/test-tmp/rpc-test-ae8efb3fc3ef4bc884bdad7d4ade0a12.sock every 8 connection(s)
I20260929 11:24:57.052222   858 messenger.cc:345] service WrongServiceName not registered on TestServer
W20260929 11:24:57.053690   858 connection.cc:196] Error closing socket: Network error: TlsSocket::Close: Broken pipe
[       OK ] Parameters/TestRpc.TestWrongService/SSL_UnixSocket (67 ms)
[ RUN      ] Parameters/TestRpc.TestConnectionKeepalive/SSL_UnixSocket
I20260929 11:24:57.076355   884 acceptor_pool.cc:254] collecting diagnostics on the listening RPC socket unix:/tmp/dist-test-taskd8rs9A/test-tmp/rpc-test-994033143ec6446b877c89affe2cdfb1.sock every 8 connection(s)
I20260929 11:24:57.076612   885 acceptor_pool.cc:254] collecting diagnostics on the listening RPC socket unix:/tmp/dist-test-taskd8rs9A/test-tmp/rpc-test-994033143ec6446b877c89affe2cdfb1.sock every 8 connection(s)
I20260929 11:24:57.077576   765 rpc-test.cc:488] Connecting to unix:/tmp/dist-test-taskd8rs9A/test-tmp/rpc-test-994033143ec6446b877c89affe2cdfb1.sock
W20260929 11:24:57.560923   897 connection.cc:196] Error closing socket: Network error: TlsSocket::Close: Broken pipe
[       OK ] Parameters/TestRpc.TestConnectionKeepalive/SSL_UnixSocket (1056 ms)
[ RUN      ] Parameters/TestRpc.TestClientConnectionMetrics/SSL_UnixSocket
I20260929 11:24:58.145731   909 acceptor_pool.cc:254] collecting diagnostics on the listening RPC socket unix:/tmp/dist-test-taskd8rs9A/test-tmp/rpc-test-0faad44b642f4ed0a28b4b4bd8459878.sock every 8 connection(s)
I20260929 11:24:58.146034   910 acceptor_pool.cc:254] collecting diagnostics on the listening RPC socket unix:/tmp/dist-test-taskd8rs9A/test-tmp/rpc-test-0faad44b642f4ed0a28b4b4bd8459878.sock every 8 connection(s)
I20260929 11:24:58.147013   765 rpc-test.cc:569] Connecting to unix:/tmp/dist-test-taskd8rs9A/test-tmp/rpc-test-0faad44b642f4ed0a28b4b4bd8459878.sock
W20260929 11:25:19.754351   906 connection.cc:196] Error closing socket: Network error: TlsSocket::Close: Broken pipe
[       OK ] Parameters/TestRpc.TestClientConnectionMetrics/SSL_UnixSocket (21647 ms)
[ RUN      ] Parameters/TestRpc.TestCredentialsPolicy/SSL_UnixSocket
I20260929 11:25:19.778311   932 acceptor_pool.cc:254] collecting diagnostics on the listening RPC socket unix:/tmp/dist-test-taskd8rs9A/test-tmp/rpc-test-cf9ce7b0389e413f82c1a1ef1bba96fd.sock every 8 connection(s)
I20260929 11:25:19.778563   933 acceptor_pool.cc:254] collecting diagnostics on the listening RPC socket unix:/tmp/dist-test-taskd8rs9A/test-tmp/rpc-test-cf9ce7b0389e413f82c1a1ef1bba96fd.sock every 8 connection(s)
I20260929 11:25:19.779582   765 rpc-test.cc:700] Connecting to unix:/tmp/dist-test-taskd8rs9A/test-tmp/rpc-test-cf9ce7b0389e413f82c1a1ef1bba96fd.sock
W20260929 11:25:19.806007   931 connection.cc:196] Error closing socket: Network error: TlsSocket::Close: Broken pipe
W20260929 11:25:19.814173   931 connection.cc:196] Error closing socket: Network error: TlsSocket::Close: Broken pipe
[       OK ] Parameters/TestRpc.TestCredentialsPolicy/SSL_UnixSocket (55 ms)
[ RUN      ] Parameters/TestRpc.TestCallLongerThanKeepalive/SSL_UnixSocket
I20260929 11:25:19.827687   957 acceptor_pool.cc:254] collecting diagnostics on the listening RPC socket unix:/tmp/dist-test-taskd8rs9A/test-tmp/rpc-test-d91e518c62a2493db2c75f72a1d6dcdd.sock every 8 connection(s)
I20260929 11:25:19.827939   958 acceptor_pool.cc:254] collecting diagnostics on the listening RPC socket unix:/tmp/dist-test-taskd8rs9A/test-tmp/rpc-test-d91e518c62a2493db2c75f72a1d6dcdd.sock every 8 connection(s)
I20260929 11:25:19.842859   961 rpc-test-base.h:222] got call: sleep_micros: 3000000 deferred: true
I20260929 11:25:22.844566   961 rpcz_store.cc:275] Call kudu.rpc.GenericCalculatorService.Sleep from unix:<unnamed> (request call id 0) took 3001 ms. Trace:
I20260929 11:25:22.844769   961 rpcz_store.cc:276] 0929 11:25:19.842757 (+     0us) service_pool.cc:170] Inserting onto call queue
0929 11:25:19.842819 (+    62us) service_pool.cc:227] Handling call
0929 11:25:22.844508 (+3001689us) inbound_call.cc:173] Queueing success response
Metrics: {}
W20260929 11:25:22.847280   954 connection.cc:196] Error closing socket: Network error: TlsSocket::Close: Broken pipe
[       OK ] Parameters/TestRpc.TestCallLongerThanKeepalive/SSL_UnixSocket (3034 ms)
[ RUN      ] Parameters/TestRpc.TestRpcSidecar/SSL_UnixSocket
I20260929 11:25:22.878237   982 acceptor_pool.cc:254] collecting diagnostics on the listening RPC socket unix:/tmp/dist-test-taskd8rs9A/test-tmp/rpc-test-6832fb7d522d4216ba6e815802e8cd40.sock every 8 connection(s)
I20260929 11:25:22.878509   983 acceptor_pool.cc:254] collecting diagnostics on the listening RPC socket unix:/tmp/dist-test-taskd8rs9A/test-tmp/rpc-test-6832fb7d522d4216ba6e815802e8cd40.sock every 8 connection(s)
W20260929 11:25:22.996037   979 connection.cc:196] Error closing socket: Network error: TlsSocket::Close: Broken pipe
[       OK ] Parameters/TestRpc.TestRpcSidecar/SSL_UnixSocket (148 ms)
[ RUN      ] Parameters/TestRpc.TestRpcSidecarLimits/SSL_UnixSocket
I20260929 11:25:25.164398  1007 acceptor_pool.cc:254] collecting diagnostics on the listening RPC socket unix:/tmp/dist-test-taskd8rs9A/test-tmp/rpc-test-db3feb3345a54831acd6e2931fe435f4.sock every 8 connection(s)
I20260929 11:25:25.164664  1008 acceptor_pool.cc:254] collecting diagnostics on the listening RPC socket unix:/tmp/dist-test-taskd8rs9A/test-tmp/rpc-test-db3feb3345a54831acd6e2931fe435f4.sock every 8 connection(s)
W20260929 11:25:25.186532   765 serialization.cc:72] Serialized kudu.rpc_test.PushStringsRequestPB (2147483654 bytes) is larger than the maximum configured RPC message size (52428800 bytes). Sending anyway, but peer may reject the data.
W20260929 11:25:25.192462  1004 connection.cc:535] server connection from unix:<unnamed> recv error: Network error: RPC frame had a length of 2147483714, but we only support messages up to 52428800 bytes long.
W20260929 11:25:25.192608  1004 connection.cc:158] shutting down server connection from unix:<unnamed> with pending inbound data: 4/2147483714 bytes received; last active 0 ns ago: status Network error: RPC frame had a length of 2147483714, but we only support messages up to 52428800 bytes long.
W20260929 11:25:25.193161  1020 connection.cc:196] Error closing socket: Network error: TlsSocket::Close: Broken pipe
I20260929 11:25:25.212653  1032 acceptor_pool.cc:254] collecting diagnostics on the listening RPC socket unix:/tmp/dist-test-taskd8rs9A/test-tmp/rpc-test-db3feb3345a54831acd6e2931fe435f4.sock every 8 connection(s)
I20260929 11:25:25.212767  1033 acceptor_pool.cc:254] collecting diagnostics on the listening RPC socket unix:/tmp/dist-test-taskd8rs9A/test-tmp/rpc-test-db3feb3345a54831acd6e2931fe435f4.sock every 8 connection(s)
W20260929 11:25:31.178611  1029 connection.cc:577] server connection from unix:<unnamed>: received bad data: 'Corruption: Invalid packet: message had a length of 2147483710, but we only support messages up to 2147483647 bytes
'
W20260929 11:25:31.179315  1045 connection.cc:196] Error closing socket: Network error: TlsSocket::Close: Broken pipe
[       OK ] Parameters/TestRpc.TestRpcSidecarLimits/SSL_UnixSocket (8634 ms)
[ RUN      ] Parameters/TestRpc.TestCallTimeoutDoesntAffectNegotiation/SSL_UnixSocket
I20260929 11:25:31.673908  1057 acceptor_pool.cc:254] collecting diagnostics on the listening RPC socket unix:/tmp/dist-test-taskd8rs9A/test-tmp/rpc-test-b7ddff24cab640088dd798261fad1335.sock every 8 connection(s)
I20260929 11:25:31.674286  1058 acceptor_pool.cc:254] collecting diagnostics on the listening RPC socket unix:/tmp/dist-test-taskd8rs9A/test-tmp/rpc-test-b7ddff24cab640088dd798261fad1335.sock every 8 connection(s)
W20260929 11:25:31.694555  1053 negotiation.cc:266] Injecting 500ms delay in negotiation
I20260929 11:25:31.744863   765 rpc-test-base.h:595] status: Timed out: connection negotiation to unix:/tmp/dist-test-taskd8rs9A/test-tmp/rpc-test-b7ddff24cab640088dd798261fad1335.sock for RPC Sleep timed out after 0.050s (ON_OUTBOUND_QUEUE), seconds elapsed: 0.0509671
W20260929 11:25:32.201938  1054 connection.cc:196] Error closing socket: Network error: TlsSocket::Close: Broken pipe
[       OK ] Parameters/TestRpc.TestCallTimeoutDoesntAffectNegotiation/SSL_UnixSocket (570 ms)
[ RUN      ] Parameters/TestRpc.TestRpcHandlerLatencyMetric/SSL_UnixSocket
I20260929 11:25:32.225030  1082 acceptor_pool.cc:254] collecting diagnostics on the listening RPC socket unix:/tmp/dist-test-taskd8rs9A/test-tmp/rpc-test-7188a8f1fa23435ca036f0b169cd333d.sock every 8 connection(s)
I20260929 11:25:32.225234  1083 acceptor_pool.cc:254] collecting diagnostics on the listening RPC socket unix:/tmp/dist-test-taskd8rs9A/test-tmp/rpc-test-7188a8f1fa23435ca036f0b169cd333d.sock every 8 connection(s)
I20260929 11:25:32.261610   765 rpc-test.cc:1236] Sleep() min lat: 20557
I20260929 11:25:32.261708   765 rpc-test.cc:1237] Sleep() mean lat: 20557
I20260929 11:25:32.261749   765 rpc-test.cc:1238] Sleep() max lat: 20557
I20260929 11:25:32.261766   765 rpc-test.cc:1239] Sleep() #calls: 1
W20260929 11:25:32.262854  1079 connection.cc:196] Error closing socket: Network error: TlsSocket::Close: Broken pipe
[       OK ] Parameters/TestRpc.TestRpcHandlerLatencyMetric/SSL_UnixSocket (61 ms)
[ RUN      ] Parameters/TestRpc.TimedOutOnResponseMetricServiceQueue/SSL_UnixSocket
I20260929 11:25:32.277022  1108 acceptor_pool.cc:254] collecting diagnostics on the listening RPC socket unix:/tmp/dist-test-taskd8rs9A/test-tmp/rpc-test-a13ae5fc3570478296839ae06b5d5d6c.sock every 8 connection(s)
I20260929 11:25:32.277292  1109 acceptor_pool.cc:254] collecting diagnostics on the listening RPC socket unix:/tmp/dist-test-taskd8rs9A/test-tmp/rpc-test-a13ae5fc3570478296839ae06b5d5d6c.sock every 8 connection(s)
W20260929 11:25:32.335443  1110 rpcz_store.cc:267] Call kudu.rpc_test.CalculatorService.Sleep from unix:<unnamed> (request call id 2) took 20 ms (client timeout 20 ms). Trace:
W20260929 11:25:32.335565  1110 rpcz_store.cc:269] 0929 11:25:32.315016 (+     0us) service_pool.cc:170] Inserting onto call queue
0929 11:25:32.335390 (+ 20374us) service_pool.cc:214] Skipping call since client already timed out
0929 11:25:32.335426 (+    36us) inbound_call.cc:173] Queueing failure response
Metrics: {}
[       OK ] Parameters/TestRpc.TimedOutOnResponseMetricServiceQueue/SSL_UnixSocket (73 ms)
[ RUN      ] Parameters/TestRpc.RpcPendingConnectionsMetric/SSL_UnixSocket
I20260929 11:25:32.344990  1131 acceptor_pool.cc:254] collecting diagnostics on the listening RPC socket 0.0.0.0:38871 every 8 connection(s)
I20260929 11:25:32.345223  1132 acceptor_pool.cc:254] collecting diagnostics on the listening RPC socket 0.0.0.0:38871 every 8 connection(s)
W20260929 11:25:32.355050  1127 negotiation.cc:337] Failed RPC negotiation. Trace:
0929 11:25:32.354165 (+     0us) reactor.cc:625] Submitting negotiation task for server connection from 127.0.0.1:56698 (local address 127.0.0.1:38871)
0929 11:25:32.354392 (+   227us) server_negotiation.cc:206] Beginning negotiation
0929 11:25:32.354401 (+     9us) server_negotiation.cc:399] Waiting for connection header
0929 11:25:32.354612 (+   211us) negotiation.cc:327] Negotiation complete: Network error: Server connection negotiation failed: server connection from 127.0.0.1:56698: BlockingRecv error: recv got EOF from 127.0.0.1:56698 (error 108)
Metrics: {"server-negotiator.queue_time_us":68}
[       OK ] Parameters/TestRpc.RpcPendingConnectionsMetric/SSL_UnixSocket (27 ms)
[ RUN      ] Parameters/TestRpc.TestRpcContextClientDeadline/SSL_UnixSocket
I20260929 11:25:32.384943  1147 acceptor_pool.cc:254] collecting diagnostics on the listening RPC socket unix:/tmp/dist-test-taskd8rs9A/test-tmp/rpc-test-03921a897914410088375cc922f21f30.sock every 8 connection(s)
I20260929 11:25:32.385159  1148 acceptor_pool.cc:254] collecting diagnostics on the listening RPC socket unix:/tmp/dist-test-taskd8rs9A/test-tmp/rpc-test-03921a897914410088375cc922f21f30.sock every 8 connection(s)
[       OK ] Parameters/TestRpc.TestRpcContextClientDeadline/SSL_UnixSocket (67 ms)
[ RUN      ] Parameters/TestRpc.TestApplicationFeatureFlagUnsupportedServer/SSL_UnixSocket
I20260929 11:25:32.471864  1172 acceptor_pool.cc:254] collecting diagnostics on the listening RPC socket unix:/tmp/dist-test-taskd8rs9A/test-tmp/rpc-test-09d705d10d5b42b988130fc547f249ef.sock every 8 connection(s)
I20260929 11:25:32.472092  1173 acceptor_pool.cc:254] collecting diagnostics on the listening RPC socket unix:/tmp/dist-test-taskd8rs9A/test-tmp/rpc-test-09d705d10d5b42b988130fc547f249ef.sock every 8 connection(s)
[       OK ] Parameters/TestRpc.TestApplicationFeatureFlagUnsupportedServer/SSL_UnixSocket (62 ms)
[ RUN      ] Parameters/TestRpc.TestCancellationAsync/SSL_UnixSocket
I20260929 11:25:32.509229  1197 acceptor_pool.cc:254] collecting diagnostics on the listening RPC socket unix:/tmp/dist-test-taskd8rs9A/test-tmp/rpc-test-7907ef40d06c4e41b4331453080a7db9.sock every 8 connection(s)
I20260929 11:25:32.509486  1198 acceptor_pool.cc:254] collecting diagnostics on the listening RPC socket unix:/tmp/dist-test-taskd8rs9A/test-tmp/rpc-test-7907ef40d06c4e41b4331453080a7db9.sock every 8 connection(s)
I20260929 11:25:32.510262   765 rpc-test.cc:1716] Connecting to unix:/tmp/dist-test-taskd8rs9A/test-tmp/rpc-test-7907ef40d06c4e41b4331453080a7db9.sock
I20260929 11:25:32.523241   765 test_util.cc:268] Using random seed: 1892638423
I20260929 11:25:32.558020  1201 rpc-test-base.h:240] got call: sleep_micros: 500 pattern: 4294967295 num_repetitions: 2097152 sidecar_idx: 0
I20260929 11:25:32.586038  1200 rpc-test-base.h:240] got call: sleep_micros: 500 pattern: 4294967295 num_repetitions: 2097152 sidecar_idx: 0
I20260929 11:25:32.617798  1201 rpc-test-base.h:240] got call: sleep_micros: 500 pattern: 4294967295 num_repetitions: 2097152 sidecar_idx: 0
I20260929 11:25:32.651949  1200 rpc-test-base.h:240] got call: sleep_micros: 500 pattern: 4294967295 num_repetitions: 2097152 sidecar_idx: 0
I20260929 11:25:32.686299  1201 rpc-test-base.h:240] got call: sleep_micros: 500 pattern: 4294967295 num_repetitions: 2097152 sidecar_idx: 0
I20260929 11:25:32.718431  1200 rpc-test-base.h:240] got call: sleep_micros: 500 pattern: 4294967295 num_repetitions: 2097152 sidecar_idx: 0
I20260929 11:25:32.750872  1201 rpc-test-base.h:240] got call: sleep_micros: 500 pattern: 4294967295 num_repetitions: 2097152 sidecar_idx: 0
W20260929 11:25:32.752976  1194 connection.cc:196] Error closing socket: Network error: TlsSocket::Close: Broken pipe
W20260929 11:25:32.766543  1194 connection.cc:441] server connection from unix:<unnamed> torn down before Call kudu.rpc.GenericCalculatorService.SleepWithSidecar from unix:<unnamed> (request call id 8) could send its response
W20260929 11:25:32.789969  1194 connection.cc:441] server connection from unix:<unnamed> torn down before Call kudu.rpc.GenericCalculatorService.SleepWithSidecar from unix:<unnamed> (request call id 9) could send its response
[       OK ] Parameters/TestRpc.TestCancellationAsync/SSL_UnixSocket (294 ms)
[ RUN      ] Parameters/TestRpc.TestPerformanceBySocketType/SSL_UnixSocket
I20260929 11:25:32.817934  1222 acceptor_pool.cc:254] collecting diagnostics on the listening RPC socket unix:/tmp/dist-test-taskd8rs9A/test-tmp/rpc-test-b6da340d27fe47bc93bc1b8ab02a5590.sock every 8 connection(s)
I20260929 11:25:32.818176  1223 acceptor_pool.cc:254] collecting diagnostics on the listening RPC socket unix:/tmp/dist-test-taskd8rs9A/test-tmp/rpc-test-b6da340d27fe47bc93bc1b8ab02a5590.sock every 8 connection(s)
I20260929 11:25:32.819165   765 rpc-test.cc:1846] Connecting to unix:/tmp/dist-test-taskd8rs9A/test-tmp/rpc-test-b6da340d27fe47bc93bc1b8ab02a5590.sock
I20260929 11:25:35.945432   765 rpc-test.cc:1859] Sending 1024MB via ssl-enabled unix socket: real 3.111s	user 3.031s	sys 2.259s
I20260929 11:25:39.016492   765 rpc-test.cc:1859] Sending 1024MB via ssl-enabled unix socket: real 3.071s	user 2.947s	sys 2.234s
I20260929 11:25:42.257784   765 rpc-test.cc:1859] Sending 1024MB via ssl-enabled unix socket: real 3.241s	user 3.212s	sys 2.300s
I20260929 11:25:45.398837   765 rpc-test.cc:1859] Sending 1024MB via ssl-enabled unix socket: real 3.141s	user 3.068s	sys 2.261s
I20260929 11:25:48.496606   765 rpc-test.cc:1859] Sending 1024MB via ssl-enabled unix socket: real 3.098s	user 3.071s	sys 2.193s
[       OK ] Parameters/TestRpc.TestPerformanceBySocketType/SSL_UnixSocket (15713 ms)
[----------] 20 tests from Parameters/TestRpc (51707 ms total)

[----------] 1 test from Parameters/TestRpcSocketTxRxQueue
[ RUN      ] Parameters/TestRpcSocketTxRxQueue.AcceptorRxQueueSizeMetric/0
I20260929 11:25:48.515681  1247 acceptor_pool.cc:254] collecting diagnostics on the listening RPC socket 0.0.0.0:43113 every 1 connection(s)
I20260929 11:25:48.515858  1248 acceptor_pool.cc:254] collecting diagnostics on the listening RPC socket 0.0.0.0:43113 every 1 connection(s)
W20260929 11:25:48.517582  1243 negotiation.cc:337] Failed RPC negotiation. Trace:
0929 11:25:48.517221 (+     0us) reactor.cc:625] Submitting negotiation task for server connection from 127.0.0.1:38348 (local address 127.0.0.1:43113)
0929 11:25:48.517362 (+   141us) server_negotiation.cc:206] Beginning negotiation
0929 11:25:48.517367 (+     5us) server_negotiation.cc:399] Waiting for connection header
0929 11:25:48.517478 (+   111us) negotiation.cc:327] Negotiation complete: Network error: Server connection negotiation failed: server connection from 127.0.0.1:38348: BlockingRecv error: recv got EOF from 127.0.0.1:38348 (error 108)
Metrics: {"server-negotiator.queue_time_us":46}
[       OK ] Parameters/TestRpcSocketTxRxQueue.AcceptorRxQueueSizeMetric/0 (14 ms)
[----------] 1 test from Parameters/TestRpcSocketTxRxQueue (14 ms total)

[----------] Global test environment tear-down
[==========] 21 tests from 2 test suites ran. (51721 ms total)
[  PASSED  ] 20 tests.
[  FAILED  ] 1 test, listed below:
[  FAILED  ] Parameters/TestRpc.TestCallWithChainCertAndChainCA/SSL_UnixSocket, where GetParam() = (true, true)

 1 FAILED TEST