Diagnosed failure
Parameters/TestRpc.TestCallWithChainCertAndChainCA/SSL_UnixSocket: /data0/somelongdirectorytoavoidrpathissues/src/kudu/src/kudu/rpc/rpc-test.cc:270: Failure
Failed
Bad status: Runtime error: could not verify certificate chain (error with cert: subject=CN = localhost, ST = sadfjas, C = AS, emailAddress = sdflkdsajf, O = lskdfjlsad, OU = sldfkja, issuer=C = AS, ST = ASDfkjdhf, L = lskdjf, O = saldfja, OU = skdjf, CN = localhost, emailAddress = sadjflkadsj): : certificate has expired
Google Test trace:
/data0/somelongdirectorytoavoidrpathissues/src/kudu/src/kudu/rpc/rpc-test.cc:267: Connecting to unix:/tmp/dist-test-taskw1x2Da/test-tmp/rpc-test-bd7367d1d0cc47828b2d95dd576b1ef2.sock
I20260927 14:00:54.629864 32395 test_util.cc:175] -----------------------------------------------
I20260927 14:00:54.630059 32395 test_util.cc:176] Had fatal failures, leaving test files at /tmp/dist-test-taskw1x2Da/test-tmp/rpc-test.6.Parameters_TestRpc.TestCallWithChainCertAndChainCA_SSL_UnixSocket.1790517653161014-32395-0
Full log
Note: This is test shard 7 of 8.
[==========] Running 21 tests from 2 test suites.
[----------] Global test environment set-up.
[----------] 20 tests from Parameters/TestRpc
[ RUN ] Parameters/TestRpc.TestMessengerCreateDestroy/SSL_UnixSocket
WARNING: Logging before InitGoogleLogging() is written to STDERR
I20260927 14:00:53.283802 32395 rpc-test.cc:169] started messenger TestCreateDestroy
[ OK ] Parameters/TestRpc.TestMessengerCreateDestroy/SSL_UnixSocket (1253 ms)
[ RUN ] Parameters/TestRpc.TestNegotiationDeadlock/SSL_UnixSocket
I20260927 14:00:54.499204 32417 acceptor_pool.cc:254] collecting diagnostics on the listening RPC socket unix:/tmp/dist-test-taskw1x2Da/test-tmp/rpc-test-5caf64cf32e14212bfe9405e5942f969.sock every 8 connection(s)
I20260927 14:00:54.500847 32418 acceptor_pool.cc:254] collecting diagnostics on the listening RPC socket unix:/tmp/dist-test-taskw1x2Da/test-tmp/rpc-test-5caf64cf32e14212bfe9405e5942f969.sock every 8 connection(s)
[ OK ] Parameters/TestRpc.TestNegotiationDeadlock/SSL_UnixSocket (93 ms)
[ RUN ] Parameters/TestRpc.TestCallWithChainCertAndChainCA/SSL_UnixSocket
I20260927 14:00:54.595006 32433 acceptor_pool.cc:254] collecting diagnostics on the listening RPC socket unix:/tmp/dist-test-taskw1x2Da/test-tmp/rpc-test-bd7367d1d0cc47828b2d95dd576b1ef2.sock every 8 connection(s)
I20260927 14:00:54.597586 32434 acceptor_pool.cc:254] collecting diagnostics on the listening RPC socket unix:/tmp/dist-test-taskw1x2Da/test-tmp/rpc-test-bd7367d1d0cc47828b2d95dd576b1ef2.sock every 8 connection(s)
/data0/somelongdirectorytoavoidrpathissues/src/kudu/src/kudu/rpc/rpc-test.cc:270: Failure
Failed
Bad status: Runtime error: could not verify certificate chain (error with cert: subject=CN = localhost, ST = sadfjas, C = AS, emailAddress = sdflkdsajf, O = lskdfjlsad, OU = sldfkja, issuer=C = AS, ST = ASDfkjdhf, L = lskdjf, O = saldfja, OU = skdjf, CN = localhost, emailAddress = sadjflkadsj): : certificate has expired
Google Test trace:
/data0/somelongdirectorytoavoidrpathissues/src/kudu/src/kudu/rpc/rpc-test.cc:267: Connecting to unix:/tmp/dist-test-taskw1x2Da/test-tmp/rpc-test-bd7367d1d0cc47828b2d95dd576b1ef2.sock
I20260927 14:00:54.629864 32395 test_util.cc:175] -----------------------------------------------
I20260927 14:00:54.630059 32395 test_util.cc:176] Had fatal failures, leaving test files at /tmp/dist-test-taskw1x2Da/test-tmp/rpc-test.6.Parameters_TestRpc.TestCallWithChainCertAndChainCA_SSL_UnixSocket.1790517653161014-32395-0
[ FAILED ] Parameters/TestRpc.TestCallWithChainCertAndChainCA/SSL_UnixSocket, where GetParam() = (true, true) (67 ms)
[ RUN ] Parameters/TestRpc.TestCallWithPasswordProtectedKey/SSL_UnixSocket
I20260927 14:00:54.662882 32458 acceptor_pool.cc:254] collecting diagnostics on the listening RPC socket unix:/tmp/dist-test-taskw1x2Da/test-tmp/rpc-test-82d5c4789eb841b19c02ae6036dc7902.sock every 8 connection(s)
I20260927 14:00:54.663735 32459 acceptor_pool.cc:254] collecting diagnostics on the listening RPC socket unix:/tmp/dist-test-taskw1x2Da/test-tmp/rpc-test-82d5c4789eb841b19c02ae6036dc7902.sock every 8 connection(s)
W20260927 14:00:54.719403 32455 connection.cc:196] Error closing socket: Network error: TlsSocket::Close: Broken pipe
[ OK ] Parameters/TestRpc.TestCallWithPasswordProtectedKey/SSL_UnixSocket (97 ms)
[ RUN ] Parameters/TestRpc.TestCallToBadServer/SSL_UnixSocket
I20260927 14:00:54.754297 32395 rpc-test.cc:394] Status: Network error: Client connection negotiation failed: client connection to 0.0.0.0:0: connect: Connection refused (error 111)
I20260927 14:00:54.755749 32395 rpc-test.cc:394] Status: Network error: Client connection negotiation failed: client connection to 0.0.0.0:0: connect: Connection refused (error 111)
I20260927 14:00:54.757229 32395 rpc-test.cc:394] Status: Network error: Client connection negotiation failed: client connection to 0.0.0.0:0: connect: Connection refused (error 111)
I20260927 14:00:54.758646 32395 rpc-test.cc:394] Status: Network error: Client connection negotiation failed: client connection to 0.0.0.0:0: connect: Connection refused (error 111)
I20260927 14:00:54.760052 32395 rpc-test.cc:394] Status: Network error: Client connection negotiation failed: client connection to 0.0.0.0:0: connect: Connection refused (error 111)
[ OK ] Parameters/TestRpc.TestCallToBadServer/SSL_UnixSocket (35 ms)
[ RUN ] Parameters/TestRpc.TestWrongService/SSL_UnixSocket
I20260927 14:00:54.783753 32493 acceptor_pool.cc:254] collecting diagnostics on the listening RPC socket unix:/tmp/dist-test-taskw1x2Da/test-tmp/rpc-test-28723969bf924260b225165cabbf4872.sock every 8 connection(s)
I20260927 14:00:54.784624 32494 acceptor_pool.cc:254] collecting diagnostics on the listening RPC socket unix:/tmp/dist-test-taskw1x2Da/test-tmp/rpc-test-28723969bf924260b225165cabbf4872.sock every 8 connection(s)
I20260927 14:00:54.822324 32490 messenger.cc:345] service WrongServiceName not registered on TestServer
W20260927 14:00:54.825654 32490 connection.cc:196] Error closing socket: Network error: TlsSocket::Close: Broken pipe
[ OK ] Parameters/TestRpc.TestWrongService/SSL_UnixSocket (67 ms)
[ RUN ] Parameters/TestRpc.TestConnectionKeepalive/SSL_UnixSocket
I20260927 14:00:54.861234 32516 acceptor_pool.cc:254] collecting diagnostics on the listening RPC socket unix:/tmp/dist-test-taskw1x2Da/test-tmp/rpc-test-865ce54c8f124146a9bd976b1cfe44ed.sock every 8 connection(s)
I20260927 14:00:54.861994 32517 acceptor_pool.cc:254] collecting diagnostics on the listening RPC socket unix:/tmp/dist-test-taskw1x2Da/test-tmp/rpc-test-865ce54c8f124146a9bd976b1cfe44ed.sock every 8 connection(s)
I20260927 14:00:54.865607 32395 rpc-test.cc:488] Connecting to unix:/tmp/dist-test-taskw1x2Da/test-tmp/rpc-test-865ce54c8f124146a9bd976b1cfe44ed.sock
W20260927 14:00:55.335147 32529 connection.cc:196] Error closing socket: Network error: TlsSocket::Close: Broken pipe
[ OK ] Parameters/TestRpc.TestConnectionKeepalive/SSL_UnixSocket (1082 ms)
[ RUN ] Parameters/TestRpc.TestClientConnectionMetrics/SSL_UnixSocket
I20260927 14:00:55.948657 32541 acceptor_pool.cc:254] collecting diagnostics on the listening RPC socket unix:/tmp/dist-test-taskw1x2Da/test-tmp/rpc-test-ca87b58c245e426a950990055683adc1.sock every 8 connection(s)
I20260927 14:00:55.949401 32542 acceptor_pool.cc:254] collecting diagnostics on the listening RPC socket unix:/tmp/dist-test-taskw1x2Da/test-tmp/rpc-test-ca87b58c245e426a950990055683adc1.sock every 8 connection(s)
I20260927 14:00:55.952915 32395 rpc-test.cc:569] Connecting to unix:/tmp/dist-test-taskw1x2Da/test-tmp/rpc-test-ca87b58c245e426a950990055683adc1.sock
[ OK ] Parameters/TestRpc.TestClientConnectionMetrics/SSL_UnixSocket (143397 ms)
[ RUN ] Parameters/TestRpc.TestCredentialsPolicy/SSL_UnixSocket
I20260927 14:03:19.329588 32578 acceptor_pool.cc:254] collecting diagnostics on the listening RPC socket unix:/tmp/dist-test-taskw1x2Da/test-tmp/rpc-test-cc083e9ecfaf4bdd888e0fdeb776b3b2.sock every 8 connection(s)
I20260927 14:03:19.330583 32579 acceptor_pool.cc:254] collecting diagnostics on the listening RPC socket unix:/tmp/dist-test-taskw1x2Da/test-tmp/rpc-test-cc083e9ecfaf4bdd888e0fdeb776b3b2.sock every 8 connection(s)
I20260927 14:03:19.334137 32395 rpc-test.cc:700] Connecting to unix:/tmp/dist-test-taskw1x2Da/test-tmp/rpc-test-cc083e9ecfaf4bdd888e0fdeb776b3b2.sock
W20260927 14:03:19.378737 32577 connection.cc:196] Error closing socket: Network error: TlsSocket::Close: Broken pipe
[ OK ] Parameters/TestRpc.TestCredentialsPolicy/SSL_UnixSocket (92 ms)
[ RUN ] Parameters/TestRpc.TestCallLongerThanKeepalive/SSL_UnixSocket
I20260927 14:03:19.461818 32603 acceptor_pool.cc:254] collecting diagnostics on the listening RPC socket unix:/tmp/dist-test-taskw1x2Da/test-tmp/rpc-test-d2caeeefeb66487eb0db882c74ea62eb.sock every 8 connection(s)
I20260927 14:03:19.462594 32604 acceptor_pool.cc:254] collecting diagnostics on the listening RPC socket unix:/tmp/dist-test-taskw1x2Da/test-tmp/rpc-test-d2caeeefeb66487eb0db882c74ea62eb.sock every 8 connection(s)
I20260927 14:03:19.505395 32607 rpc-test-base.h:222] got call: sleep_micros: 3000000 deferred: true
I20260927 14:03:22.510751 32607 rpcz_store.cc:275] Call kudu.rpc.GenericCalculatorService.Sleep from unix:<unnamed> (request call id 0) took 3005 ms. Trace:
I20260927 14:03:22.511096 32607 rpcz_store.cc:276] 0927 14:03:19.505192 (+ 0us) service_pool.cc:170] Inserting onto call queue
0927 14:03:19.505302 (+ 110us) service_pool.cc:227] Handling call
0927 14:03:22.510671 (+3005369us) inbound_call.cc:173] Queueing success response
Metrics: {}
W20260927 14:03:22.516009 32600 connection.cc:196] Error closing socket: Network error: TlsSocket::Close: Broken pipe
[ OK ] Parameters/TestRpc.TestCallLongerThanKeepalive/SSL_UnixSocket (3119 ms)
[ RUN ] Parameters/TestRpc.TestRpcSidecar/SSL_UnixSocket
I20260927 14:03:22.563575 32628 acceptor_pool.cc:254] collecting diagnostics on the listening RPC socket unix:/tmp/dist-test-taskw1x2Da/test-tmp/rpc-test-0318e9f1578e42da9538cb177d22ad58.sock every 8 connection(s)
I20260927 14:03:22.564544 32629 acceptor_pool.cc:254] collecting diagnostics on the listening RPC socket unix:/tmp/dist-test-taskw1x2Da/test-tmp/rpc-test-0318e9f1578e42da9538cb177d22ad58.sock every 8 connection(s)
W20260927 14:03:23.149899 32625 connection.cc:196] Error closing socket: Network error: TlsSocket::Close: Broken pipe
[ OK ] Parameters/TestRpc.TestRpcSidecar/SSL_UnixSocket (634 ms)
[ RUN ] Parameters/TestRpc.TestRpcSidecarLimits/SSL_UnixSocket
I20260927 14:03:40.101040 32655 acceptor_pool.cc:254] collecting diagnostics on the listening RPC socket unix:/tmp/dist-test-taskw1x2Da/test-tmp/rpc-test-d37bef3284cf4849b3d346ba646eb525.sock every 8 connection(s)
I20260927 14:03:40.101897 32656 acceptor_pool.cc:254] collecting diagnostics on the listening RPC socket unix:/tmp/dist-test-taskw1x2Da/test-tmp/rpc-test-d37bef3284cf4849b3d346ba646eb525.sock every 8 connection(s)
W20260927 14:03:40.151489 32395 serialization.cc:72] Serialized kudu.rpc_test.PushStringsRequestPB (2147483654 bytes) is larger than the maximum configured RPC message size (52428800 bytes). Sending anyway, but peer may reject the data.
W20260927 14:03:40.162644 32652 connection.cc:535] server connection from unix:<unnamed> recv error: Network error: RPC frame had a length of 2147483714, but we only support messages up to 52428800 bytes long.
W20260927 14:03:40.163013 32652 connection.cc:158] shutting down server connection from unix:<unnamed> with pending inbound data: 4/2147483714 bytes received; last active 0 ns ago: status Network error: RPC frame had a length of 2147483714, but we only support messages up to 52428800 bytes long.
W20260927 14:03:40.163998 32668 connection.cc:698] client connection to unix:/tmp/dist-test-taskw1x2Da/test-tmp/rpc-test-d37bef3284cf4849b3d346ba646eb525.sock send error: Network error: failed to write to TLS socket: Broken pipe
W20260927 14:03:40.164723 32668 connection.cc:196] Error closing socket: Network error: TlsSocket::Close: Success
[ OK ] Parameters/TestRpc.TestRpcSidecarLimits/SSL_UnixSocket (17774 ms)
[ RUN ] Parameters/TestRpc.TestCallTimeoutDoesntAffectNegotiation/SSL_UnixSocket
I20260927 14:03:40.978245 32680 acceptor_pool.cc:254] collecting diagnostics on the listening RPC socket unix:/tmp/dist-test-taskw1x2Da/test-tmp/rpc-test-adb9a4683a9b4fd4bc70bcae53de7eec.sock every 8 connection(s)
I20260927 14:03:40.979096 32681 acceptor_pool.cc:254] collecting diagnostics on the listening RPC socket unix:/tmp/dist-test-taskw1x2Da/test-tmp/rpc-test-adb9a4683a9b4fd4bc70bcae53de7eec.sock every 8 connection(s)
W20260927 14:03:41.001183 32676 negotiation.cc:266] Injecting 500ms delay in negotiation
I20260927 14:03:41.050992 32395 rpc-test-base.h:595] status: Timed out: connection negotiation to unix:/tmp/dist-test-taskw1x2Da/test-tmp/rpc-test-adb9a4683a9b4fd4bc70bcae53de7eec.sock for RPC Sleep timed out after 0.050s (ON_OUTBOUND_QUEUE), seconds elapsed: 0.0510113
W20260927 14:03:41.515280 32677 connection.cc:196] Error closing socket: Network error: TlsSocket::Close: Broken pipe
[ OK ] Parameters/TestRpc.TestCallTimeoutDoesntAffectNegotiation/SSL_UnixSocket (588 ms)
[ RUN ] Parameters/TestRpc.TestRpcHandlerLatencyMetric/SSL_UnixSocket
I20260927 14:03:41.540514 32705 acceptor_pool.cc:254] collecting diagnostics on the listening RPC socket unix:/tmp/dist-test-taskw1x2Da/test-tmp/rpc-test-ddb43e408fe347338de722dc4bd75582.sock every 8 connection(s)
I20260927 14:03:41.541221 32706 acceptor_pool.cc:254] collecting diagnostics on the listening RPC socket unix:/tmp/dist-test-taskw1x2Da/test-tmp/rpc-test-ddb43e408fe347338de722dc4bd75582.sock every 8 connection(s)
I20260927 14:03:41.604591 32395 rpc-test.cc:1236] Sleep() min lat: 21739
I20260927 14:03:41.604883 32395 rpc-test.cc:1237] Sleep() mean lat: 21739
I20260927 14:03:41.605093 32395 rpc-test.cc:1238] Sleep() max lat: 21739
I20260927 14:03:41.605268 32395 rpc-test.cc:1239] Sleep() #calls: 1
[ OK ] Parameters/TestRpc.TestRpcHandlerLatencyMetric/SSL_UnixSocket (93 ms)
[ RUN ] Parameters/TestRpc.TimedOutOnResponseMetricServiceQueue/SSL_UnixSocket
I20260927 14:03:41.630576 32731 acceptor_pool.cc:254] collecting diagnostics on the listening RPC socket unix:/tmp/dist-test-taskw1x2Da/test-tmp/rpc-test-f3b3a75e73e64eebbc8e4a07584352f4.sock every 8 connection(s)
I20260927 14:03:41.631290 32732 acceptor_pool.cc:254] collecting diagnostics on the listening RPC socket unix:/tmp/dist-test-taskw1x2Da/test-tmp/rpc-test-f3b3a75e73e64eebbc8e4a07584352f4.sock every 8 connection(s)
W20260927 14:03:41.706627 32733 rpcz_store.cc:267] Call kudu.rpc_test.CalculatorService.Sleep from unix:<unnamed> (request call id 2) took 20 ms (client timeout 20 ms). Trace:
W20260927 14:03:41.707052 32733 rpcz_store.cc:269] 0927 14:03:41.685943 (+ 0us) service_pool.cc:170] Inserting onto call queue
0927 14:03:41.706439 (+ 20496us) service_pool.cc:214] Skipping call since client already timed out
0927 14:03:41.706564 (+ 125us) inbound_call.cc:173] Queueing failure response
Metrics: {}
W20260927 14:03:41.709937 32728 connection.cc:196] Error closing socket: Network error: TlsSocket::Close: Broken pipe
[ OK ] Parameters/TestRpc.TimedOutOnResponseMetricServiceQueue/SSL_UnixSocket (101 ms)
[ RUN ] Parameters/TestRpc.RpcPendingConnectionsMetric/SSL_UnixSocket
I20260927 14:03:41.726534 32754 acceptor_pool.cc:254] collecting diagnostics on the listening RPC socket 0.0.0.0:41403 every 8 connection(s)
I20260927 14:03:41.727455 32755 acceptor_pool.cc:254] collecting diagnostics on the listening RPC socket 0.0.0.0:41403 every 8 connection(s)
W20260927 14:03:41.734402 32750 negotiation.cc:337] Failed RPC negotiation. Trace:
0927 14:03:41.732981 (+ 0us) reactor.cc:625] Submitting negotiation task for server connection from 127.0.0.1:50580 (local address 127.0.0.1:41403)
0927 14:03:41.733481 (+ 500us) server_negotiation.cc:206] Beginning negotiation
0927 14:03:41.733499 (+ 18us) server_negotiation.cc:399] Waiting for connection header
0927 14:03:41.733749 (+ 250us) negotiation.cc:327] Negotiation complete: Network error: Server connection negotiation failed: server connection from 127.0.0.1:50580: BlockingRecv error: recv got EOF from 127.0.0.1:50580 (error 108)
Metrics: {"server-negotiator.queue_time_us":170}
[ OK ] Parameters/TestRpc.RpcPendingConnectionsMetric/SSL_UnixSocket (33 ms)
[ RUN ] Parameters/TestRpc.TestRpcContextClientDeadline/SSL_UnixSocket
I20260927 14:03:41.778589 302 acceptor_pool.cc:254] collecting diagnostics on the listening RPC socket unix:/tmp/dist-test-taskw1x2Da/test-tmp/rpc-test-1c1004ff06114b2cb5b8832753d44430.sock every 8 connection(s)
I20260927 14:03:41.779318 303 acceptor_pool.cc:254] collecting diagnostics on the listening RPC socket unix:/tmp/dist-test-taskw1x2Da/test-tmp/rpc-test-1c1004ff06114b2cb5b8832753d44430.sock every 8 connection(s)
W20260927 14:03:41.842695 32767 connection.cc:196] Error closing socket: Network error: TlsSocket::Close: Broken pipe
[ OK ] Parameters/TestRpc.TestRpcContextClientDeadline/SSL_UnixSocket (100 ms)
[ RUN ] Parameters/TestRpc.TestApplicationFeatureFlagUnsupportedServer/SSL_UnixSocket
I20260927 14:03:41.880247 327 acceptor_pool.cc:254] collecting diagnostics on the listening RPC socket unix:/tmp/dist-test-taskw1x2Da/test-tmp/rpc-test-8c5390fade5344709a757766730ade45.sock every 8 connection(s)
I20260927 14:03:41.881021 328 acceptor_pool.cc:254] collecting diagnostics on the listening RPC socket unix:/tmp/dist-test-taskw1x2Da/test-tmp/rpc-test-8c5390fade5344709a757766730ade45.sock every 8 connection(s)
W20260927 14:03:41.915622 324 connection.cc:196] Error closing socket: Network error: TlsSocket::Close: Broken pipe
[ OK ] Parameters/TestRpc.TestApplicationFeatureFlagUnsupportedServer/SSL_UnixSocket (72 ms)
[ RUN ] Parameters/TestRpc.TestCancellationAsync/SSL_UnixSocket
I20260927 14:03:41.945853 352 acceptor_pool.cc:254] collecting diagnostics on the listening RPC socket unix:/tmp/dist-test-taskw1x2Da/test-tmp/rpc-test-018cd820b3404ed5a1e9021294214214.sock every 8 connection(s)
I20260927 14:03:41.946619 353 acceptor_pool.cc:254] collecting diagnostics on the listening RPC socket unix:/tmp/dist-test-taskw1x2Da/test-tmp/rpc-test-018cd820b3404ed5a1e9021294214214.sock every 8 connection(s)
I20260927 14:03:41.949915 32395 rpc-test.cc:1716] Connecting to unix:/tmp/dist-test-taskw1x2Da/test-tmp/rpc-test-018cd820b3404ed5a1e9021294214214.sock
I20260927 14:03:41.967514 32395 test_util.cc:268] Using random seed: 1790839939
I20260927 14:03:42.214529 356 rpc-test-base.h:240] got call: sleep_micros: 500 pattern: 4294967295 num_repetitions: 2097152 sidecar_idx: 0
I20260927 14:03:42.437255 355 rpc-test-base.h:240] got call: sleep_micros: 500 pattern: 4294967295 num_repetitions: 2097152 sidecar_idx: 0
I20260927 14:03:42.691855 356 rpc-test-base.h:240] got call: sleep_micros: 500 pattern: 4294967295 num_repetitions: 2097152 sidecar_idx: 0
I20260927 14:03:42.920388 356 rpc-test-base.h:240] got call: sleep_micros: 500 pattern: 4294967295 num_repetitions: 2097152 sidecar_idx: 0
I20260927 14:03:43.133821 356 rpc-test-base.h:240] got call: sleep_micros: 500 pattern: 4294967295 num_repetitions: 2097152 sidecar_idx: 0
I20260927 14:03:43.356662 356 rpc-test-base.h:240] got call: sleep_micros: 500 pattern: 4294967295 num_repetitions: 2097152 sidecar_idx: 0
I20260927 14:03:43.566504 355 rpc-test-base.h:240] got call: sleep_micros: 500 pattern: 4294967295 num_repetitions: 2097152 sidecar_idx: 0
I20260927 14:03:43.789741 355 rpc-test-base.h:240] got call: sleep_micros: 500 pattern: 4294967295 num_repetitions: 2097152 sidecar_idx: 0
I20260927 14:03:44.068277 356 rpc-test-base.h:240] got call: sleep_micros: 500 pattern: 4294967295 num_repetitions: 2097152 sidecar_idx: 0
W20260927 14:03:44.087002 349 connection.cc:196] Error closing socket: Network error: TlsSocket::Close: Broken pipe
W20260927 14:03:44.141834 349 connection.cc:441] server connection from unix:<unnamed> torn down before Call kudu.rpc.GenericCalculatorService.SleepWithSidecar from unix:<unnamed> (request call id 8) could send its response
W20260927 14:03:44.217805 349 connection.cc:441] server connection from unix:<unnamed> torn down before Call kudu.rpc.GenericCalculatorService.SleepWithSidecar from unix:<unnamed> (request call id 9) could send its response
[ OK ] Parameters/TestRpc.TestCancellationAsync/SSL_UnixSocket (2308 ms)
[ RUN ] Parameters/TestRpc.TestPerformanceBySocketType/SSL_UnixSocket
I20260927 14:03:44.328644 378 acceptor_pool.cc:254] collecting diagnostics on the listening RPC socket unix:/tmp/dist-test-taskw1x2Da/test-tmp/rpc-test-428044d46efc4544a62b1a523e583820.sock every 8 connection(s)
I20260927 14:03:44.329540 379 acceptor_pool.cc:254] collecting diagnostics on the listening RPC socket unix:/tmp/dist-test-taskw1x2Da/test-tmp/rpc-test-428044d46efc4544a62b1a523e583820.sock every 8 connection(s)
I20260927 14:03:44.333048 32395 rpc-test.cc:1846] Connecting to unix:/tmp/dist-test-taskw1x2Da/test-tmp/rpc-test-428044d46efc4544a62b1a523e583820.sock
I20260927 14:04:07.058921 32395 rpc-test.cc:1859] Sending 1024MB via ssl-enabled unix socket: real 22.708s user 20.907s sys 13.716s
I20260927 14:04:29.397840 32395 rpc-test.cc:1859] Sending 1024MB via ssl-enabled unix socket: real 22.338s user 20.164s sys 13.699s
I20260927 14:04:51.615831 32395 rpc-test.cc:1859] Sending 1024MB via ssl-enabled unix socket: real 22.217s user 20.356s sys 13.344s
I20260927 14:05:13.996678 32395 rpc-test.cc:1859] Sending 1024MB via ssl-enabled unix socket: real 22.380s user 19.860s sys 14.030s
I20260927 14:05:36.553429 32395 rpc-test.cc:1859] Sending 1024MB via ssl-enabled unix socket: real 22.556s user 20.312s sys 13.951s
W20260927 14:05:36.560873 375 connection.cc:196] Error closing socket: Network error: TlsSocket::Close: Broken pipe
[ OK ] Parameters/TestRpc.TestPerformanceBySocketType/SSL_UnixSocket (112341 ms)
[----------] 20 tests from Parameters/TestRpc (283358 ms total)
[----------] 1 test from Parameters/TestRpcSocketTxRxQueue
[ RUN ] Parameters/TestRpcSocketTxRxQueue.AcceptorRxQueueSizeMetric/0
I20260927 14:05:36.583933 414 acceptor_pool.cc:254] collecting diagnostics on the listening RPC socket 0.0.0.0:44865 every 1 connection(s)
I20260927 14:05:36.584910 415 acceptor_pool.cc:254] collecting diagnostics on the listening RPC socket 0.0.0.0:44865 every 1 connection(s)
W20260927 14:05:36.590749 410 negotiation.cc:337] Failed RPC negotiation. Trace:
0927 14:05:36.589065 (+ 0us) reactor.cc:625] Submitting negotiation task for server connection from 127.0.0.1:55046 (local address 127.0.0.1:44865)
0927 14:05:36.589551 (+ 486us) server_negotiation.cc:206] Beginning negotiation
0927 14:05:36.589577 (+ 26us) server_negotiation.cc:399] Waiting for connection header
0927 14:05:36.589808 (+ 231us) negotiation.cc:327] Negotiation complete: Network error: Server connection negotiation failed: server connection from 127.0.0.1:55046: BlockingRecv error: recv got EOF from 127.0.0.1:55046 (error 108)
Metrics: {"server-negotiator.queue_time_us":106}
[ OK ] Parameters/TestRpcSocketTxRxQueue.AcceptorRxQueueSizeMetric/0 (26 ms)
[----------] 1 test from Parameters/TestRpcSocketTxRxQueue (26 ms total)
[----------] Global test environment tear-down
[==========] 21 tests from 2 test suites ran. (283385 ms total)
[ PASSED ] 20 tests.
[ FAILED ] 1 test, listed below:
[ FAILED ] Parameters/TestRpc.TestCallWithChainCertAndChainCA/SSL_UnixSocket, where GetParam() = (true, true)
1 FAILED TEST