Diagnosed failure

Parameters/TestRpc.TestCallWithChainCertAndChainCA/SSL_TCP: /data0/somelongdirectorytoavoidrpathissues/src/kudu/src/kudu/rpc/rpc-test.cc:270: Failure
Failed
Bad status: Runtime error: could not verify certificate chain (error with cert: subject=CN = localhost, ST = sadfjas, C = AS, emailAddress = sdflkdsajf, O = lskdfjlsad, OU = sldfkja, issuer=C = AS, ST = ASDfkjdhf, L = lskdjf, O = saldfja, OU = skdjf, CN = localhost, emailAddress = sadjflkadsj): : certificate has expired
Google Test trace:
/data0/somelongdirectorytoavoidrpathissues/src/kudu/src/kudu/rpc/rpc-test.cc:267: Connecting to 0.0.0.0:42137
I20260926 07:25:12.106263   807 test_util.cc:175] -----------------------------------------------
I20260926 07:25:12.106340   807 test_util.cc:176] Had fatal failures, leaving test files at /tmp/dist-test-taskQlWq7Z/test-tmp/rpc-test.5.Parameters_TestRpc.TestCallWithChainCertAndChainCA_SSL_TCP.1790407512027497-807-0

Full log

Note: This is test shard 6 of 8.
[==========] Running 21 tests from 2 test suites.
[----------] Global test environment set-up.
[----------] 20 tests from Parameters/TestRpc
[ RUN      ] Parameters/TestRpc.TestMessengerCreateDestroy/SSL_TCP
WARNING: Logging before InitGoogleLogging() is written to STDERR
I20260926 07:25:12.068069   807 rpc-test.cc:169] started messenger TestCreateDestroy
[       OK ] Parameters/TestRpc.TestMessengerCreateDestroy/SSL_TCP (35 ms)
[ RUN      ] Parameters/TestRpc.TestNegotiationDeadlock/SSL_TCP
I20260926 07:25:12.077978   828 acceptor_pool.cc:254] collecting diagnostics on the listening RPC socket 0.0.0.0:39503 every 8 connection(s)
I20260926 07:25:12.077994   827 acceptor_pool.cc:254] collecting diagnostics on the listening RPC socket 0.0.0.0:39503 every 8 connection(s)
[       OK ] Parameters/TestRpc.TestNegotiationDeadlock/SSL_TCP (21 ms)
[ RUN      ] Parameters/TestRpc.TestCallWithChainCertAndChainCA/SSL_TCP
I20260926 07:25:12.100600   843 acceptor_pool.cc:254] collecting diagnostics on the listening RPC socket 0.0.0.0:42137 every 8 connection(s)
I20260926 07:25:12.100673   844 acceptor_pool.cc:254] collecting diagnostics on the listening RPC socket 0.0.0.0:42137 every 8 connection(s)
/data0/somelongdirectorytoavoidrpathissues/src/kudu/src/kudu/rpc/rpc-test.cc:270: Failure
Failed
Bad status: Runtime error: could not verify certificate chain (error with cert: subject=CN = localhost, ST = sadfjas, C = AS, emailAddress = sdflkdsajf, O = lskdfjlsad, OU = sldfkja, issuer=C = AS, ST = ASDfkjdhf, L = lskdjf, O = saldfja, OU = skdjf, CN = localhost, emailAddress = sadjflkadsj): : certificate has expired
Google Test trace:
/data0/somelongdirectorytoavoidrpathissues/src/kudu/src/kudu/rpc/rpc-test.cc:267: Connecting to 0.0.0.0:42137
I20260926 07:25:12.106263   807 test_util.cc:175] -----------------------------------------------
I20260926 07:25:12.106340   807 test_util.cc:176] Had fatal failures, leaving test files at /tmp/dist-test-taskQlWq7Z/test-tmp/rpc-test.5.Parameters_TestRpc.TestCallWithChainCertAndChainCA_SSL_TCP.1790407512027497-807-0
[  FAILED  ] Parameters/TestRpc.TestCallWithChainCertAndChainCA/SSL_TCP, where GetParam() = (true, false) (15 ms)
[ RUN      ] Parameters/TestRpc.TestCallWithPasswordProtectedKey/SSL_TCP
I20260926 07:25:12.119758   868 acceptor_pool.cc:254] collecting diagnostics on the listening RPC socket 0.0.0.0:35221 every 8 connection(s)
I20260926 07:25:12.119771   869 acceptor_pool.cc:254] collecting diagnostics on the listening RPC socket 0.0.0.0:35221 every 8 connection(s)
[       OK ] Parameters/TestRpc.TestCallWithPasswordProtectedKey/SSL_TCP (30 ms)
[ RUN      ] Parameters/TestRpc.TestCallToBadServer/SSL_TCP
I20260926 07:25:12.145958   807 rpc-test.cc:394] Status: Network error: Client connection negotiation failed: client connection to 0.0.0.0:0: connect: Connection refused (error 111)
I20260926 07:25:12.146571   807 rpc-test.cc:394] Status: Network error: Client connection negotiation failed: client connection to 0.0.0.0:0: connect: Connection refused (error 111)
I20260926 07:25:12.146994   807 rpc-test.cc:394] Status: Network error: Client connection negotiation failed: client connection to 0.0.0.0:0: connect: Connection refused (error 111)
I20260926 07:25:12.147449   807 rpc-test.cc:394] Status: Network error: Client connection negotiation failed: client connection to 0.0.0.0:0: connect: Connection refused (error 111)
I20260926 07:25:12.147853   807 rpc-test.cc:394] Status: Network error: Client connection negotiation failed: client connection to 0.0.0.0:0: connect: Connection refused (error 111)
[       OK ] Parameters/TestRpc.TestCallToBadServer/SSL_TCP (11 ms)
[ RUN      ] Parameters/TestRpc.TestWrongService/SSL_TCP
I20260926 07:25:12.163491   903 acceptor_pool.cc:254] collecting diagnostics on the listening RPC socket 0.0.0.0:43809 every 8 connection(s)
I20260926 07:25:12.163555   904 acceptor_pool.cc:254] collecting diagnostics on the listening RPC socket 0.0.0.0:43809 every 8 connection(s)
I20260926 07:25:12.175068   902 messenger.cc:345] service WrongServiceName not registered on TestServer
[       OK ] Parameters/TestRpc.TestWrongService/SSL_TCP (28 ms)
[ RUN      ] Parameters/TestRpc.TestConnectionKeepalive/SSL_TCP
I20260926 07:25:12.189474   927 acceptor_pool.cc:254] collecting diagnostics on the listening RPC socket 0.0.0.0:45999 every 8 connection(s)
I20260926 07:25:12.189504   926 acceptor_pool.cc:254] collecting diagnostics on the listening RPC socket 0.0.0.0:45999 every 8 connection(s)
I20260926 07:25:12.189728   807 rpc-test.cc:488] Connecting to 0.0.0.0:45999
[       OK ] Parameters/TestRpc.TestConnectionKeepalive/SSL_TCP (1033 ms)
[ RUN      ] Parameters/TestRpc.TestClientConnectionMetrics/SSL_TCP
I20260926 07:25:13.224794   951 acceptor_pool.cc:254] collecting diagnostics on the listening RPC socket 0.0.0.0:42297 every 8 connection(s)
I20260926 07:25:13.224810   952 acceptor_pool.cc:254] collecting diagnostics on the listening RPC socket 0.0.0.0:42297 every 8 connection(s)
I20260926 07:25:13.225065   807 rpc-test.cc:569] Connecting to 0.0.0.0:42297
[       OK ] Parameters/TestRpc.TestClientConnectionMetrics/SSL_TCP (17090 ms)
[ RUN      ] Parameters/TestRpc.TestCredentialsPolicy/SSL_TCP
I20260926 07:25:30.326162   975 acceptor_pool.cc:254] collecting diagnostics on the listening RPC socket 0.0.0.0:38837 every 8 connection(s)
I20260926 07:25:30.326424   974 acceptor_pool.cc:254] collecting diagnostics on the listening RPC socket 0.0.0.0:38837 every 8 connection(s)
I20260926 07:25:30.326450   807 rpc-test.cc:700] Connecting to 0.0.0.0:38837
[       OK ] Parameters/TestRpc.TestCredentialsPolicy/SSL_TCP (65 ms)
[ RUN      ] Parameters/TestRpc.TestCallLongerThanKeepalive/SSL_TCP
I20260926 07:25:30.390344   999 acceptor_pool.cc:254] collecting diagnostics on the listening RPC socket 0.0.0.0:40273 every 8 connection(s)
I20260926 07:25:30.390436  1000 acceptor_pool.cc:254] collecting diagnostics on the listening RPC socket 0.0.0.0:40273 every 8 connection(s)
I20260926 07:25:30.413938  1003 rpc-test-base.h:222] got call: sleep_micros: 3000000 deferred: true
I20260926 07:25:33.414902  1003 rpcz_store.cc:275] Call kudu.rpc.GenericCalculatorService.Sleep from 127.0.0.1:57576 (request call id 0) took 3001 ms. Trace:
I20260926 07:25:33.415040  1003 rpcz_store.cc:276] 0926 07:25:30.413843 (+     0us) service_pool.cc:170] Inserting onto call queue
0926 07:25:30.413902 (+    59us) service_pool.cc:227] Handling call
0926 07:25:33.414880 (+3000978us) inbound_call.cc:173] Queueing success response
Metrics: {}
[       OK ] Parameters/TestRpc.TestCallLongerThanKeepalive/SSL_TCP (3051 ms)
[ RUN      ] Parameters/TestRpc.TestRpcSidecar/SSL_TCP
I20260926 07:25:33.432780  1024 acceptor_pool.cc:254] collecting diagnostics on the listening RPC socket 0.0.0.0:35121 every 8 connection(s)
I20260926 07:25:33.432782  1025 acceptor_pool.cc:254] collecting diagnostics on the listening RPC socket 0.0.0.0:35121 every 8 connection(s)
[       OK ] Parameters/TestRpc.TestRpcSidecar/SSL_TCP (84 ms)
[ RUN      ] Parameters/TestRpc.TestRpcSidecarLimits/SSL_TCP
I20260926 07:25:35.586156  1049 acceptor_pool.cc:254] collecting diagnostics on the listening RPC socket 0.0.0.0:38393 every 8 connection(s)
I20260926 07:25:35.586233  1050 acceptor_pool.cc:254] collecting diagnostics on the listening RPC socket 0.0.0.0:38393 every 8 connection(s)
W20260926 07:25:35.636931   807 serialization.cc:72] Serialized kudu.rpc_test.PushStringsRequestPB (2147483654 bytes) is larger than the maximum configured RPC message size (52428800 bytes). Sending anyway, but peer may reject the data.
W20260926 07:25:35.641551  1047 connection.cc:535] server connection from 127.0.0.1:53556 recv error: Network error: RPC frame had a length of 2147483714, but we only support messages up to 52428800 bytes long.
W20260926 07:25:35.641651  1047 connection.cc:158] shutting down server connection from 127.0.0.1:53556 with pending inbound data: 4/2147483714 bytes received; last active 0 ns ago: status Network error: RPC frame had a length of 2147483714, but we only support messages up to 52428800 bytes long.
W20260926 07:25:35.642105  1062 connection.cc:196] Error closing socket: Network error: TlsSocket::Close: Connection reset by peer
I20260926 07:25:35.654492  1074 acceptor_pool.cc:254] collecting diagnostics on the listening RPC socket 0.0.0.0:36063 every 8 connection(s)
I20260926 07:25:35.654623  1075 acceptor_pool.cc:254] collecting diagnostics on the listening RPC socket 0.0.0.0:36063 every 8 connection(s)
W20260926 07:25:40.534056  1072 connection.cc:577] server connection from 127.0.0.1:46634: received bad data: 'Corruption: Invalid packet: message had a length of 2147483710, but we only support messages up to 2147483647 bytes
'
[       OK ] Parameters/TestRpc.TestRpcSidecarLimits/SSL_TCP (7033 ms)
[ RUN      ] Parameters/TestRpc.TestCallTimeoutDoesntAffectNegotiation/SSL_TCP
I20260926 07:25:40.548039  1099 acceptor_pool.cc:254] collecting diagnostics on the listening RPC socket 0.0.0.0:34263 every 8 connection(s)
I20260926 07:25:40.548183  1100 acceptor_pool.cc:254] collecting diagnostics on the listening RPC socket 0.0.0.0:34263 every 8 connection(s)
W20260926 07:25:40.563105  1095 negotiation.cc:266] Injecting 500ms delay in negotiation
I20260926 07:25:40.613543   807 rpc-test-base.h:595] status: Timed out: connection negotiation to 0.0.0.0:34263 for RPC Sleep timed out after 0.050s (ON_OUTBOUND_QUEUE), seconds elapsed: 0.0510958
[       OK ] Parameters/TestRpc.TestCallTimeoutDoesntAffectNegotiation/SSL_TCP (538 ms)
[ RUN      ] Parameters/TestRpc.TestRpcHandlerLatencyMetric/SSL_TCP
I20260926 07:25:41.092214  1124 acceptor_pool.cc:254] collecting diagnostics on the listening RPC socket 0.0.0.0:41443 every 8 connection(s)
I20260926 07:25:41.092233  1125 acceptor_pool.cc:254] collecting diagnostics on the listening RPC socket 0.0.0.0:41443 every 8 connection(s)
I20260926 07:25:41.127885   807 rpc-test.cc:1236] Sleep() min lat: 20459
I20260926 07:25:41.127966   807 rpc-test.cc:1237] Sleep() mean lat: 20459
I20260926 07:25:41.128003   807 rpc-test.cc:1238] Sleep() max lat: 20459
I20260926 07:25:41.128021   807 rpc-test.cc:1239] Sleep() #calls: 1
[       OK ] Parameters/TestRpc.TestRpcHandlerLatencyMetric/SSL_TCP (54 ms)
[ RUN      ] Parameters/TestRpc.TimedOutOnResponseMetricServiceQueue/SSL_TCP
I20260926 07:25:41.143283  1150 acceptor_pool.cc:254] collecting diagnostics on the listening RPC socket 0.0.0.0:38979 every 8 connection(s)
I20260926 07:25:41.143296  1151 acceptor_pool.cc:254] collecting diagnostics on the listening RPC socket 0.0.0.0:38979 every 8 connection(s)
W20260926 07:25:41.213635  1152 rpcz_store.cc:267] Call kudu.rpc_test.CalculatorService.Sleep from 127.0.0.1:53108 (request call id 2) took 20 ms (client timeout 20 ms). Trace:
W20260926 07:25:41.213752  1152 rpcz_store.cc:269] 0926 07:25:41.193190 (+     0us) service_pool.cc:170] Inserting onto call queue
0926 07:25:41.213568 (+ 20378us) service_pool.cc:214] Skipping call since client already timed out
0926 07:25:41.213611 (+    43us) inbound_call.cc:173] Queueing failure response
Metrics: {}
[       OK ] Parameters/TestRpc.TimedOutOnResponseMetricServiceQueue/SSL_TCP (85 ms)
[ RUN      ] Parameters/TestRpc.RpcPendingConnectionsMetric/SSL_TCP
I20260926 07:25:41.218499  1173 acceptor_pool.cc:254] collecting diagnostics on the listening RPC socket 0.0.0.0:33539 every 8 connection(s)
I20260926 07:25:41.218562  1174 acceptor_pool.cc:254] collecting diagnostics on the listening RPC socket 0.0.0.0:33539 every 8 connection(s)
W20260926 07:25:41.227736  1169 negotiation.cc:337] Failed RPC negotiation. Trace:
0926 07:25:41.227286 (+     0us) reactor.cc:625] Submitting negotiation task for server connection from 127.0.0.1:41178 (local address 127.0.0.1:33539)
0926 07:25:41.227412 (+   126us) server_negotiation.cc:206] Beginning negotiation
0926 07:25:41.227416 (+     4us) server_negotiation.cc:399] Waiting for connection header
0926 07:25:41.227502 (+    86us) negotiation.cc:327] Negotiation complete: Network error: Server connection negotiation failed: server connection from 127.0.0.1:41178: BlockingRecv error: recv got EOF from 127.0.0.1:41178 (error 108)
Metrics: {"server-negotiator.queue_time_us":45}
[       OK ] Parameters/TestRpc.RpcPendingConnectionsMetric/SSL_TCP (22 ms)
[ RUN      ] Parameters/TestRpc.TestRpcContextClientDeadline/SSL_TCP
I20260926 07:25:41.253077  1189 acceptor_pool.cc:254] collecting diagnostics on the listening RPC socket 0.0.0.0:44979 every 8 connection(s)
I20260926 07:25:41.253150  1190 acceptor_pool.cc:254] collecting diagnostics on the listening RPC socket 0.0.0.0:44979 every 8 connection(s)
[       OK ] Parameters/TestRpc.TestRpcContextClientDeadline/SSL_TCP (63 ms)
[ RUN      ] Parameters/TestRpc.TestApplicationFeatureFlagUnsupportedServer/SSL_TCP
I20260926 07:25:41.317179  1214 acceptor_pool.cc:254] collecting diagnostics on the listening RPC socket 0.0.0.0:44453 every 8 connection(s)
I20260926 07:25:41.317199  1215 acceptor_pool.cc:254] collecting diagnostics on the listening RPC socket 0.0.0.0:44453 every 8 connection(s)
[       OK ] Parameters/TestRpc.TestApplicationFeatureFlagUnsupportedServer/SSL_TCP (48 ms)
[ RUN      ] Parameters/TestRpc.TestCancellationAsync/SSL_TCP
I20260926 07:25:41.383025  1240 acceptor_pool.cc:254] collecting diagnostics on the listening RPC socket 0.0.0.0:35281 every 8 connection(s)
I20260926 07:25:41.383040  1239 acceptor_pool.cc:254] collecting diagnostics on the listening RPC socket 0.0.0.0:35281 every 8 connection(s)
I20260926 07:25:41.383242   807 rpc-test.cc:1716] Connecting to 0.0.0.0:35281
I20260926 07:25:41.409614   807 test_util.cc:268] Using random seed: -1115535541
I20260926 07:25:41.435225  1243 rpc-test-base.h:240] got call: sleep_micros: 500 pattern: 4294967295 num_repetitions: 2097152 sidecar_idx: 0
I20260926 07:25:41.455343  1242 rpc-test-base.h:240] got call: sleep_micros: 500 pattern: 4294967295 num_repetitions: 2097152 sidecar_idx: 0
I20260926 07:25:41.474226  1243 rpc-test-base.h:240] got call: sleep_micros: 500 pattern: 4294967295 num_repetitions: 2097152 sidecar_idx: 0
I20260926 07:25:41.501197  1243 rpc-test-base.h:240] got call: sleep_micros: 500 pattern: 4294967295 num_repetitions: 2097152 sidecar_idx: 0
I20260926 07:25:41.528937  1243 rpc-test-base.h:240] got call: sleep_micros: 500 pattern: 4294967295 num_repetitions: 2097152 sidecar_idx: 0
I20260926 07:25:41.557044  1243 rpc-test-base.h:240] got call: sleep_micros: 500 pattern: 4294967295 num_repetitions: 2097152 sidecar_idx: 0
I20260926 07:25:41.584647  1243 rpc-test-base.h:240] got call: sleep_micros: 500 pattern: 4294967295 num_repetitions: 2097152 sidecar_idx: 0
I20260926 07:25:41.611979  1243 rpc-test-base.h:240] got call: sleep_micros: 500 pattern: 4294967295 num_repetitions: 2097152 sidecar_idx: 0
W20260926 07:25:41.630257  1236 connection.cc:441] server connection from 127.0.0.1:43006 torn down before Call kudu.rpc.GenericCalculatorService.SleepWithSidecar from 127.0.0.1:43006 (request call id 9) could send its response
[       OK ] Parameters/TestRpc.TestCancellationAsync/SSL_TCP (280 ms)
[ RUN      ] Parameters/TestRpc.TestPerformanceBySocketType/SSL_TCP
I20260926 07:25:41.641153  1265 acceptor_pool.cc:254] collecting diagnostics on the listening RPC socket 0.0.0.0:45253 every 8 connection(s)
I20260926 07:25:41.641429   807 rpc-test.cc:1846] Connecting to 0.0.0.0:45253
I20260926 07:25:41.641148  1264 acceptor_pool.cc:254] collecting diagnostics on the listening RPC socket 0.0.0.0:45253 every 8 connection(s)
I20260926 07:25:44.403283   807 rpc-test.cc:1859] Sending 1024MB via ssl-enabled tcp socket: real 2.756s	user 2.594s	sys 2.231s
I20260926 07:25:47.144562   807 rpc-test.cc:1859] Sending 1024MB via ssl-enabled tcp socket: real 2.741s	user 2.690s	sys 2.098s
I20260926 07:25:49.833782   807 rpc-test.cc:1859] Sending 1024MB via ssl-enabled tcp socket: real 2.689s	user 2.535s	sys 2.177s
I20260926 07:25:52.488502   807 rpc-test.cc:1859] Sending 1024MB via ssl-enabled tcp socket: real 2.655s	user 2.549s	sys 2.146s
I20260926 07:25:55.230439   807 rpc-test.cc:1859] Sending 1024MB via ssl-enabled tcp socket: real 2.742s	user 2.698s	sys 2.099s
[       OK ] Parameters/TestRpc.TestPerformanceBySocketType/SSL_TCP (13600 ms)
[----------] 20 tests from Parameters/TestRpc (43198 ms total)

[----------] 1 test from Parameters/TestRpcSocketTxRxQueue
[ RUN      ] Parameters/TestRpcSocketTxRxQueue.OverCapacity/0
W20260926 07:25:55.503981  1281 negotiation.cc:337] Failed RPC negotiation. Trace:
0926 07:25:55.235554 (+     0us) reactor.cc:625] Submitting negotiation task for client connection to 0.0.0.0:40381 (local address 127.0.0.1:51700)
0926 07:25:55.235679 (+   125us) negotiation.cc:107] Waiting for socket to connect
0926 07:25:55.235696 (+    17us) client_negotiation.cc:174] Beginning negotiation
0926 07:25:55.235805 (+   109us) client_negotiation.cc:252] Sending NEGOTIATE NegotiatePB request
0926 07:25:55.503807 (+268002us) negotiation.cc:327] Negotiation complete: Network error: Client connection negotiation failed: client connection to 0.0.0.0:40381: BlockingRecv error: recv error from unknown peer: Transport endpoint is not connected (error 107)
Metrics: {"client-negotiator.queue_time_us":46}
W20260926 07:25:55.504057  1290 negotiation.cc:337] Failed RPC negotiation. Trace:
0926 07:25:55.236821 (+     0us) reactor.cc:625] Submitting negotiation task for client connection to 0.0.0.0:40381 (local address 127.0.0.1:51710)
0926 07:25:55.236940 (+   119us) negotiation.cc:107] Waiting for socket to connect
0926 07:25:55.236956 (+    16us) client_negotiation.cc:174] Beginning negotiation
0926 07:25:55.237068 (+   112us) client_negotiation.cc:252] Sending NEGOTIATE NegotiatePB request
0926 07:25:55.503768 (+266700us) negotiation.cc:327] Negotiation complete: Network error: Client connection negotiation failed: client connection to 0.0.0.0:40381: BlockingRecv error: recv error from unknown peer: Transport endpoint is not connected (error 107)
Metrics: {"client-negotiator.queue_time_us":36}
W20260926 07:25:55.504057  1317 negotiation.cc:337] Failed RPC negotiation. Trace:
0926 07:25:55.240750 (+     0us) reactor.cc:625] Submitting negotiation task for client connection to 0.0.0.0:40381 (local address 127.0.0.1:51730)
0926 07:25:55.240839 (+    89us) negotiation.cc:107] Waiting for socket to connect
0926 07:25:55.240849 (+    10us) client_negotiation.cc:174] Beginning negotiation
0926 07:25:55.240926 (+    77us) client_negotiation.cc:252] Sending NEGOTIATE NegotiatePB request
0926 07:25:55.503921 (+262995us) negotiation.cc:327] Negotiation complete: Network error: Client connection negotiation failed: client connection to 0.0.0.0:40381: BlockingRecv error: recv error from unknown peer: Transport endpoint is not connected (error 107)
Metrics: {"client-negotiator.queue_time_us":30}
W20260926 07:25:55.504288  1299 negotiation.cc:337] Failed RPC negotiation. Trace:
0926 07:25:55.238216 (+     0us) reactor.cc:625] Submitting negotiation task for client connection to 0.0.0.0:40381 (local address 127.0.0.1:51716)
0926 07:25:55.238382 (+   166us) negotiation.cc:107] Waiting for socket to connect
0926 07:25:55.238397 (+    15us) client_negotiation.cc:174] Beginning negotiation
0926 07:25:55.238496 (+    99us) client_negotiation.cc:252] Sending NEGOTIATE NegotiatePB request
0926 07:25:55.503807 (+265311us) negotiation.cc:327] Negotiation complete: Network error: Client connection negotiation failed: client connection to 0.0.0.0:40381: BlockingRecv error: recv error from unknown peer: Transport endpoint is not connected (error 107)
Metrics: {"client-negotiator.queue_time_us":48}
W20260926 07:25:55.503981  1308 negotiation.cc:337] Failed RPC negotiation. Trace:
0926 07:25:55.239496 (+     0us) reactor.cc:625] Submitting negotiation task for client connection to 0.0.0.0:40381 (local address 127.0.0.1:51726)
0926 07:25:55.239618 (+   122us) negotiation.cc:107] Waiting for socket to connect
0926 07:25:55.239631 (+    13us) client_negotiation.cc:174] Beginning negotiation
0926 07:25:55.239716 (+    85us) client_negotiation.cc:252] Sending NEGOTIATE NegotiatePB request
0926 07:25:55.503768 (+264052us) negotiation.cc:327] Negotiation complete: Network error: Client connection negotiation failed: client connection to 0.0.0.0:40381: BlockingRecv error: recv error from unknown peer: Transport endpoint is not connected (error 107)
Metrics: {"client-negotiator.queue_time_us":49}
W20260926 07:25:55.504403  1326 negotiation.cc:337] Failed RPC negotiation. Trace:
0926 07:25:55.241918 (+     0us) reactor.cc:625] Submitting negotiation task for client connection to 0.0.0.0:40381 (local address 127.0.0.1:51746)
0926 07:25:55.242007 (+    89us) negotiation.cc:107] Waiting for socket to connect
0926 07:25:55.242016 (+     9us) client_negotiation.cc:174] Beginning negotiation
0926 07:25:55.242094 (+    78us) client_negotiation.cc:252] Sending NEGOTIATE NegotiatePB request
0926 07:25:55.504318 (+262224us) negotiation.cc:327] Negotiation complete: Network error: Client connection negotiation failed: client connection to 0.0.0.0:40381: BlockingRecv error: recv error from unknown peer: Transport endpoint is not connected (error 107)
Metrics: {"client-negotiator.queue_time_us":31}
[       OK ] Parameters/TestRpcSocketTxRxQueue.OverCapacity/0 (1031 ms)
[----------] 1 test from Parameters/TestRpcSocketTxRxQueue (1031 ms total)

[----------] Global test environment tear-down
[==========] 21 tests from 2 test suites ran. (44230 ms total)
[  PASSED  ] 20 tests.
[  FAILED  ] 1 test, listed below:
[  FAILED  ] Parameters/TestRpc.TestCallWithChainCertAndChainCA/SSL_TCP, where GetParam() = (true, false)

 1 FAILED TEST