Diagnosed failure

Parameters/TestRpc.TestCallWithChainCertAndRootCA/SSL_UnixSocket: /data0/somelongdirectorytoavoidrpathissues/src/kudu/src/kudu/rpc/rpc-test.cc:303: Failure
Failed
Bad status: Runtime error: could not verify certificate chain (error with cert: subject=CN = localhost, ST = sadfjas, C = AS, emailAddress = sdflkdsajf, O = lskdfjlsad, OU = sldfkja, issuer=C = AS, ST = ASDfkjdhf, L = lskdjf, O = saldfja, OU = skdjf, CN = localhost, emailAddress = sadjflkadsj): : certificate has expired
Google Test trace:
/data0/somelongdirectorytoavoidrpathissues/src/kudu/src/kudu/rpc/rpc-test.cc:300: Connecting to unix:/tmp/dist-test-task07XxQs/test-tmp/rpc-test-1b0b1243d3254aa2be2480d1147e86ce.sock
I20260927 23:30:26.199911  7955 test_util.cc:175] -----------------------------------------------
I20260927 23:30:26.200163  7955 test_util.cc:176] Had fatal failures, leaving test files at /tmp/dist-test-task07XxQs/test-tmp/rpc-test.2.Parameters_TestRpc.TestCallWithChainCertAndRootCA_SSL_UnixSocket.1790551822595439-7955-0

Full log

Note: This is test shard 3 of 8.
[==========] Running 21 tests from 2 test suites.
[----------] Global test environment set-up.
[----------] 1 test from TestRpc
[ RUN      ] TestRpc.TestNegotiationTimeout
WARNING: Logging before InitGoogleLogging() is written to STDERR
I20260927 23:30:22.790141  7955 rpc-test-base.h:595] status: Timed out: connection negotiation to 0.0.0.0:39505 for RPC Sleep timed out after 0.100s (ON_OUTBOUND_QUEUE), seconds elapsed: 0.101351
W20260927 23:30:25.876386  7965 negotiation.cc:337] Failed RPC negotiation. Trace:
0927 23:30:22.689846 (+     0us) reactor.cc:625] Submitting negotiation task for client connection to 0.0.0.0:39505 (local address 127.0.0.1:50800)
0927 23:30:22.690765 (+   919us) negotiation.cc:107] Waiting for socket to connect
0927 23:30:22.690823 (+    58us) client_negotiation.cc:174] Beginning negotiation
0927 23:30:22.703937 (+ 13114us) client_negotiation.cc:252] Sending NEGOTIATE NegotiatePB request
0927 23:30:25.875022 (+3171085us) negotiation.cc:327] Negotiation complete: Timed out: Client connection negotiation failed: client connection to 0.0.0.0:39505: received 0 of 4 requested bytes
Metrics: {"client-negotiator.queue_time_us":260}
[       OK ] TestRpc.TestNegotiationTimeout (3229 ms)
[----------] 1 test from TestRpc (3229 ms total)

[----------] 20 tests from Parameters/TestRpc
[ RUN      ] Parameters/TestRpc.TestAcceptorPoolStartStop/SSL_UnixSocket
I20260927 23:30:25.920682  7981 acceptor_pool.cc:254] collecting diagnostics on the listening RPC socket unix:/tmp/dist-test-task07XxQs/test-tmp/rpc-test-147aef86447d4a4091eddd28f2e3dc6d.sock every 8 connection(s)
I20260927 23:30:25.922720  7982 acceptor_pool.cc:254] collecting diagnostics on the listening RPC socket unix:/tmp/dist-test-task07XxQs/test-tmp/rpc-test-147aef86447d4a4091eddd28f2e3dc6d.sock every 8 connection(s)
I20260927 23:30:25.968827  7992 acceptor_pool.cc:254] collecting diagnostics on the listening RPC socket unix:/tmp/dist-test-task07XxQs/test-tmp/rpc-test-147aef86447d4a4091eddd28f2e3dc6d.sock every 8 connection(s)
I20260927 23:30:25.970552  7993 acceptor_pool.cc:254] collecting diagnostics on the listening RPC socket unix:/tmp/dist-test-task07XxQs/test-tmp/rpc-test-147aef86447d4a4091eddd28f2e3dc6d.sock every 8 connection(s)
I20260927 23:30:25.991521  8003 acceptor_pool.cc:254] collecting diagnostics on the listening RPC socket unix:/tmp/dist-test-task07XxQs/test-tmp/rpc-test-147aef86447d4a4091eddd28f2e3dc6d.sock every 8 connection(s)
I20260927 23:30:25.992304  8004 acceptor_pool.cc:254] collecting diagnostics on the listening RPC socket unix:/tmp/dist-test-task07XxQs/test-tmp/rpc-test-147aef86447d4a4091eddd28f2e3dc6d.sock every 8 connection(s)
I20260927 23:30:26.015268  8014 acceptor_pool.cc:254] collecting diagnostics on the listening RPC socket unix:/tmp/dist-test-task07XxQs/test-tmp/rpc-test-147aef86447d4a4091eddd28f2e3dc6d.sock every 8 connection(s)
I20260927 23:30:26.016037  8015 acceptor_pool.cc:254] collecting diagnostics on the listening RPC socket unix:/tmp/dist-test-task07XxQs/test-tmp/rpc-test-147aef86447d4a4091eddd28f2e3dc6d.sock every 8 connection(s)
I20260927 23:30:26.033614  8025 acceptor_pool.cc:254] collecting diagnostics on the listening RPC socket unix:/tmp/dist-test-task07XxQs/test-tmp/rpc-test-147aef86447d4a4091eddd28f2e3dc6d.sock every 8 connection(s)
I20260927 23:30:26.034452  8026 acceptor_pool.cc:254] collecting diagnostics on the listening RPC socket unix:/tmp/dist-test-task07XxQs/test-tmp/rpc-test-147aef86447d4a4091eddd28f2e3dc6d.sock every 8 connection(s)
[       OK ] Parameters/TestRpc.TestAcceptorPoolStartStop/SSL_UnixSocket (157 ms)
[ RUN      ] Parameters/TestRpc.TestCall/SSL_UnixSocket
I20260927 23:30:26.075917  8038 acceptor_pool.cc:254] collecting diagnostics on the listening RPC socket unix:/tmp/dist-test-task07XxQs/test-tmp/rpc-test-f2575eafcbc64bd2a8e62b16f8f21447.sock every 8 connection(s)
I20260927 23:30:26.078702  8039 acceptor_pool.cc:254] collecting diagnostics on the listening RPC socket unix:/tmp/dist-test-task07XxQs/test-tmp/rpc-test-f2575eafcbc64bd2a8e62b16f8f21447.sock every 8 connection(s)
I20260927 23:30:26.084781  7955 rpc-test.cc:234] Connecting to unix:/tmp/dist-test-task07XxQs/test-tmp/rpc-test-f2575eafcbc64bd2a8e62b16f8f21447.sock
W20260927 23:30:26.141547  8035 connection.cc:196] Error closing socket: Network error: TlsSocket::Close: Broken pipe
[       OK ] Parameters/TestRpc.TestCall/SSL_UnixSocket (111 ms)
[ RUN      ] Parameters/TestRpc.TestCallWithChainCertAndRootCA/SSL_UnixSocket
I20260927 23:30:26.176505  8063 acceptor_pool.cc:254] collecting diagnostics on the listening RPC socket unix:/tmp/dist-test-task07XxQs/test-tmp/rpc-test-1b0b1243d3254aa2be2480d1147e86ce.sock every 8 connection(s)
I20260927 23:30:26.177340  8064 acceptor_pool.cc:254] collecting diagnostics on the listening RPC socket unix:/tmp/dist-test-task07XxQs/test-tmp/rpc-test-1b0b1243d3254aa2be2480d1147e86ce.sock every 8 connection(s)
/data0/somelongdirectorytoavoidrpathissues/src/kudu/src/kudu/rpc/rpc-test.cc:303: Failure
Failed
Bad status: Runtime error: could not verify certificate chain (error with cert: subject=CN = localhost, ST = sadfjas, C = AS, emailAddress = sdflkdsajf, O = lskdfjlsad, OU = sldfkja, issuer=C = AS, ST = ASDfkjdhf, L = lskdjf, O = saldfja, OU = skdjf, CN = localhost, emailAddress = sadjflkadsj): : certificate has expired
Google Test trace:
/data0/somelongdirectorytoavoidrpathissues/src/kudu/src/kudu/rpc/rpc-test.cc:300: Connecting to unix:/tmp/dist-test-task07XxQs/test-tmp/rpc-test-1b0b1243d3254aa2be2480d1147e86ce.sock
I20260927 23:30:26.199911  7955 test_util.cc:175] -----------------------------------------------
I20260927 23:30:26.200163  7955 test_util.cc:176] Had fatal failures, leaving test files at /tmp/dist-test-task07XxQs/test-tmp/rpc-test.2.Parameters_TestRpc.TestCallWithChainCertAndRootCA_SSL_UnixSocket.1790551822595439-7955-0
[  FAILED  ] Parameters/TestRpc.TestCallWithChainCertAndRootCA/SSL_UnixSocket, where GetParam() = (true, true) (49 ms)
[ RUN      ] Parameters/TestRpc.TestCallWithBadPasswordProtectedKey/SSL_UnixSocket
[       OK ] Parameters/TestRpc.TestCallWithBadPasswordProtectedKey/SSL_UnixSocket (35 ms)
[ RUN      ] Parameters/TestRpc.TestInvalidMethodCall/SSL_UnixSocket
I20260927 23:30:26.261004  8100 acceptor_pool.cc:254] collecting diagnostics on the listening RPC socket unix:/tmp/dist-test-task07XxQs/test-tmp/rpc-test-7b852db9bf7944069a59f6db060cc03d.sock every 8 connection(s)
I20260927 23:30:26.261925  8101 acceptor_pool.cc:254] collecting diagnostics on the listening RPC socket unix:/tmp/dist-test-task07XxQs/test-tmp/rpc-test-7b852db9bf7944069a59f6db060cc03d.sock every 8 connection(s)
I20260927 23:30:26.265781  7955 rpc-test.cc:406] Connecting to unix:/tmp/dist-test-task07XxQs/test-tmp/rpc-test-7b852db9bf7944069a59f6db060cc03d.sock
W20260927 23:30:26.300707  8097 connection.cc:196] Error closing socket: Network error: TlsSocket::Close: Broken pipe
[       OK ] Parameters/TestRpc.TestInvalidMethodCall/SSL_UnixSocket (70 ms)
[ RUN      ] Parameters/TestRpc.TestHighFDs/SSL_UnixSocket
I20260927 23:30:26.534751  8125 acceptor_pool.cc:254] collecting diagnostics on the listening RPC socket unix:/tmp/dist-test-task07XxQs/test-tmp/rpc-test-4e9f4ea285404450aee1c36e373b01ce.sock every 8 connection(s)
I20260927 23:30:26.535619  8126 acceptor_pool.cc:254] collecting diagnostics on the listening RPC socket unix:/tmp/dist-test-task07XxQs/test-tmp/rpc-test-4e9f4ea285404450aee1c36e373b01ce.sock every 8 connection(s)
[       OK ] Parameters/TestRpc.TestHighFDs/SSL_UnixSocket (274 ms)
[ RUN      ] Parameters/TestRpc.TestConnectionAlwaysKeepalive/SSL_UnixSocket
I20260927 23:30:26.605701  8148 acceptor_pool.cc:254] collecting diagnostics on the listening RPC socket unix:/tmp/dist-test-task07XxQs/test-tmp/rpc-test-d86c3c99473f4f1d8a4d4cf6730f8962.sock every 8 connection(s)
I20260927 23:30:26.606488  8149 acceptor_pool.cc:254] collecting diagnostics on the listening RPC socket unix:/tmp/dist-test-task07XxQs/test-tmp/rpc-test-d86c3c99473f4f1d8a4d4cf6730f8962.sock every 8 connection(s)
I20260927 23:30:26.609983  7955 rpc-test.cc:532] Connecting to unix:/tmp/dist-test-task07XxQs/test-tmp/rpc-test-d86c3c99473f4f1d8a4d4cf6730f8962.sock
W20260927 23:30:29.664812  8147 connection.cc:196] Error closing socket: Network error: TlsSocket::Close: Broken pipe
[       OK ] Parameters/TestRpc.TestConnectionAlwaysKeepalive/SSL_UnixSocket (3089 ms)
[ RUN      ] Parameters/TestRpc.TestReopenOutboundConnections/SSL_UnixSocket
I20260927 23:30:29.688789  8171 acceptor_pool.cc:254] collecting diagnostics on the listening RPC socket unix:/tmp/dist-test-task07XxQs/test-tmp/rpc-test-792ead6cf46e4d94a20c6caf9516d711.sock every 8 connection(s)
I20260927 23:30:29.689594  8172 acceptor_pool.cc:254] collecting diagnostics on the listening RPC socket unix:/tmp/dist-test-task07XxQs/test-tmp/rpc-test-792ead6cf46e4d94a20c6caf9516d711.sock every 8 connection(s)
I20260927 23:30:29.693246  7955 rpc-test.cc:658] Connecting to unix:/tmp/dist-test-task07XxQs/test-tmp/rpc-test-792ead6cf46e4d94a20c6caf9516d711.sock
W20260927 23:30:29.718997  8170 connection.cc:196] Error closing socket: Network error: TlsSocket::Close: Broken pipe
W20260927 23:30:29.729182  8170 connection.cc:196] Error closing socket: Network error: TlsSocket::Close: Broken pipe
W20260927 23:30:29.739238  8170 connection.cc:196] Error closing socket: Network error: TlsSocket::Close: Broken pipe
W20260927 23:30:29.749372  8170 connection.cc:196] Error closing socket: Network error: TlsSocket::Close: Broken pipe
W20260927 23:30:29.759761  8170 connection.cc:196] Error closing socket: Network error: TlsSocket::Close: Broken pipe
W20260927 23:30:29.770318  8170 connection.cc:196] Error closing socket: Network error: TlsSocket::Close: Broken pipe
W20260927 23:30:29.781095  8170 connection.cc:196] Error closing socket: Network error: TlsSocket::Close: Broken pipe
W20260927 23:30:29.791940  8170 connection.cc:196] Error closing socket: Network error: TlsSocket::Close: Broken pipe
W20260927 23:30:29.804777  8170 connection.cc:196] Error closing socket: Network error: TlsSocket::Close: Broken pipe
W20260927 23:30:29.817728  8170 connection.cc:196] Error closing socket: Network error: TlsSocket::Close: Broken pipe
W20260927 23:30:29.827904  8170 connection.cc:196] Error closing socket: Network error: TlsSocket::Close: Broken pipe
W20260927 23:30:29.838202  8170 connection.cc:196] Error closing socket: Network error: TlsSocket::Close: Broken pipe
W20260927 23:30:29.848474  8170 connection.cc:196] Error closing socket: Network error: TlsSocket::Close: Broken pipe
W20260927 23:30:29.859409  8170 connection.cc:196] Error closing socket: Network error: TlsSocket::Close: Broken pipe
W20260927 23:30:29.859332  8171 acceptor_pool.cc:285] unable to collect diagnostics on RPC socket unix:/tmp/dist-test-task07XxQs/test-tmp/rpc-test-792ead6cf46e4d94a20c6caf9516d711.sock: Not implemented: netlink diagnostics is currently supported only on IPv4 TCP sockets
W20260927 23:30:29.870632  8170 connection.cc:196] Error closing socket: Network error: TlsSocket::Close: Broken pipe
W20260927 23:30:29.882341  8170 connection.cc:196] Error closing socket: Network error: TlsSocket::Close: Broken pipe
W20260927 23:30:29.893311  8170 connection.cc:196] Error closing socket: Network error: TlsSocket::Close: Broken pipe
W20260927 23:30:29.904601  8170 connection.cc:196] Error closing socket: Network error: TlsSocket::Close: Broken pipe
W20260927 23:30:29.916168  8170 connection.cc:196] Error closing socket: Network error: TlsSocket::Close: Broken pipe
W20260927 23:30:29.927618  8170 connection.cc:196] Error closing socket: Network error: TlsSocket::Close: Broken pipe
W20260927 23:30:29.939076  8170 connection.cc:196] Error closing socket: Network error: TlsSocket::Close: Broken pipe
W20260927 23:30:29.949364  8170 connection.cc:196] Error closing socket: Network error: TlsSocket::Close: Broken pipe
W20260927 23:30:29.960512  8170 connection.cc:196] Error closing socket: Network error: TlsSocket::Close: Broken pipe
W20260927 23:30:29.971652  8170 connection.cc:196] Error closing socket: Network error: TlsSocket::Close: Broken pipe
W20260927 23:30:30.002290  8170 connection.cc:196] Error closing socket: Network error: TlsSocket::Close: Broken pipe
W20260927 23:30:30.012677  8170 connection.cc:196] Error closing socket: Network error: TlsSocket::Close: Broken pipe
W20260927 23:30:30.022811  8170 connection.cc:196] Error closing socket: Network error: TlsSocket::Close: Broken pipe
W20260927 23:30:30.033097  8170 connection.cc:196] Error closing socket: Network error: TlsSocket::Close: Broken pipe
W20260927 23:30:30.042826  8170 connection.cc:196] Error closing socket: Network error: TlsSocket::Close: Broken pipe
[       OK ] Parameters/TestRpc.TestReopenOutboundConnections/SSL_UnixSocket (390 ms)
[ RUN      ] Parameters/TestRpc.TestConnectionNetworkPlane/SSL_UnixSocket
I20260927 23:30:30.080761  8194 acceptor_pool.cc:254] collecting diagnostics on the listening RPC socket unix:/tmp/dist-test-task07XxQs/test-tmp/rpc-test-4e866fa1fa3947c98d7a4275289ea120.sock every 8 connection(s)
I20260927 23:30:30.081679  8195 acceptor_pool.cc:254] collecting diagnostics on the listening RPC socket unix:/tmp/dist-test-task07XxQs/test-tmp/rpc-test-4e866fa1fa3947c98d7a4275289ea120.sock every 8 connection(s)
I20260927 23:30:30.085417  7955 rpc-test.cc:772] Connecting to unix:/tmp/dist-test-task07XxQs/test-tmp/rpc-test-4e866fa1fa3947c98d7a4275289ea120.sock
W20260927 23:30:30.139453  8193 connection.cc:196] Error closing socket: Network error: TlsSocket::Close: Broken pipe
W20260927 23:30:30.140367  8193 connection.cc:196] Error closing socket: Network error: TlsSocket::Close: Broken pipe
[       OK ] Parameters/TestRpc.TestConnectionNetworkPlane/SSL_UnixSocket (84 ms)
[ RUN      ] Parameters/TestRpc.TestTCPKeepalive/SSL_UnixSocket
I20260927 23:30:30.186852  8219 acceptor_pool.cc:254] collecting diagnostics on the listening RPC socket unix:/tmp/dist-test-task07XxQs/test-tmp/rpc-test-2f985c862c444713af625869cf0ba10d.sock every 8 connection(s)
I20260927 23:30:30.187740  8220 acceptor_pool.cc:254] collecting diagnostics on the listening RPC socket unix:/tmp/dist-test-task07XxQs/test-tmp/rpc-test-2f985c862c444713af625869cf0ba10d.sock every 8 connection(s)
I20260927 23:30:30.233732  8223 rpc-test-base.h:222] got call: sleep_micros: 8000000 deferred: true
I20260927 23:30:38.238313  8223 rpcz_store.cc:275] Call kudu.rpc.GenericCalculatorService.Sleep from unix:<unnamed> (request call id 0) took 8004 ms. Trace:
I20260927 23:30:38.238795  8223 rpcz_store.cc:276] 0927 23:30:30.233551 (+     0us) service_pool.cc:170] Inserting onto call queue
0927 23:30:30.233668 (+   117us) service_pool.cc:227] Handling call
0927 23:30:38.238075 (+8004407us) inbound_call.cc:173] Queueing success response
Metrics: {}
W20260927 23:30:38.246428  8216 connection.cc:196] Error closing socket: Network error: TlsSocket::Close: Broken pipe
[       OK ] Parameters/TestRpc.TestTCPKeepalive/SSL_UnixSocket (8109 ms)
[ RUN      ] Parameters/TestRpc.TestMaxSmallSidecars/SSL_UnixSocket
I20260927 23:30:38.291460  8245 acceptor_pool.cc:254] collecting diagnostics on the listening RPC socket unix:/tmp/dist-test-task07XxQs/test-tmp/rpc-test-75af6511b311400e9d8ed93c81443eaf.sock every 8 connection(s)
I20260927 23:30:38.292395  8246 acceptor_pool.cc:254] collecting diagnostics on the listening RPC socket unix:/tmp/dist-test-task07XxQs/test-tmp/rpc-test-75af6511b311400e9d8ed93c81443eaf.sock every 8 connection(s)
W20260927 23:30:38.480796  8242 connection.cc:196] Error closing socket: Network error: TlsSocket::Close: Broken pipe
[       OK ] Parameters/TestRpc.TestMaxSmallSidecars/SSL_UnixSocket (232 ms)
[ RUN      ] Parameters/TestRpc.TestCallTimeout/SSL_UnixSocket
I20260927 23:30:38.508364  8270 acceptor_pool.cc:254] collecting diagnostics on the listening RPC socket unix:/tmp/dist-test-task07XxQs/test-tmp/rpc-test-0c865622af7444689753dda19d6e8fcf.sock every 8 connection(s)
I20260927 23:30:38.509184  8271 acceptor_pool.cc:254] collecting diagnostics on the listening RPC socket unix:/tmp/dist-test-task07XxQs/test-tmp/rpc-test-0c865622af7444689753dda19d6e8fcf.sock every 8 connection(s)
I20260927 23:30:38.532574  7955 rpc-test-base.h:595] status: Timed out: connection negotiation to unix:/tmp/dist-test-task07XxQs/test-tmp/rpc-test-0c865622af7444689753dda19d6e8fcf.sock for RPC Sleep timed out after 0.000s (ON_OUTBOUND_QUEUE), seconds elapsed: 0.00261032
I20260927 23:30:38.541760  8274 rpc-test-base.h:222] got call: sleep_micros: 700000
I20260927 23:30:38.734448  7955 rpc-test-base.h:595] status: Timed out: Sleep RPC to unix:/tmp/dist-test-task07XxQs/test-tmp/rpc-test-0c865622af7444689753dda19d6e8fcf.sock timed out after 0.200s (SENT), seconds elapsed: 0.201474
I20260927 23:30:38.735967  8273 rpc-test-base.h:222] got call: sleep_micros: 2000000
W20260927 23:30:39.242504  8274 rpcz_store.cc:267] Call kudu.rpc.GenericCalculatorService.Sleep from unix:<unnamed> (request call id 1) took 701 ms (client timeout 200 ms). Trace:
W20260927 23:30:39.242892  8274 rpcz_store.cc:269] 0927 23:30:38.541540 (+     0us) service_pool.cc:170] Inserting onto call queue
0927 23:30:38.541690 (+   150us) service_pool.cc:227] Handling call
0927 23:30:39.242434 (+700744us) inbound_call.cc:173] Queueing success response
Metrics: {}
I20260927 23:30:40.236977  7955 rpc-test-base.h:595] status: Timed out: Sleep RPC to unix:/tmp/dist-test-task07XxQs/test-tmp/rpc-test-0c865622af7444689753dda19d6e8fcf.sock timed out after 1.500s (SENT), seconds elapsed: 1.50213
W20260927 23:30:40.736718  8273 rpcz_store.cc:267] Call kudu.rpc.GenericCalculatorService.Sleep from unix:<unnamed> (request call id 2) took 2001 ms (client timeout 1500 ms). Trace:
W20260927 23:30:40.737093  8273 rpcz_store.cc:269] 0927 23:30:38.735750 (+     0us) service_pool.cc:170] Inserting onto call queue
0927 23:30:38.735894 (+   144us) service_pool.cc:227] Handling call
0927 23:30:40.736637 (+2000743us) inbound_call.cc:173] Queueing success response
Metrics: {}
W20260927 23:30:40.737810  8267 connection.cc:441] server connection from unix:<unnamed> torn down before Call kudu.rpc.GenericCalculatorService.Sleep from unix:<unnamed> (request call id 2) could send its response
[       OK ] Parameters/TestRpc.TestCallTimeout/SSL_UnixSocket (2257 ms)
[ RUN      ] Parameters/TestRpc.TestServerShutsDown/SSL_UnixSocket
I20260927 23:30:40.747040  7955 rpc-test.cc:1125] Connecting to 0.0.0.0:37989
W20260927 23:30:40.766357  8287 negotiation.cc:337] Failed RPC negotiation. Trace:
0927 23:30:40.764664 (+     0us) reactor.cc:625] Submitting negotiation task for client connection to 0.0.0.0:37989 (local address 127.0.0.1:56516)
0927 23:30:40.765239 (+   575us) negotiation.cc:107] Waiting for socket to connect
0927 23:30:40.765280 (+    41us) client_negotiation.cc:174] Beginning negotiation
0927 23:30:40.765558 (+   278us) client_negotiation.cc:252] Sending NEGOTIATE NegotiatePB request
0927 23:30:40.765800 (+   242us) negotiation.cc:327] Negotiation complete: Network error: Client connection negotiation failed: client connection to 0.0.0.0:37989: BlockingWrite error: write error: Broken pipe (error 32)
Metrics: {"client-negotiator.queue_time_us":164}
[       OK ] Parameters/TestRpc.TestServerShutsDown/SSL_UnixSocket (24 ms)
[ RUN      ] Parameters/TestRpc.TimedOutOnResponseMetric/SSL_UnixSocket
I20260927 23:30:40.794657  8304 acceptor_pool.cc:254] collecting diagnostics on the listening RPC socket unix:/tmp/dist-test-task07XxQs/test-tmp/rpc-test-2c9c0731e9ef4f719a948ef8f7892178.sock every 8 connection(s)
I20260927 23:30:40.795408  8305 acceptor_pool.cc:254] collecting diagnostics on the listening RPC socket unix:/tmp/dist-test-task07XxQs/test-tmp/rpc-test-2c9c0731e9ef4f719a948ef8f7892178.sock every 8 connection(s)
W20260927 23:30:41.067003  8308 rpcz_store.cc:267] Call kudu.rpc_test.CalculatorService.Sleep from unix:<unnamed> (request call id 3) took 50 ms (client timeout 25 ms). Trace:
W20260927 23:30:41.067304  8308 rpcz_store.cc:269] 0927 23:30:41.016347 (+     0us) service_pool.cc:170] Inserting onto call queue
0927 23:30:41.016480 (+   133us) service_pool.cc:227] Handling call
0927 23:30:41.066918 (+ 50438us) inbound_call.cc:173] Queueing success response
Related trace 'test_child':
Metrics: {"test_sleep_us":50000,"child_traces":[["test_child",{"related_trace_metric":1}]]}
W20260927 23:30:41.126477  8308 rpcz_store.cc:267] Call kudu.rpc_test.CalculatorService.Sleep from unix:<unnamed> (request call id 4) took 50 ms (client timeout 50 ms). Trace:
W20260927 23:30:41.126755  8308 rpcz_store.cc:269] 0927 23:30:41.075848 (+     0us) service_pool.cc:170] Inserting onto call queue
0927 23:30:41.076030 (+   182us) service_pool.cc:227] Handling call
0927 23:30:41.126413 (+ 50383us) inbound_call.cc:173] Queueing success response
Related trace 'test_child':
Metrics: {"test_sleep_us":50000,"child_traces":[["test_child",{"related_trace_metric":1}]]}
W20260927 23:30:41.130443  8301 connection.cc:196] Error closing socket: Network error: TlsSocket::Close: Broken pipe
[       OK ] Parameters/TestRpc.TimedOutOnResponseMetric/SSL_UnixSocket (366 ms)
[ RUN      ] Parameters/TestRpc.AcceptorDispatchingTimesMetric/SSL_UnixSocket
I20260927 23:30:41.147872  8329 acceptor_pool.cc:254] collecting diagnostics on the listening RPC socket 0.0.0.0:45605 every 8 connection(s)
I20260927 23:30:41.148595  8330 acceptor_pool.cc:254] collecting diagnostics on the listening RPC socket 0.0.0.0:45605 every 8 connection(s)
W20260927 23:30:41.153824  8325 negotiation.cc:337] Failed RPC negotiation. Trace:
0927 23:30:41.152676 (+     0us) reactor.cc:625] Submitting negotiation task for server connection from 127.0.0.1:54198 (local address 127.0.0.1:45605)
0927 23:30:41.153112 (+   436us) server_negotiation.cc:206] Beginning negotiation
0927 23:30:41.153135 (+    23us) server_negotiation.cc:399] Waiting for connection header
0927 23:30:41.153361 (+   226us) negotiation.cc:327] Negotiation complete: Network error: Server connection negotiation failed: server connection from 127.0.0.1:54198: BlockingRecv error: recv got EOF from 127.0.0.1:54198 (error 108)
Metrics: {"server-negotiator.queue_time_us":123}
[       OK ] Parameters/TestRpc.AcceptorDispatchingTimesMetric/SSL_UnixSocket (23 ms)
[ RUN      ] Parameters/TestRpc.TestRpcCallbackDestroysMessenger/SSL_UnixSocket
[       OK ] Parameters/TestRpc.TestRpcCallbackDestroysMessenger/SSL_UnixSocket (20 ms)
[ RUN      ] Parameters/TestRpc.TestApplicationFeatureFlag/SSL_UnixSocket
I20260927 23:30:41.202911  8354 acceptor_pool.cc:254] collecting diagnostics on the listening RPC socket unix:/tmp/dist-test-task07XxQs/test-tmp/rpc-test-61f4a48cc06544c0bba2c6f0424e2ec7.sock every 8 connection(s)
I20260927 23:30:41.203747  8355 acceptor_pool.cc:254] collecting diagnostics on the listening RPC socket unix:/tmp/dist-test-task07XxQs/test-tmp/rpc-test-61f4a48cc06544c0bba2c6f0424e2ec7.sock every 8 connection(s)
W20260927 23:30:41.260936  8351 messenger.cc:357] Unable to handle RPC call: Not implemented: call requires unsupported application feature flags: 99
[       OK ] Parameters/TestRpc.TestApplicationFeatureFlag/SSL_UnixSocket (91 ms)
[ RUN      ] Parameters/TestRpc.TestCancellation/SSL_UnixSocket
I20260927 23:30:41.301213  8379 acceptor_pool.cc:254] collecting diagnostics on the listening RPC socket unix:/tmp/dist-test-task07XxQs/test-tmp/rpc-test-386c6b5e6ea6476d863038ea0689beff.sock every 8 connection(s)
I20260927 23:30:41.302013  8380 acceptor_pool.cc:254] collecting diagnostics on the listening RPC socket unix:/tmp/dist-test-task07XxQs/test-tmp/rpc-test-386c6b5e6ea6476d863038ea0689beff.sock every 8 connection(s)
I20260927 23:30:41.305651  7955 rpc-test.cc:1648] Connecting to unix:/tmp/dist-test-task07XxQs/test-tmp/rpc-test-386c6b5e6ea6476d863038ea0689beff.sock
I20260927 23:30:41.451283  7955 rpc-test-base.h:595] status: Aborted: Sleep RPC to unix:/tmp/dist-test-task07XxQs/test-tmp/rpc-test-386c6b5e6ea6476d863038ea0689beff.sock is cancelled in state READY, seconds elapsed: 0.000539117
I20260927 23:30:41.657147  7955 rpc-test-base.h:595] status: Aborted: Sleep RPC to unix:/tmp/dist-test-task07XxQs/test-tmp/rpc-test-386c6b5e6ea6476d863038ea0689beff.sock is cancelled in state SENT, seconds elapsed: 0.000800024
I20260927 23:30:41.657539  8382 rpc-test-base.h:222] got call: sleep_micros: 510000
I20260927 23:30:41.874348  7955 rpc-test-base.h:595] status: Aborted: Sleep RPC to unix:/tmp/dist-test-task07XxQs/test-tmp/rpc-test-386c6b5e6ea6476d863038ea0689beff.sock is cancelled in state SENT, seconds elapsed: 0.00105683
I20260927 23:30:41.874643  8381 rpc-test-base.h:222] got call: sleep_micros: 510000
I20260927 23:30:42.063604  7955 rpc-test-base.h:595] status: Aborted: Sleep RPC to unix:/tmp/dist-test-task07XxQs/test-tmp/rpc-test-386c6b5e6ea6476d863038ea0689beff.sock is cancelled in state SENT, seconds elapsed: 0.000971579
W20260927 23:30:42.076486  8383 rpcz_store.cc:267] Call kudu.rpc.GenericCalculatorService.Sleep from unix:<unnamed> (request call id 11) took 12 ms (client timeout 10 ms). Trace:
W20260927 23:30:42.076865  8383 rpcz_store.cc:269] 0927 23:30:42.063619 (+     0us) service_pool.cc:170] Inserting onto call queue
0927 23:30:42.076126 (+ 12507us) service_pool.cc:214] Skipping call since client already timed out
0927 23:30:42.076251 (+   125us) inbound_call.cc:173] Queueing failure response
Metrics: {}
I20260927 23:30:42.077404  8383 rpc-test-base.h:222] got call: sleep_micros: 1500000
W20260927 23:30:42.168183  8382 rpcz_store.cc:267] Call kudu.rpc.GenericCalculatorService.Sleep from unix:<unnamed> (request call id 3) took 510 ms (client timeout 10 ms). Trace:
W20260927 23:30:42.168527  8382 rpcz_store.cc:269] 0927 23:30:41.657306 (+     0us) service_pool.cc:170] Inserting onto call queue
0927 23:30:41.657482 (+   176us) service_pool.cc:227] Handling call
0927 23:30:42.168120 (+510638us) inbound_call.cc:173] Queueing success response
Metrics: {}
W20260927 23:30:42.385275  8381 rpcz_store.cc:267] Call kudu.rpc.GenericCalculatorService.Sleep from unix:<unnamed> (request call id 7) took 511 ms (client timeout 10 ms). Trace:
W20260927 23:30:42.385663  8381 rpcz_store.cc:269] 0927 23:30:41.874454 (+     0us) service_pool.cc:170] Inserting onto call queue
0927 23:30:41.874591 (+   137us) service_pool.cc:227] Handling call
0927 23:30:42.385206 (+510615us) inbound_call.cc:173] Queueing success response
Metrics: {}
I20260927 23:30:43.066442  7955 rpc-test-base.h:595] status: Timed out: Sleep RPC to unix:/tmp/dist-test-task07XxQs/test-tmp/rpc-test-386c6b5e6ea6476d863038ea0689beff.sock timed out after 1.000s (SENT), seconds elapsed: 1.00231
I20260927 23:30:43.068770  8381 rpc-test-base.h:222] got call: sleep_micros: 1500000
W20260927 23:30:43.578145  8383 rpcz_store.cc:267] Call kudu.rpc.GenericCalculatorService.Sleep from unix:<unnamed> (request call id 12) took 1513 ms (client timeout 1000 ms). Trace:
W20260927 23:30:43.578593  8383 rpcz_store.cc:269] 0927 23:30:42.064709 (+     0us) service_pool.cc:170] Inserting onto call queue
0927 23:30:42.077359 (+ 12650us) service_pool.cc:227] Handling call
0927 23:30:43.577959 (+1500600us) inbound_call.cc:173] Queueing success response
Metrics: {}
I20260927 23:30:44.068990  7955 rpc-test-base.h:595] status: Timed out: Sleep RPC to unix:/tmp/dist-test-task07XxQs/test-tmp/rpc-test-386c6b5e6ea6476d863038ea0689beff.sock timed out after 1.000s (SENT), seconds elapsed: 1.00195
W20260927 23:30:44.071218  8376 messenger.cc:357] Unable to handle RPC call: Not implemented: call requires unsupported application feature flags: 99, 1
W20260927 23:30:44.072935  8376 messenger.cc:357] Unable to handle RPC call: Not implemented: call requires unsupported application feature flags: 99, 1
W20260927 23:30:44.328106  8376 connection.cc:196] Error closing socket: Network error: TlsSocket::Close: Broken pipe
W20260927 23:30:44.569497  8381 rpcz_store.cc:267] Call kudu.rpc.GenericCalculatorService.Sleep from unix:<unnamed> (request call id 13) took 1501 ms (client timeout 1000 ms). Trace:
W20260927 23:30:44.569854  8381 rpcz_store.cc:269] 0927 23:30:43.068374 (+     0us) service_pool.cc:170] Inserting onto call queue
0927 23:30:43.068620 (+   246us) service_pool.cc:227] Handling call
0927 23:30:44.569424 (+1500804us) inbound_call.cc:173] Queueing success response
Metrics: {}
W20260927 23:30:44.570434  8376 connection.cc:441] server connection from unix:<unnamed> torn down before Call kudu.rpc.GenericCalculatorService.Sleep from unix:<unnamed> (request call id 13) could send its response
[       OK ] Parameters/TestRpc.TestCancellation/SSL_UnixSocket (3307 ms)
[ RUN      ] Parameters/TestRpc.TestCancellationMultiThreads/SSL_UnixSocket
I20260927 23:30:44.612941  8405 acceptor_pool.cc:254] collecting diagnostics on the listening RPC socket unix:/tmp/dist-test-task07XxQs/test-tmp/rpc-test-58987979e0394aac9e8e67974fb480d8.sock every 8 connection(s)
I20260927 23:30:44.613886  8406 acceptor_pool.cc:254] collecting diagnostics on the listening RPC socket unix:/tmp/dist-test-task07XxQs/test-tmp/rpc-test-58987979e0394aac9e8e67974fb480d8.sock every 8 connection(s)
I20260927 23:30:44.617401  7955 rpc-test.cc:1808] Connecting to unix:/tmp/dist-test-task07XxQs/test-tmp/rpc-test-58987979e0394aac9e8e67974fb480d8.sock
I20260927 23:30:44.786901  8419 test_util.cc:268] Using random seed: 1453920853
I20260927 23:30:44.788681  8420 test_util.cc:268] Using random seed: 1453922730
I20260927 23:30:44.791059  8421 test_util.cc:268] Using random seed: 1453925111
I20260927 23:30:44.792892  8422 test_util.cc:268] Using random seed: 1453926799
I20260927 23:30:44.794566  8423 test_util.cc:268] Using random seed: 1453928499
I20260927 23:30:44.795979  8424 test_util.cc:268] Using random seed: 1453929882
I20260927 23:30:44.798051  8425 test_util.cc:268] Using random seed: 1453931910
I20260927 23:30:44.799685  8426 test_util.cc:268] Using random seed: 1453933587
I20260927 23:30:44.801542  8427 test_util.cc:268] Using random seed: 1453935404
I20260927 23:30:44.803264  8428 test_util.cc:268] Using random seed: 1453937197
I20260927 23:30:44.804834  8429 test_util.cc:268] Using random seed: 1453938724
I20260927 23:30:44.806519  8430 test_util.cc:268] Using random seed: 1453940398
I20260927 23:30:44.808624  8431 test_util.cc:268] Using random seed: 1453942517
I20260927 23:30:44.810246  8432 test_util.cc:268] Using random seed: 1453944173
I20260927 23:30:44.812232  8433 test_util.cc:268] Using random seed: 1453946120
I20260927 23:30:44.819195  8434 test_util.cc:268] Using random seed: 1453953051
I20260927 23:30:44.820962  8435 test_util.cc:268] Using random seed: 1453954857
I20260927 23:30:44.822667  8436 test_util.cc:268] Using random seed: 1453956589
I20260927 23:30:44.824599  8437 test_util.cc:268] Using random seed: 1453958449
I20260927 23:30:44.826570  8438 test_util.cc:268] Using random seed: 1453960308
I20260927 23:30:44.828639  8439 test_util.cc:268] Using random seed: 1453962497
I20260927 23:30:44.830966  8440 test_util.cc:268] Using random seed: 1453964787
I20260927 23:30:44.835363  8441 test_util.cc:268] Using random seed: 1453969181
I20260927 23:30:44.837594  8442 test_util.cc:268] Using random seed: 1453971436
I20260927 23:30:44.843364  8443 test_util.cc:268] Using random seed: 1453977145
I20260927 23:30:44.845700  8444 test_util.cc:268] Using random seed: 1453979481
I20260927 23:30:44.851344  8445 test_util.cc:268] Using random seed: 1453985185
I20260927 23:30:44.853538  8446 test_util.cc:268] Using random seed: 1453987373
I20260927 23:30:44.859395  8447 test_util.cc:268] Using random seed: 1453993216
I20260927 23:30:44.863361  8448 test_util.cc:268] Using random seed: 1453997266
W20260927 23:31:05.754863  8402 connection.cc:196] Error closing socket: Network error: TlsSocket::Close: Broken pipe
[       OK ] Parameters/TestRpc.TestCancellationMultiThreads/SSL_UnixSocket (21196 ms)
[ RUN      ] Parameters/TestRpc.TestCallId/SSL_UnixSocket
I20260927 23:31:05.794803  8462 acceptor_pool.cc:254] collecting diagnostics on the listening RPC socket unix:/tmp/dist-test-task07XxQs/test-tmp/rpc-test-4351f9120cce4e16a52239d9bbcdf694.sock every 8 connection(s)
I20260927 23:31:05.795810  8463 acceptor_pool.cc:254] collecting diagnostics on the listening RPC socket unix:/tmp/dist-test-task07XxQs/test-tmp/rpc-test-4351f9120cce4e16a52239d9bbcdf694.sock every 8 connection(s)
W20260927 23:31:05.855816  8459 connection.cc:196] Error closing socket: Network error: TlsSocket::Close: Broken pipe
[       OK ] Parameters/TestRpc.TestCallId/SSL_UnixSocket (87 ms)
[----------] 20 tests from Parameters/TestRpc (39982 ms total)

[----------] Global test environment tear-down
[==========] 21 tests from 2 test suites ran. (43213 ms total)
[  PASSED  ] 20 tests.
[  FAILED  ] 1 test, listed below:
[  FAILED  ] Parameters/TestRpc.TestCallWithChainCertAndRootCA/SSL_UnixSocket, where GetParam() = (true, true)

 1 FAILED TEST
I20260927 23:31:05.881914  7955 logging.cc:424] LogThrottler /data0/somelongdirectorytoavoidrpathissues/src/kudu/src/kudu/rpc/acceptor_pool.cc:285: suppressed but not reported on 3 messages since previous log ~36 seconds ago