Diagnosed failure

Parameters/TestRpc.TestCallWithChainCertAndChainCA/SSL_TCP: /data0/somelongdirectorytoavoidrpathissues/src/kudu/src/kudu/rpc/rpc-test.cc:270: Failure
Failed
Bad status: Runtime error: could not verify certificate chain (error with cert: subject=CN = localhost, ST = sadfjas, C = AS, emailAddress = sdflkdsajf, O = lskdfjlsad, OU = sldfkja, issuer=C = AS, ST = ASDfkjdhf, L = lskdjf, O = saldfja, OU = skdjf, CN = localhost, emailAddress = sadjflkadsj): : certificate has expired
Google Test trace:
/data0/somelongdirectorytoavoidrpathissues/src/kudu/src/kudu/rpc/rpc-test.cc:267: Connecting to 0.0.0.0:42125
I20260925 14:50:25.334228  6775 test_util.cc:175] -----------------------------------------------
I20260925 14:50:25.334277  6775 test_util.cc:176] Had fatal failures, leaving test files at /tmp/dist-test-task0mdbbl/test-tmp/rpc-test.5.Parameters_TestRpc.TestCallWithChainCertAndChainCA_SSL_TCP.1790347825258955-6775-0

Full log

Note: This is test shard 6 of 8.
[==========] Running 21 tests from 2 test suites.
[----------] Global test environment set-up.
[----------] 20 tests from Parameters/TestRpc
[ RUN      ] Parameters/TestRpc.TestMessengerCreateDestroy/SSL_TCP
WARNING: Logging before InitGoogleLogging() is written to STDERR
I20260925 14:50:25.277141  6775 rpc-test.cc:169] started messenger TestCreateDestroy
[       OK ] Parameters/TestRpc.TestMessengerCreateDestroy/SSL_TCP (16 ms)
[ RUN      ] Parameters/TestRpc.TestNegotiationDeadlock/SSL_TCP
I20260925 14:50:25.283699  6795 acceptor_pool.cc:254] collecting diagnostics on the listening RPC socket 0.0.0.0:45145 every 8 connection(s)
I20260925 14:50:25.283699  6796 acceptor_pool.cc:254] collecting diagnostics on the listening RPC socket 0.0.0.0:45145 every 8 connection(s)
[       OK ] Parameters/TestRpc.TestNegotiationDeadlock/SSL_TCP (12 ms)
[ RUN      ] Parameters/TestRpc.TestCallWithChainCertAndChainCA/SSL_TCP
I20260925 14:50:25.330190  6811 acceptor_pool.cc:254] collecting diagnostics on the listening RPC socket 0.0.0.0:42125 every 8 connection(s)
I20260925 14:50:25.330190  6812 acceptor_pool.cc:254] collecting diagnostics on the listening RPC socket 0.0.0.0:42125 every 8 connection(s)
/data0/somelongdirectorytoavoidrpathissues/src/kudu/src/kudu/rpc/rpc-test.cc:270: Failure
Failed
Bad status: Runtime error: could not verify certificate chain (error with cert: subject=CN = localhost, ST = sadfjas, C = AS, emailAddress = sdflkdsajf, O = lskdfjlsad, OU = sldfkja, issuer=C = AS, ST = ASDfkjdhf, L = lskdjf, O = saldfja, OU = skdjf, CN = localhost, emailAddress = sadjflkadsj): : certificate has expired
Google Test trace:
/data0/somelongdirectorytoavoidrpathissues/src/kudu/src/kudu/rpc/rpc-test.cc:267: Connecting to 0.0.0.0:42125
I20260925 14:50:25.334228  6775 test_util.cc:175] -----------------------------------------------
I20260925 14:50:25.334277  6775 test_util.cc:176] Had fatal failures, leaving test files at /tmp/dist-test-task0mdbbl/test-tmp/rpc-test.5.Parameters_TestRpc.TestCallWithChainCertAndChainCA_SSL_TCP.1790347825258955-6775-0
[  FAILED  ] Parameters/TestRpc.TestCallWithChainCertAndChainCA/SSL_TCP, where GetParam() = (true, false) (43 ms)
[ RUN      ] Parameters/TestRpc.TestCallWithPasswordProtectedKey/SSL_TCP
I20260925 14:50:25.346172  6836 acceptor_pool.cc:254] collecting diagnostics on the listening RPC socket 0.0.0.0:41331 every 8 connection(s)
I20260925 14:50:25.346182  6837 acceptor_pool.cc:254] collecting diagnostics on the listening RPC socket 0.0.0.0:41331 every 8 connection(s)
[       OK ] Parameters/TestRpc.TestCallWithPasswordProtectedKey/SSL_TCP (24 ms)
[ RUN      ] Parameters/TestRpc.TestCallToBadServer/SSL_TCP
I20260925 14:50:25.391695  6775 rpc-test.cc:394] Status: Network error: Client connection negotiation failed: client connection to 0.0.0.0:0: connect: Connection refused (error 111)
I20260925 14:50:25.392001  6775 rpc-test.cc:394] Status: Network error: Client connection negotiation failed: client connection to 0.0.0.0:0: connect: Connection refused (error 111)
I20260925 14:50:25.392228  6775 rpc-test.cc:394] Status: Network error: Client connection negotiation failed: client connection to 0.0.0.0:0: connect: Connection refused (error 111)
I20260925 14:50:25.392457  6775 rpc-test.cc:394] Status: Network error: Client connection negotiation failed: client connection to 0.0.0.0:0: connect: Connection refused (error 111)
I20260925 14:50:25.392644  6775 rpc-test.cc:394] Status: Network error: Client connection negotiation failed: client connection to 0.0.0.0:0: connect: Connection refused (error 111)
[       OK ] Parameters/TestRpc.TestCallToBadServer/SSL_TCP (34 ms)
[ RUN      ] Parameters/TestRpc.TestWrongService/SSL_TCP
I20260925 14:50:25.414950  6871 acceptor_pool.cc:254] collecting diagnostics on the listening RPC socket 0.0.0.0:39513 every 8 connection(s)
I20260925 14:50:25.415014  6872 acceptor_pool.cc:254] collecting diagnostics on the listening RPC socket 0.0.0.0:39513 every 8 connection(s)
I20260925 14:50:25.452942  6870 messenger.cc:345] service WrongServiceName not registered on TestServer
[       OK ] Parameters/TestRpc.TestWrongService/SSL_TCP (61 ms)
[ RUN      ] Parameters/TestRpc.TestConnectionKeepalive/SSL_TCP
I20260925 14:50:25.466856  6895 acceptor_pool.cc:254] collecting diagnostics on the listening RPC socket 0.0.0.0:41281 every 8 connection(s)
I20260925 14:50:25.466856  6894 acceptor_pool.cc:254] collecting diagnostics on the listening RPC socket 0.0.0.0:41281 every 8 connection(s)
I20260925 14:50:25.467207  6775 rpc-test.cc:488] Connecting to 0.0.0.0:41281
[       OK ] Parameters/TestRpc.TestConnectionKeepalive/SSL_TCP (1051 ms)
[ RUN      ] Parameters/TestRpc.TestClientConnectionMetrics/SSL_TCP
I20260925 14:50:26.535730  6919 acceptor_pool.cc:254] collecting diagnostics on the listening RPC socket 0.0.0.0:40235 every 8 connection(s)
I20260925 14:50:26.535780  6920 acceptor_pool.cc:254] collecting diagnostics on the listening RPC socket 0.0.0.0:40235 every 8 connection(s)
I20260925 14:50:26.535934  6775 rpc-test.cc:569] Connecting to 0.0.0.0:40235
[       OK ] Parameters/TestRpc.TestClientConnectionMetrics/SSL_TCP (9398 ms)
[ RUN      ] Parameters/TestRpc.TestCredentialsPolicy/SSL_TCP
I20260925 14:50:35.913367  6942 acceptor_pool.cc:254] collecting diagnostics on the listening RPC socket 0.0.0.0:43687 every 8 connection(s)
I20260925 14:50:35.913465  6943 acceptor_pool.cc:254] collecting diagnostics on the listening RPC socket 0.0.0.0:43687 every 8 connection(s)
I20260925 14:50:35.913626  6775 rpc-test.cc:700] Connecting to 0.0.0.0:43687
[       OK ] Parameters/TestRpc.TestCredentialsPolicy/SSL_TCP (30 ms)
[ RUN      ] Parameters/TestRpc.TestCallLongerThanKeepalive/SSL_TCP
I20260925 14:50:35.942854  6967 acceptor_pool.cc:254] collecting diagnostics on the listening RPC socket 0.0.0.0:44637 every 8 connection(s)
I20260925 14:50:35.942919  6968 acceptor_pool.cc:254] collecting diagnostics on the listening RPC socket 0.0.0.0:44637 every 8 connection(s)
I20260925 14:50:35.970208  6971 rpc-test-base.h:222] got call: sleep_micros: 3000000 deferred: true
I20260925 14:50:38.970867  6971 rpcz_store.cc:275] Call kudu.rpc.GenericCalculatorService.Sleep from 127.0.0.1:34910 (request call id 0) took 3000 ms. Trace:
I20260925 14:50:38.970973  6971 rpcz_store.cc:276] 0925 14:50:35.970150 (+     0us) service_pool.cc:170] Inserting onto call queue
0925 14:50:35.970187 (+    37us) service_pool.cc:227] Handling call
0925 14:50:38.970850 (+3000663us) inbound_call.cc:173] Queueing success response
Metrics: {}
[       OK ] Parameters/TestRpc.TestCallLongerThanKeepalive/SSL_TCP (3037 ms)
[ RUN      ] Parameters/TestRpc.TestRpcSidecar/SSL_TCP
I20260925 14:50:38.984143  6992 acceptor_pool.cc:254] collecting diagnostics on the listening RPC socket 0.0.0.0:36339 every 8 connection(s)
I20260925 14:50:38.984182  6993 acceptor_pool.cc:254] collecting diagnostics on the listening RPC socket 0.0.0.0:36339 every 8 connection(s)
[       OK ] Parameters/TestRpc.TestRpcSidecar/SSL_TCP (56 ms)
[ RUN      ] Parameters/TestRpc.TestRpcSidecarLimits/SSL_TCP
I20260925 14:50:40.729588  7018 acceptor_pool.cc:254] collecting diagnostics on the listening RPC socket 0.0.0.0:45737 every 8 connection(s)
I20260925 14:50:40.729559  7017 acceptor_pool.cc:254] collecting diagnostics on the listening RPC socket 0.0.0.0:45737 every 8 connection(s)
W20260925 14:50:40.734715  6775 serialization.cc:72] Serialized kudu.rpc_test.PushStringsRequestPB (2147483654 bytes) is larger than the maximum configured RPC message size (52428800 bytes). Sending anyway, but peer may reject the data.
W20260925 14:50:40.737768  7014 connection.cc:535] server connection from 127.0.0.1:58930 recv error: Network error: RPC frame had a length of 2147483714, but we only support messages up to 52428800 bytes long.
W20260925 14:50:40.737818  7014 connection.cc:158] shutting down server connection from 127.0.0.1:58930 with pending inbound data: 4/2147483714 bytes received; last active 0 ns ago: status Network error: RPC frame had a length of 2147483714, but we only support messages up to 52428800 bytes long.
W20260925 14:50:40.738046  7030 connection.cc:196] Error closing socket: Network error: TlsSocket::Close: Connection reset by peer
I20260925 14:50:40.747068  7042 acceptor_pool.cc:254] collecting diagnostics on the listening RPC socket 0.0.0.0:43917 every 8 connection(s)
I20260925 14:50:40.747088  7043 acceptor_pool.cc:254] collecting diagnostics on the listening RPC socket 0.0.0.0:43917 every 8 connection(s)
W20260925 14:50:44.461680  7041 connection.cc:577] server connection from 127.0.0.1:49808: received bad data: 'Corruption: Invalid packet: message had a length of 2147483710, but we only support messages up to 2147483647 bytes
'
[       OK ] Parameters/TestRpc.TestRpcSidecarLimits/SSL_TCP (5434 ms)
[ RUN      ] Parameters/TestRpc.TestCallTimeoutDoesntAffectNegotiation/SSL_TCP
I20260925 14:50:44.496937  7067 acceptor_pool.cc:254] collecting diagnostics on the listening RPC socket 0.0.0.0:36123 every 8 connection(s)
I20260925 14:50:44.496981  7068 acceptor_pool.cc:254] collecting diagnostics on the listening RPC socket 0.0.0.0:36123 every 8 connection(s)
W20260925 14:50:44.502521  7063 negotiation.cc:266] Injecting 500ms delay in negotiation
I20260925 14:50:44.552836  6775 rpc-test-base.h:595] status: Timed out: connection negotiation to 0.0.0.0:36123 for RPC Sleep timed out after 0.050s (ON_OUTBOUND_QUEUE), seconds elapsed: 0.0506578
[       OK ] Parameters/TestRpc.TestCallTimeoutDoesntAffectNegotiation/SSL_TCP (543 ms)
[ RUN      ] Parameters/TestRpc.TestRpcHandlerLatencyMetric/SSL_TCP
I20260925 14:50:45.014693  7092 acceptor_pool.cc:254] collecting diagnostics on the listening RPC socket 0.0.0.0:34453 every 8 connection(s)
I20260925 14:50:45.014693  7093 acceptor_pool.cc:254] collecting diagnostics on the listening RPC socket 0.0.0.0:34453 every 8 connection(s)
I20260925 14:50:45.056370  6775 rpc-test.cc:1236] Sleep() min lat: 20287
I20260925 14:50:45.056476  6775 rpc-test.cc:1237] Sleep() mean lat: 20287
I20260925 14:50:45.056515  6775 rpc-test.cc:1238] Sleep() max lat: 20287
I20260925 14:50:45.056536  6775 rpc-test.cc:1239] Sleep() #calls: 1
[       OK ] Parameters/TestRpc.TestRpcHandlerLatencyMetric/SSL_TCP (50 ms)
[ RUN      ] Parameters/TestRpc.TimedOutOnResponseMetricServiceQueue/SSL_TCP
I20260925 14:50:45.063133  7118 acceptor_pool.cc:254] collecting diagnostics on the listening RPC socket 0.0.0.0:37351 every 8 connection(s)
I20260925 14:50:45.063184  7119 acceptor_pool.cc:254] collecting diagnostics on the listening RPC socket 0.0.0.0:37351 every 8 connection(s)
W20260925 14:50:45.126765  7120 rpcz_store.cc:267] Call kudu.rpc_test.CalculatorService.Sleep from 127.0.0.1:58738 (request call id 2) took 20 ms (client timeout 20 ms). Trace:
W20260925 14:50:45.126894  7120 rpcz_store.cc:269] 0925 14:50:45.106498 (+     0us) service_pool.cc:170] Inserting onto call queue
0925 14:50:45.126739 (+ 20241us) service_pool.cc:214] Skipping call since client already timed out
0925 14:50:45.126750 (+    11us) inbound_call.cc:173] Queueing failure response
Metrics: {}
[       OK ] Parameters/TestRpc.TimedOutOnResponseMetricServiceQueue/SSL_TCP (70 ms)
[ RUN      ] Parameters/TestRpc.RpcPendingConnectionsMetric/SSL_TCP
I20260925 14:50:45.130707  7141 acceptor_pool.cc:254] collecting diagnostics on the listening RPC socket 0.0.0.0:44601 every 8 connection(s)
I20260925 14:50:45.130787  7142 acceptor_pool.cc:254] collecting diagnostics on the listening RPC socket 0.0.0.0:44601 every 8 connection(s)
W20260925 14:50:45.131353  7137 negotiation.cc:337] Failed RPC negotiation. Trace:
0925 14:50:45.131172 (+     0us) reactor.cc:625] Submitting negotiation task for server connection from 127.0.0.1:60628 (local address 127.0.0.1:44601)
0925 14:50:45.131212 (+    40us) server_negotiation.cc:206] Beginning negotiation
0925 14:50:45.131214 (+     2us) server_negotiation.cc:399] Waiting for connection header
0925 14:50:45.131305 (+    91us) negotiation.cc:327] Negotiation complete: Network error: Server connection negotiation failed: server connection from 127.0.0.1:60628: BlockingRecv error: recv got EOF from 127.0.0.1:60628 (error 108)
Metrics: {"server-negotiator.queue_time_us":13}
[       OK ] Parameters/TestRpc.RpcPendingConnectionsMetric/SSL_TCP (13 ms)
[ RUN      ] Parameters/TestRpc.TestRpcContextClientDeadline/SSL_TCP
I20260925 14:50:45.157852  7157 acceptor_pool.cc:254] collecting diagnostics on the listening RPC socket 0.0.0.0:34285 every 8 connection(s)
I20260925 14:50:45.157881  7158 acceptor_pool.cc:254] collecting diagnostics on the listening RPC socket 0.0.0.0:34285 every 8 connection(s)
[       OK ] Parameters/TestRpc.TestRpcContextClientDeadline/SSL_TCP (46 ms)
[ RUN      ] Parameters/TestRpc.TestApplicationFeatureFlagUnsupportedServer/SSL_TCP
I20260925 14:50:45.219547  7182 acceptor_pool.cc:254] collecting diagnostics on the listening RPC socket 0.0.0.0:41229 every 8 connection(s)
I20260925 14:50:45.219584  7183 acceptor_pool.cc:254] collecting diagnostics on the listening RPC socket 0.0.0.0:41229 every 8 connection(s)
[       OK ] Parameters/TestRpc.TestApplicationFeatureFlagUnsupportedServer/SSL_TCP (45 ms)
[ RUN      ] Parameters/TestRpc.TestCancellationAsync/SSL_TCP
I20260925 14:50:45.251760  7207 acceptor_pool.cc:254] collecting diagnostics on the listening RPC socket 0.0.0.0:43657 every 8 connection(s)
I20260925 14:50:45.251813  7208 acceptor_pool.cc:254] collecting diagnostics on the listening RPC socket 0.0.0.0:43657 every 8 connection(s)
I20260925 14:50:45.251981  6775 rpc-test.cc:1716] Connecting to 0.0.0.0:43657
I20260925 14:50:45.264611  6775 test_util.cc:268] Using random seed: -682138400
I20260925 14:50:45.279448  7211 rpc-test-base.h:240] got call: sleep_micros: 500 pattern: 4294967295 num_repetitions: 2097152 sidecar_idx: 0
I20260925 14:50:45.291108  7211 rpc-test-base.h:240] got call: sleep_micros: 500 pattern: 4294967295 num_repetitions: 2097152 sidecar_idx: 0
I20260925 14:50:45.301631  7211 rpc-test-base.h:240] got call: sleep_micros: 500 pattern: 4294967295 num_repetitions: 2097152 sidecar_idx: 0
I20260925 14:50:45.313512  7211 rpc-test-base.h:240] got call: sleep_micros: 500 pattern: 4294967295 num_repetitions: 2097152 sidecar_idx: 0
I20260925 14:50:45.325096  7211 rpc-test-base.h:240] got call: sleep_micros: 500 pattern: 4294967295 num_repetitions: 2097152 sidecar_idx: 0
I20260925 14:50:45.337881  7211 rpc-test-base.h:240] got call: sleep_micros: 500 pattern: 4294967295 num_repetitions: 2097152 sidecar_idx: 0
I20260925 14:50:45.352001  7211 rpc-test-base.h:240] got call: sleep_micros: 500 pattern: 4294967295 num_repetitions: 2097152 sidecar_idx: 0
I20260925 14:50:45.366950  7211 rpc-test-base.h:240] got call: sleep_micros: 500 pattern: 4294967295 num_repetitions: 2097152 sidecar_idx: 0
W20260925 14:50:45.369719  7206 connection.cc:441] server connection from 127.0.0.1:57476 torn down before Call kudu.rpc.GenericCalculatorService.SleepWithSidecar from 127.0.0.1:57476 (request call id 9) could send its response
[       OK ] Parameters/TestRpc.TestCancellationAsync/SSL_TCP (136 ms)
[ RUN      ] Parameters/TestRpc.TestPerformanceBySocketType/SSL_TCP
I20260925 14:50:45.379680  7232 acceptor_pool.cc:254] collecting diagnostics on the listening RPC socket 0.0.0.0:37763 every 8 connection(s)
I20260925 14:50:45.379709  7233 acceptor_pool.cc:254] collecting diagnostics on the listening RPC socket 0.0.0.0:37763 every 8 connection(s)
I20260925 14:50:45.379873  6775 rpc-test.cc:1846] Connecting to 0.0.0.0:37763
I20260925 14:50:47.013613  6775 rpc-test.cc:1859] Sending 1024MB via ssl-enabled tcp socket: real 1.629s	user 1.474s	sys 1.428s
I20260925 14:50:48.691589  6775 rpc-test.cc:1859] Sending 1024MB via ssl-enabled tcp socket: real 1.678s	user 1.442s	sys 1.571s
I20260925 14:50:50.305503  6775 rpc-test.cc:1859] Sending 1024MB via ssl-enabled tcp socket: real 1.614s	user 1.454s	sys 1.426s
I20260925 14:50:52.041877  6775 rpc-test.cc:1859] Sending 1024MB via ssl-enabled tcp socket: real 1.736s	user 1.560s	sys 1.499s
I20260925 14:50:53.617189  6775 rpc-test.cc:1859] Sending 1024MB via ssl-enabled tcp socket: real 1.575s	user 1.406s	sys 1.407s
[       OK ] Parameters/TestRpc.TestPerformanceBySocketType/SSL_TCP (8248 ms)
[----------] 20 tests from Parameters/TestRpc (28357 ms total)

[----------] 1 test from Parameters/TestRpcSocketTxRxQueue
[ RUN      ] Parameters/TestRpcSocketTxRxQueue.OverCapacity/0
W20260925 14:50:53.883610  7249 negotiation.cc:337] Failed RPC negotiation. Trace:
0925 14:50:53.620475 (+     0us) reactor.cc:625] Submitting negotiation task for client connection to 0.0.0.0:37445 (local address 127.0.0.1:58884)
0925 14:50:53.620515 (+    40us) negotiation.cc:107] Waiting for socket to connect
0925 14:50:53.620524 (+     9us) client_negotiation.cc:174] Beginning negotiation
0925 14:50:53.620569 (+    45us) client_negotiation.cc:252] Sending NEGOTIATE NegotiatePB request
0925 14:50:53.883439 (+262870us) negotiation.cc:327] Negotiation complete: Network error: Client connection negotiation failed: client connection to 0.0.0.0:37445: BlockingRecv error: recv error from unknown peer: Transport endpoint is not connected (error 107)
Metrics: {"client-negotiator.queue_time_us":16}
W20260925 14:50:53.883618  7258 negotiation.cc:337] Failed RPC negotiation. Trace:
0925 14:50:53.621303 (+     0us) reactor.cc:625] Submitting negotiation task for client connection to 0.0.0.0:37445 (local address 127.0.0.1:58898)
0925 14:50:53.621353 (+    50us) negotiation.cc:107] Waiting for socket to connect
0925 14:50:53.621362 (+     9us) client_negotiation.cc:174] Beginning negotiation
0925 14:50:53.621402 (+    40us) client_negotiation.cc:252] Sending NEGOTIATE NegotiatePB request
0925 14:50:53.883439 (+262037us) negotiation.cc:327] Negotiation complete: Network error: Client connection negotiation failed: client connection to 0.0.0.0:37445: BlockingRecv error: recv error from unknown peer: Transport endpoint is not connected (error 107)
Metrics: {"client-negotiator.queue_time_us":30}
W20260925 14:50:53.883607  7276 negotiation.cc:337] Failed RPC negotiation. Trace:
0925 14:50:53.622972 (+     0us) reactor.cc:625] Submitting negotiation task for client connection to 0.0.0.0:37445 (local address 127.0.0.1:58910)
0925 14:50:53.623026 (+    54us) negotiation.cc:107] Waiting for socket to connect
0925 14:50:53.623035 (+     9us) client_negotiation.cc:174] Beginning negotiation
0925 14:50:53.623070 (+    35us) client_negotiation.cc:252] Sending NEGOTIATE NegotiatePB request
0925 14:50:53.883435 (+260365us) negotiation.cc:327] Negotiation complete: Network error: Client connection negotiation failed: client connection to 0.0.0.0:37445: BlockingRecv error: recv error from unknown peer: Transport endpoint is not connected (error 107)
Metrics: {"client-negotiator.queue_time_us":28}
W20260925 14:50:53.883867  7294 negotiation.cc:337] Failed RPC negotiation. Trace:
0925 14:50:53.624688 (+     0us) reactor.cc:625] Submitting negotiation task for client connection to 0.0.0.0:37445 (local address 127.0.0.1:58932)
0925 14:50:53.624736 (+    48us) negotiation.cc:107] Waiting for socket to connect
0925 14:50:53.624744 (+     8us) client_negotiation.cc:174] Beginning negotiation
0925 14:50:53.624784 (+    40us) client_negotiation.cc:252] Sending NEGOTIATE NegotiatePB request
0925 14:50:53.883768 (+258984us) negotiation.cc:327] Negotiation complete: Network error: Client connection negotiation failed: client connection to 0.0.0.0:37445: BlockingRecv error: recv error from unknown peer: Transport endpoint is not connected (error 107)
Metrics: {"client-negotiator.queue_time_us":28}
W20260925 14:50:53.883607  7267 negotiation.cc:337] Failed RPC negotiation. Trace:
0925 14:50:53.622133 (+     0us) reactor.cc:625] Submitting negotiation task for client connection to 0.0.0.0:37445 (local address 127.0.0.1:58908)
0925 14:50:53.622183 (+    50us) negotiation.cc:107] Waiting for socket to connect
0925 14:50:53.622192 (+     9us) client_negotiation.cc:174] Beginning negotiation
0925 14:50:53.622229 (+    37us) client_negotiation.cc:252] Sending NEGOTIATE NegotiatePB request
0925 14:50:53.883435 (+261206us) negotiation.cc:327] Negotiation complete: Network error: Client connection negotiation failed: client connection to 0.0.0.0:37445: BlockingRecv error: recv error from unknown peer: Transport endpoint is not connected (error 107)
Metrics: {"client-negotiator.queue_time_us":30}
W20260925 14:50:53.884028  7285 negotiation.cc:337] Failed RPC negotiation. Trace:
0925 14:50:53.623808 (+     0us) reactor.cc:625] Submitting negotiation task for client connection to 0.0.0.0:37445 (local address 127.0.0.1:58926)
0925 14:50:53.623855 (+    47us) negotiation.cc:107] Waiting for socket to connect
0925 14:50:53.623864 (+     9us) client_negotiation.cc:174] Beginning negotiation
0925 14:50:53.623900 (+    36us) client_negotiation.cc:252] Sending NEGOTIATE NegotiatePB request
0925 14:50:53.883679 (+259779us) negotiation.cc:327] Negotiation complete: Network error: Client connection negotiation failed: client connection to 0.0.0.0:37445: BlockingRecv error: recv error from unknown peer: Transport endpoint is not connected (error 107)
Metrics: {"client-negotiator.queue_time_us":28}
[       OK ] Parameters/TestRpcSocketTxRxQueue.OverCapacity/0 (1025 ms)
[----------] 1 test from Parameters/TestRpcSocketTxRxQueue (1025 ms total)

[----------] Global test environment tear-down
[==========] 21 tests from 2 test suites ran. (29383 ms total)
[  PASSED  ] 20 tests.
[  FAILED  ] 1 test, listed below:
[  FAILED  ] Parameters/TestRpc.TestCallWithChainCertAndChainCA/SSL_TCP, where GetParam() = (true, false)

 1 FAILED TEST