Diagnosed failure
Parameters/TestRpc.TestCallWithChainCertAndChainCA/SSL_UnixSocket: /data0/somelongdirectorytoavoidrpathissues/src/kudu/src/kudu/rpc/rpc-test.cc:270: Failure
Failed
Bad status: Runtime error: could not verify certificate chain (error with cert: subject=CN = localhost, ST = sadfjas, C = AS, emailAddress = sdflkdsajf, O = lskdfjlsad, OU = sldfkja, issuer=C = AS, ST = ASDfkjdhf, L = lskdjf, O = saldfja, OU = skdjf, CN = localhost, emailAddress = sadjflkadsj): : certificate has expired
Google Test trace:
/data0/somelongdirectorytoavoidrpathissues/src/kudu/src/kudu/rpc/rpc-test.cc:267: Connecting to unix:/tmp/dist-test-taskrSM4Rj/test-tmp/rpc-test-59150f5ce66645d087a9b58a2c56b5c9.sock
I20260924 00:21:24.301514 1212 test_util.cc:175] -----------------------------------------------
I20260924 00:21:24.301682 1212 test_util.cc:176] Had fatal failures, leaving test files at /tmp/dist-test-taskrSM4Rj/test-tmp/rpc-test.6.Parameters_TestRpc.TestCallWithChainCertAndChainCA_SSL_UnixSocket.1790209282938290-1212-0
Full log
Note: This is test shard 7 of 8.
[==========] Running 21 tests from 2 test suites.
[----------] Global test environment set-up.
[----------] 20 tests from Parameters/TestRpc
[ RUN ] Parameters/TestRpc.TestMessengerCreateDestroy/SSL_UnixSocket
WARNING: Logging before InitGoogleLogging() is written to STDERR
I20260924 00:21:23.034567 1212 rpc-test.cc:169] started messenger TestCreateDestroy
[ OK ] Parameters/TestRpc.TestMessengerCreateDestroy/SSL_UnixSocket (1173 ms)
[ RUN ] Parameters/TestRpc.TestNegotiationDeadlock/SSL_UnixSocket
I20260924 00:21:24.191824 1234 acceptor_pool.cc:254] collecting diagnostics on the listening RPC socket unix:/tmp/dist-test-taskrSM4Rj/test-tmp/rpc-test-1e6e5e9722e94d9f853063dd69393a34.sock every 8 connection(s)
I20260924 00:21:24.193394 1235 acceptor_pool.cc:254] collecting diagnostics on the listening RPC socket unix:/tmp/dist-test-taskrSM4Rj/test-tmp/rpc-test-1e6e5e9722e94d9f853063dd69393a34.sock every 8 connection(s)
[ OK ] Parameters/TestRpc.TestNegotiationDeadlock/SSL_UnixSocket (81 ms)
[ RUN ] Parameters/TestRpc.TestCallWithChainCertAndChainCA/SSL_UnixSocket
I20260924 00:21:24.272421 1250 acceptor_pool.cc:254] collecting diagnostics on the listening RPC socket unix:/tmp/dist-test-taskrSM4Rj/test-tmp/rpc-test-59150f5ce66645d087a9b58a2c56b5c9.sock every 8 connection(s)
I20260924 00:21:24.274691 1251 acceptor_pool.cc:254] collecting diagnostics on the listening RPC socket unix:/tmp/dist-test-taskrSM4Rj/test-tmp/rpc-test-59150f5ce66645d087a9b58a2c56b5c9.sock every 8 connection(s)
/data0/somelongdirectorytoavoidrpathissues/src/kudu/src/kudu/rpc/rpc-test.cc:270: Failure
Failed
Bad status: Runtime error: could not verify certificate chain (error with cert: subject=CN = localhost, ST = sadfjas, C = AS, emailAddress = sdflkdsajf, O = lskdfjlsad, OU = sldfkja, issuer=C = AS, ST = ASDfkjdhf, L = lskdjf, O = saldfja, OU = skdjf, CN = localhost, emailAddress = sadjflkadsj): : certificate has expired
Google Test trace:
/data0/somelongdirectorytoavoidrpathissues/src/kudu/src/kudu/rpc/rpc-test.cc:267: Connecting to unix:/tmp/dist-test-taskrSM4Rj/test-tmp/rpc-test-59150f5ce66645d087a9b58a2c56b5c9.sock
I20260924 00:21:24.301514 1212 test_util.cc:175] -----------------------------------------------
I20260924 00:21:24.301682 1212 test_util.cc:176] Had fatal failures, leaving test files at /tmp/dist-test-taskrSM4Rj/test-tmp/rpc-test.6.Parameters_TestRpc.TestCallWithChainCertAndChainCA_SSL_UnixSocket.1790209282938290-1212-0
[ FAILED ] Parameters/TestRpc.TestCallWithChainCertAndChainCA/SSL_UnixSocket, where GetParam() = (true, true) (56 ms)
[ RUN ] Parameters/TestRpc.TestCallWithPasswordProtectedKey/SSL_UnixSocket
I20260924 00:21:24.325858 1275 acceptor_pool.cc:254] collecting diagnostics on the listening RPC socket unix:/tmp/dist-test-taskrSM4Rj/test-tmp/rpc-test-172fe7a3f0e94f7a8b4a4f3e96c6eb94.sock every 8 connection(s)
I20260924 00:21:24.326584 1276 acceptor_pool.cc:254] collecting diagnostics on the listening RPC socket unix:/tmp/dist-test-taskrSM4Rj/test-tmp/rpc-test-172fe7a3f0e94f7a8b4a4f3e96c6eb94.sock every 8 connection(s)
W20260924 00:21:24.368360 1272 connection.cc:196] Error closing socket: Network error: TlsSocket::Close: Broken pipe
[ OK ] Parameters/TestRpc.TestCallWithPasswordProtectedKey/SSL_UnixSocket (72 ms)
[ RUN ] Parameters/TestRpc.TestCallToBadServer/SSL_UnixSocket
I20260924 00:21:24.392035 1212 rpc-test.cc:394] Status: Network error: Client connection negotiation failed: client connection to 0.0.0.0:0: connect: Connection refused (error 111)
I20260924 00:21:24.393600 1212 rpc-test.cc:394] Status: Network error: Client connection negotiation failed: client connection to 0.0.0.0:0: connect: Connection refused (error 111)
I20260924 00:21:24.395083 1212 rpc-test.cc:394] Status: Network error: Client connection negotiation failed: client connection to 0.0.0.0:0: connect: Connection refused (error 111)
I20260924 00:21:24.396493 1212 rpc-test.cc:394] Status: Network error: Client connection negotiation failed: client connection to 0.0.0.0:0: connect: Connection refused (error 111)
I20260924 00:21:24.398005 1212 rpc-test.cc:394] Status: Network error: Client connection negotiation failed: client connection to 0.0.0.0:0: connect: Connection refused (error 111)
[ OK ] Parameters/TestRpc.TestCallToBadServer/SSL_UnixSocket (26 ms)
[ RUN ] Parameters/TestRpc.TestWrongService/SSL_UnixSocket
I20260924 00:21:24.425390 1310 acceptor_pool.cc:254] collecting diagnostics on the listening RPC socket unix:/tmp/dist-test-taskrSM4Rj/test-tmp/rpc-test-9638d4e249f24fb699325ec6159e55f7.sock every 8 connection(s)
I20260924 00:21:24.426285 1311 acceptor_pool.cc:254] collecting diagnostics on the listening RPC socket unix:/tmp/dist-test-taskrSM4Rj/test-tmp/rpc-test-9638d4e249f24fb699325ec6159e55f7.sock every 8 connection(s)
I20260924 00:21:24.456853 1307 messenger.cc:345] service WrongServiceName not registered on TestServer
[ OK ] Parameters/TestRpc.TestWrongService/SSL_UnixSocket (63 ms)
[ RUN ] Parameters/TestRpc.TestConnectionKeepalive/SSL_UnixSocket
I20260924 00:21:24.486217 1333 acceptor_pool.cc:254] collecting diagnostics on the listening RPC socket unix:/tmp/dist-test-taskrSM4Rj/test-tmp/rpc-test-95866ae758a745cf884fc6d4b963d9c1.sock every 8 connection(s)
I20260924 00:21:24.486976 1334 acceptor_pool.cc:254] collecting diagnostics on the listening RPC socket unix:/tmp/dist-test-taskrSM4Rj/test-tmp/rpc-test-95866ae758a745cf884fc6d4b963d9c1.sock every 8 connection(s)
I20260924 00:21:24.490263 1212 rpc-test.cc:488] Connecting to unix:/tmp/dist-test-taskrSM4Rj/test-tmp/rpc-test-95866ae758a745cf884fc6d4b963d9c1.sock
W20260924 00:21:24.967835 1346 connection.cc:196] Error closing socket: Network error: TlsSocket::Close: Broken pipe
[ OK ] Parameters/TestRpc.TestConnectionKeepalive/SSL_UnixSocket (1088 ms)
[ RUN ] Parameters/TestRpc.TestClientConnectionMetrics/SSL_UnixSocket
I20260924 00:21:25.592242 1358 acceptor_pool.cc:254] collecting diagnostics on the listening RPC socket unix:/tmp/dist-test-taskrSM4Rj/test-tmp/rpc-test-c9314ecf437f43f0aedf8c4d77a295c1.sock every 8 connection(s)
I20260924 00:21:25.593080 1359 acceptor_pool.cc:254] collecting diagnostics on the listening RPC socket unix:/tmp/dist-test-taskrSM4Rj/test-tmp/rpc-test-c9314ecf437f43f0aedf8c4d77a295c1.sock every 8 connection(s)
I20260924 00:21:25.596340 1212 rpc-test.cc:569] Connecting to unix:/tmp/dist-test-taskrSM4Rj/test-tmp/rpc-test-c9314ecf437f43f0aedf8c4d77a295c1.sock
W20260924 00:23:43.633180 1355 connection.cc:196] Error closing socket: Network error: TlsSocket::Close: Broken pipe
[ OK ] Parameters/TestRpc.TestClientConnectionMetrics/SSL_UnixSocket (138087 ms)
[ RUN ] Parameters/TestRpc.TestCredentialsPolicy/SSL_UnixSocket
I20260924 00:23:43.657953 1395 acceptor_pool.cc:254] collecting diagnostics on the listening RPC socket unix:/tmp/dist-test-taskrSM4Rj/test-tmp/rpc-test-e2259cf9310f4c9980a47cf5f75a29bb.sock every 8 connection(s)
I20260924 00:23:43.658782 1396 acceptor_pool.cc:254] collecting diagnostics on the listening RPC socket unix:/tmp/dist-test-taskrSM4Rj/test-tmp/rpc-test-e2259cf9310f4c9980a47cf5f75a29bb.sock every 8 connection(s)
I20260924 00:23:43.661940 1212 rpc-test.cc:700] Connecting to unix:/tmp/dist-test-taskrSM4Rj/test-tmp/rpc-test-e2259cf9310f4c9980a47cf5f75a29bb.sock
W20260924 00:23:43.702739 1394 connection.cc:196] Error closing socket: Network error: TlsSocket::Close: Broken pipe
[ OK ] Parameters/TestRpc.TestCredentialsPolicy/SSL_UnixSocket (81 ms)
[ RUN ] Parameters/TestRpc.TestCallLongerThanKeepalive/SSL_UnixSocket
I20260924 00:23:43.754475 1420 acceptor_pool.cc:254] collecting diagnostics on the listening RPC socket unix:/tmp/dist-test-taskrSM4Rj/test-tmp/rpc-test-ac1ed942f82d46b09614038cff8d32ca.sock every 8 connection(s)
I20260924 00:23:43.755247 1421 acceptor_pool.cc:254] collecting diagnostics on the listening RPC socket unix:/tmp/dist-test-taskrSM4Rj/test-tmp/rpc-test-ac1ed942f82d46b09614038cff8d32ca.sock every 8 connection(s)
I20260924 00:23:43.789929 1424 rpc-test-base.h:222] got call: sleep_micros: 3000000 deferred: true
I20260924 00:23:46.794176 1424 rpcz_store.cc:275] Call kudu.rpc.GenericCalculatorService.Sleep from unix:<unnamed> (request call id 0) took 3004 ms. Trace:
I20260924 00:23:46.794518 1424 rpcz_store.cc:276] 0924 00:23:43.789770 (+ 0us) service_pool.cc:170] Inserting onto call queue
0924 00:23:43.789871 (+ 101us) service_pool.cc:227] Handling call
0924 00:23:46.794101 (+3004230us) inbound_call.cc:173] Queueing success response
Metrics: {}
[ OK ] Parameters/TestRpc.TestCallLongerThanKeepalive/SSL_UnixSocket (3080 ms)
[ RUN ] Parameters/TestRpc.TestRpcSidecar/SSL_UnixSocket
I20260924 00:23:46.831642 1445 acceptor_pool.cc:254] collecting diagnostics on the listening RPC socket unix:/tmp/dist-test-taskrSM4Rj/test-tmp/rpc-test-b1f0db1fcb834c8491cc091a0a4703a6.sock every 8 connection(s)
I20260924 00:23:46.832373 1446 acceptor_pool.cc:254] collecting diagnostics on the listening RPC socket unix:/tmp/dist-test-taskrSM4Rj/test-tmp/rpc-test-b1f0db1fcb834c8491cc091a0a4703a6.sock every 8 connection(s)
W20260924 00:23:47.346220 1442 connection.cc:196] Error closing socket: Network error: TlsSocket::Close: Broken pipe
[ OK ] Parameters/TestRpc.TestRpcSidecar/SSL_UnixSocket (547 ms)
[ RUN ] Parameters/TestRpc.TestRpcSidecarLimits/SSL_UnixSocket
I20260924 00:24:04.577188 1472 acceptor_pool.cc:254] collecting diagnostics on the listening RPC socket unix:/tmp/dist-test-taskrSM4Rj/test-tmp/rpc-test-472d4928795e4971a02c754a6887e200.sock every 8 connection(s)
I20260924 00:24:04.577978 1473 acceptor_pool.cc:254] collecting diagnostics on the listening RPC socket unix:/tmp/dist-test-taskrSM4Rj/test-tmp/rpc-test-472d4928795e4971a02c754a6887e200.sock every 8 connection(s)
W20260924 00:24:04.604022 1212 serialization.cc:72] Serialized kudu.rpc_test.PushStringsRequestPB (2147483654 bytes) is larger than the maximum configured RPC message size (52428800 bytes). Sending anyway, but peer may reject the data.
W20260924 00:24:04.613934 1469 connection.cc:535] server connection from unix:<unnamed> recv error: Network error: RPC frame had a length of 2147483714, but we only support messages up to 52428800 bytes long.
W20260924 00:24:04.614285 1469 connection.cc:158] shutting down server connection from unix:<unnamed> with pending inbound data: 4/2147483714 bytes received; last active 0 ns ago: status Network error: RPC frame had a length of 2147483714, but we only support messages up to 52428800 bytes long.
W20260924 00:24:04.615183 1485 connection.cc:698] client connection to unix:/tmp/dist-test-taskrSM4Rj/test-tmp/rpc-test-472d4928795e4971a02c754a6887e200.sock send error: Network error: failed to write to TLS socket: Broken pipe
W20260924 00:24:04.615825 1485 connection.cc:196] Error closing socket: Network error: TlsSocket::Close: Success
[ OK ] Parameters/TestRpc.TestRpcSidecarLimits/SSL_UnixSocket (17876 ms)
[ RUN ] Parameters/TestRpc.TestCallTimeoutDoesntAffectNegotiation/SSL_UnixSocket
I20260924 00:24:05.253105 1497 acceptor_pool.cc:254] collecting diagnostics on the listening RPC socket unix:/tmp/dist-test-taskrSM4Rj/test-tmp/rpc-test-fed55c942ed44065be2a42f6394efdf2.sock every 8 connection(s)
I20260924 00:24:05.253816 1498 acceptor_pool.cc:254] collecting diagnostics on the listening RPC socket unix:/tmp/dist-test-taskrSM4Rj/test-tmp/rpc-test-fed55c942ed44065be2a42f6394efdf2.sock every 8 connection(s)
W20260924 00:24:05.275713 1493 negotiation.cc:266] Injecting 500ms delay in negotiation
I20260924 00:24:05.325264 1212 rpc-test-base.h:595] status: Timed out: connection negotiation to unix:/tmp/dist-test-taskrSM4Rj/test-tmp/rpc-test-fed55c942ed44065be2a42f6394efdf2.sock for RPC Sleep timed out after 0.050s (ON_OUTBOUND_QUEUE), seconds elapsed: 0.0505282
W20260924 00:24:05.788872 1494 connection.cc:196] Error closing socket: Network error: TlsSocket::Close: Broken pipe
[ OK ] Parameters/TestRpc.TestCallTimeoutDoesntAffectNegotiation/SSL_UnixSocket (564 ms)
[ RUN ] Parameters/TestRpc.TestRpcHandlerLatencyMetric/SSL_UnixSocket
I20260924 00:24:05.815618 1522 acceptor_pool.cc:254] collecting diagnostics on the listening RPC socket unix:/tmp/dist-test-taskrSM4Rj/test-tmp/rpc-test-270f133d7e5a42d79ee8081bc2928137.sock every 8 connection(s)
I20260924 00:24:05.816393 1523 acceptor_pool.cc:254] collecting diagnostics on the listening RPC socket unix:/tmp/dist-test-taskrSM4Rj/test-tmp/rpc-test-270f133d7e5a42d79ee8081bc2928137.sock every 8 connection(s)
I20260924 00:24:05.873459 1212 rpc-test.cc:1236] Sleep() min lat: 21645
I20260924 00:24:05.873704 1212 rpc-test.cc:1237] Sleep() mean lat: 21645
I20260924 00:24:05.873893 1212 rpc-test.cc:1238] Sleep() max lat: 21645
I20260924 00:24:05.874054 1212 rpc-test.cc:1239] Sleep() #calls: 1
[ OK ] Parameters/TestRpc.TestRpcHandlerLatencyMetric/SSL_UnixSocket (87 ms)
[ RUN ] Parameters/TestRpc.TimedOutOnResponseMetricServiceQueue/SSL_UnixSocket
I20260924 00:24:05.906930 1548 acceptor_pool.cc:254] collecting diagnostics on the listening RPC socket unix:/tmp/dist-test-taskrSM4Rj/test-tmp/rpc-test-5136a5953c2c4d4d9006a019e187af66.sock every 8 connection(s)
I20260924 00:24:05.907647 1549 acceptor_pool.cc:254] collecting diagnostics on the listening RPC socket unix:/tmp/dist-test-taskrSM4Rj/test-tmp/rpc-test-5136a5953c2c4d4d9006a019e187af66.sock every 8 connection(s)
W20260924 00:24:06.004810 1550 rpcz_store.cc:267] Call kudu.rpc_test.CalculatorService.Sleep from unix:<unnamed> (request call id 2) took 20 ms (client timeout 20 ms). Trace:
W20260924 00:24:06.005177 1550 rpcz_store.cc:269] 0924 00:24:05.984353 (+ 0us) service_pool.cc:170] Inserting onto call queue
0924 00:24:06.004680 (+ 20327us) service_pool.cc:214] Skipping call since client already timed out
0924 00:24:06.004763 (+ 83us) inbound_call.cc:173] Queueing failure response
Metrics: {}
W20260924 00:24:06.007324 1545 connection.cc:196] Error closing socket: Network error: TlsSocket::Close: Broken pipe
[ OK ] Parameters/TestRpc.TimedOutOnResponseMetricServiceQueue/SSL_UnixSocket (131 ms)
[ RUN ] Parameters/TestRpc.RpcPendingConnectionsMetric/SSL_UnixSocket
I20260924 00:24:06.022257 1571 acceptor_pool.cc:254] collecting diagnostics on the listening RPC socket 0.0.0.0:43623 every 8 connection(s)
I20260924 00:24:06.022984 1572 acceptor_pool.cc:254] collecting diagnostics on the listening RPC socket 0.0.0.0:43623 every 8 connection(s)
W20260924 00:24:06.036162 1567 negotiation.cc:337] Failed RPC negotiation. Trace:
0924 00:24:06.034296 (+ 0us) reactor.cc:625] Submitting negotiation task for server connection from 127.0.0.1:45978 (local address 127.0.0.1:43623)
0924 00:24:06.034784 (+ 488us) server_negotiation.cc:206] Beginning negotiation
0924 00:24:06.034819 (+ 35us) server_negotiation.cc:399] Waiting for connection header
0924 00:24:06.035250 (+ 431us) negotiation.cc:327] Negotiation complete: Network error: Server connection negotiation failed: server connection from 127.0.0.1:45978: BlockingRecv error: recv got EOF from 127.0.0.1:45978 (error 108)
Metrics: {"server-negotiator.queue_time_us":135}
[ OK ] Parameters/TestRpc.RpcPendingConnectionsMetric/SSL_UnixSocket (36 ms)
[ RUN ] Parameters/TestRpc.TestRpcContextClientDeadline/SSL_UnixSocket
I20260924 00:24:06.073273 1587 acceptor_pool.cc:254] collecting diagnostics on the listening RPC socket unix:/tmp/dist-test-taskrSM4Rj/test-tmp/rpc-test-63ee44900e2646b1ba0b939354fdee30.sock every 8 connection(s)
I20260924 00:24:06.073980 1588 acceptor_pool.cc:254] collecting diagnostics on the listening RPC socket unix:/tmp/dist-test-taskrSM4Rj/test-tmp/rpc-test-63ee44900e2646b1ba0b939354fdee30.sock every 8 connection(s)
[ OK ] Parameters/TestRpc.TestRpcContextClientDeadline/SSL_UnixSocket (84 ms)
[ RUN ] Parameters/TestRpc.TestApplicationFeatureFlagUnsupportedServer/SSL_UnixSocket
I20260924 00:24:06.157191 1612 acceptor_pool.cc:254] collecting diagnostics on the listening RPC socket unix:/tmp/dist-test-taskrSM4Rj/test-tmp/rpc-test-30cef4c04c484db2b3da9c6a6bcb4b23.sock every 8 connection(s)
I20260924 00:24:06.157891 1613 acceptor_pool.cc:254] collecting diagnostics on the listening RPC socket unix:/tmp/dist-test-taskrSM4Rj/test-tmp/rpc-test-30cef4c04c484db2b3da9c6a6bcb4b23.sock every 8 connection(s)
W20260924 00:24:06.199594 1609 connection.cc:196] Error closing socket: Network error: TlsSocket::Close: Broken pipe
[ OK ] Parameters/TestRpc.TestApplicationFeatureFlagUnsupportedServer/SSL_UnixSocket (70 ms)
[ RUN ] Parameters/TestRpc.TestCancellationAsync/SSL_UnixSocket
I20260924 00:24:06.230458 1637 acceptor_pool.cc:254] collecting diagnostics on the listening RPC socket unix:/tmp/dist-test-taskrSM4Rj/test-tmp/rpc-test-36b3765a799c42f881bbad0d877b1182.sock every 8 connection(s)
I20260924 00:24:06.231189 1638 acceptor_pool.cc:254] collecting diagnostics on the listening RPC socket unix:/tmp/dist-test-taskrSM4Rj/test-tmp/rpc-test-36b3765a799c42f881bbad0d877b1182.sock every 8 connection(s)
I20260924 00:24:06.234234 1212 rpc-test.cc:1716] Connecting to unix:/tmp/dist-test-taskrSM4Rj/test-tmp/rpc-test-36b3765a799c42f881bbad0d877b1182.sock
I20260924 00:24:06.247604 1212 test_util.cc:268] Using random seed: -1642201949
I20260924 00:24:06.465514 1641 rpc-test-base.h:240] got call: sleep_micros: 500 pattern: 4294967295 num_repetitions: 2097152 sidecar_idx: 0
I20260924 00:24:06.650403 1640 rpc-test-base.h:240] got call: sleep_micros: 500 pattern: 4294967295 num_repetitions: 2097152 sidecar_idx: 0
I20260924 00:24:06.893958 1640 rpc-test-base.h:240] got call: sleep_micros: 500 pattern: 4294967295 num_repetitions: 2097152 sidecar_idx: 0
I20260924 00:24:07.122974 1640 rpc-test-base.h:240] got call: sleep_micros: 500 pattern: 4294967295 num_repetitions: 2097152 sidecar_idx: 0
I20260924 00:24:07.326964 1640 rpc-test-base.h:240] got call: sleep_micros: 500 pattern: 4294967295 num_repetitions: 2097152 sidecar_idx: 0
I20260924 00:24:07.537881 1640 rpc-test-base.h:240] got call: sleep_micros: 500 pattern: 4294967295 num_repetitions: 2097152 sidecar_idx: 0
I20260924 00:24:07.741286 1640 rpc-test-base.h:240] got call: sleep_micros: 500 pattern: 4294967295 num_repetitions: 2097152 sidecar_idx: 0
I20260924 00:24:07.950706 1640 rpc-test-base.h:240] got call: sleep_micros: 500 pattern: 4294967295 num_repetitions: 2097152 sidecar_idx: 0
I20260924 00:24:08.170008 1640 rpc-test-base.h:240] got call: sleep_micros: 500 pattern: 4294967295 num_repetitions: 2097152 sidecar_idx: 0
W20260924 00:24:08.184825 1634 connection.cc:196] Error closing socket: Network error: TlsSocket::Close: Broken pipe
W20260924 00:24:08.302989 1634 connection.cc:441] server connection from unix:<unnamed> torn down before Call kudu.rpc.GenericCalculatorService.SleepWithSidecar from unix:<unnamed> (request call id 9) could send its response
[ OK ] Parameters/TestRpc.TestCancellationAsync/SSL_UnixSocket (2108 ms)
[ RUN ] Parameters/TestRpc.TestPerformanceBySocketType/SSL_UnixSocket
I20260924 00:24:08.406299 1662 acceptor_pool.cc:254] collecting diagnostics on the listening RPC socket unix:/tmp/dist-test-taskrSM4Rj/test-tmp/rpc-test-db524501d57a4917a5d58068fb9ec57b.sock every 8 connection(s)
I20260924 00:24:08.407011 1663 acceptor_pool.cc:254] collecting diagnostics on the listening RPC socket unix:/tmp/dist-test-taskrSM4Rj/test-tmp/rpc-test-db524501d57a4917a5d58068fb9ec57b.sock every 8 connection(s)
I20260924 00:24:08.410029 1212 rpc-test.cc:1846] Connecting to unix:/tmp/dist-test-taskrSM4Rj/test-tmp/rpc-test-db524501d57a4917a5d58068fb9ec57b.sock
I20260924 00:24:29.644927 1212 rpc-test.cc:1859] Sending 1024MB via ssl-enabled unix socket: real 21.215s user 19.157s sys 12.635s
I20260924 00:24:50.813726 1212 rpc-test.cc:1859] Sending 1024MB via ssl-enabled unix socket: real 21.168s user 18.755s sys 12.813s
I20260924 00:25:12.136974 1212 rpc-test.cc:1859] Sending 1024MB via ssl-enabled unix socket: real 21.323s user 18.955s sys 12.917s
I20260924 00:25:33.394075 1212 rpc-test.cc:1859] Sending 1024MB via ssl-enabled unix socket: real 21.257s user 19.151s sys 12.593s
I20260924 00:25:54.816596 1212 rpc-test.cc:1859] Sending 1024MB via ssl-enabled unix socket: real 21.422s user 19.140s sys 12.878s
W20260924 00:25:54.822260 1659 connection.cc:196] Error closing socket: Network error: TlsSocket::Close: Broken pipe
[ OK ] Parameters/TestRpc.TestPerformanceBySocketType/SSL_UnixSocket (106521 ms)
[----------] 20 tests from Parameters/TestRpc (271844 ms total)
[----------] 1 test from Parameters/TestRpcSocketTxRxQueue
[ RUN ] Parameters/TestRpcSocketTxRxQueue.AcceptorRxQueueSizeMetric/0
I20260924 00:25:54.850334 1698 acceptor_pool.cc:254] collecting diagnostics on the listening RPC socket 0.0.0.0:40527 every 1 connection(s)
I20260924 00:25:54.851178 1699 acceptor_pool.cc:254] collecting diagnostics on the listening RPC socket 0.0.0.0:40527 every 1 connection(s)
W20260924 00:25:54.856670 1694 negotiation.cc:337] Failed RPC negotiation. Trace:
0924 00:25:54.854974 (+ 0us) reactor.cc:625] Submitting negotiation task for server connection from 127.0.0.1:43354 (local address 127.0.0.1:40527)
0924 00:25:54.855385 (+ 411us) server_negotiation.cc:206] Beginning negotiation
0924 00:25:54.855410 (+ 25us) server_negotiation.cc:399] Waiting for connection header
0924 00:25:54.855634 (+ 224us) negotiation.cc:327] Negotiation complete: Network error: Server connection negotiation failed: server connection from 127.0.0.1:43354: BlockingRecv error: recv got EOF from 127.0.0.1:43354 (error 108)
Metrics: {"server-negotiator.queue_time_us":98}
[ OK ] Parameters/TestRpcSocketTxRxQueue.AcceptorRxQueueSizeMetric/0 (28 ms)
[----------] 1 test from Parameters/TestRpcSocketTxRxQueue (28 ms total)
[----------] Global test environment tear-down
[==========] 21 tests from 2 test suites ran. (271873 ms total)
[ PASSED ] 20 tests.
[ FAILED ] 1 test, listed below:
[ FAILED ] Parameters/TestRpc.TestCallWithChainCertAndChainCA/SSL_UnixSocket, where GetParam() = (true, true)
1 FAILED TEST