Diagnosed failure

Parameters/TestRpc.TestCallWithChainCertAndChainCA/SSL_UnixSocket: /data0/somelongdirectorytoavoidrpathissues/src/kudu/src/kudu/rpc/rpc-test.cc:270: Failure
Failed
Bad status: Runtime error: could not verify certificate chain (error with cert: subject=CN = localhost, ST = sadfjas, C = AS, emailAddress = sdflkdsajf, O = lskdfjlsad, OU = sldfkja, issuer=C = AS, ST = ASDfkjdhf, L = lskdjf, O = saldfja, OU = skdjf, CN = localhost, emailAddress = sadjflkadsj): : certificate has expired
Google Test trace:
/data0/somelongdirectorytoavoidrpathissues/src/kudu/src/kudu/rpc/rpc-test.cc:267: Connecting to unix:/tmp/dist-test-taskHmqM5n/test-tmp/rpc-test-6119534268724006818d96036127dfe7.sock
I20260925 19:01:00.106446   383 test_util.cc:175] -----------------------------------------------
I20260925 19:01:00.106514   383 test_util.cc:176] Had fatal failures, leaving test files at /tmp/dist-test-taskHmqM5n/test-tmp/rpc-test.6.Parameters_TestRpc.TestCallWithChainCertAndChainCA_SSL_UnixSocket.1790362860026893-383-0

Full log

Note: This is test shard 7 of 8.
[==========] Running 21 tests from 2 test suites.
[----------] Global test environment set-up.
[----------] 20 tests from Parameters/TestRpc
[ RUN      ] Parameters/TestRpc.TestMessengerCreateDestroy/SSL_UnixSocket
WARNING: Logging before InitGoogleLogging() is written to STDERR
I20260925 19:01:00.052554   383 rpc-test.cc:169] started messenger TestCreateDestroy
[       OK ] Parameters/TestRpc.TestMessengerCreateDestroy/SSL_UnixSocket (24 ms)
[ RUN      ] Parameters/TestRpc.TestNegotiationDeadlock/SSL_UnixSocket
I20260925 19:01:00.083983   403 acceptor_pool.cc:254] collecting diagnostics on the listening RPC socket unix:/tmp/dist-test-taskHmqM5n/test-tmp/rpc-test-46a73e5c6a5c4df5b659f302e3011982.sock every 8 connection(s)
I20260925 19:01:00.084003   404 acceptor_pool.cc:254] collecting diagnostics on the listening RPC socket unix:/tmp/dist-test-taskHmqM5n/test-tmp/rpc-test-46a73e5c6a5c4df5b659f302e3011982.sock every 8 connection(s)
[       OK ] Parameters/TestRpc.TestNegotiationDeadlock/SSL_UnixSocket (37 ms)
[ RUN      ] Parameters/TestRpc.TestCallWithChainCertAndChainCA/SSL_UnixSocket
I20260925 19:01:00.102569   419 acceptor_pool.cc:254] collecting diagnostics on the listening RPC socket unix:/tmp/dist-test-taskHmqM5n/test-tmp/rpc-test-6119534268724006818d96036127dfe7.sock every 8 connection(s)
I20260925 19:01:00.102612   420 acceptor_pool.cc:254] collecting diagnostics on the listening RPC socket unix:/tmp/dist-test-taskHmqM5n/test-tmp/rpc-test-6119534268724006818d96036127dfe7.sock every 8 connection(s)
/data0/somelongdirectorytoavoidrpathissues/src/kudu/src/kudu/rpc/rpc-test.cc:270: Failure
Failed
Bad status: Runtime error: could not verify certificate chain (error with cert: subject=CN = localhost, ST = sadfjas, C = AS, emailAddress = sdflkdsajf, O = lskdfjlsad, OU = sldfkja, issuer=C = AS, ST = ASDfkjdhf, L = lskdjf, O = saldfja, OU = skdjf, CN = localhost, emailAddress = sadjflkadsj): : certificate has expired
Google Test trace:
/data0/somelongdirectorytoavoidrpathissues/src/kudu/src/kudu/rpc/rpc-test.cc:267: Connecting to unix:/tmp/dist-test-taskHmqM5n/test-tmp/rpc-test-6119534268724006818d96036127dfe7.sock
I20260925 19:01:00.106446   383 test_util.cc:175] -----------------------------------------------
I20260925 19:01:00.106514   383 test_util.cc:176] Had fatal failures, leaving test files at /tmp/dist-test-taskHmqM5n/test-tmp/rpc-test.6.Parameters_TestRpc.TestCallWithChainCertAndChainCA_SSL_UnixSocket.1790362860026893-383-0
[  FAILED  ] Parameters/TestRpc.TestCallWithChainCertAndChainCA/SSL_UnixSocket, where GetParam() = (true, true) (15 ms)
[ RUN      ] Parameters/TestRpc.TestCallWithPasswordProtectedKey/SSL_UnixSocket
I20260925 19:01:00.119072   445 acceptor_pool.cc:254] collecting diagnostics on the listening RPC socket unix:/tmp/dist-test-taskHmqM5n/test-tmp/rpc-test-cb6e5282faf14d4abe6af2ccb0e7e916.sock every 8 connection(s)
I20260925 19:01:00.119072   444 acceptor_pool.cc:254] collecting diagnostics on the listening RPC socket unix:/tmp/dist-test-taskHmqM5n/test-tmp/rpc-test-cb6e5282faf14d4abe6af2ccb0e7e916.sock every 8 connection(s)
W20260925 19:01:00.130465   441 connection.cc:196] Error closing socket: Network error: TlsSocket::Close: Broken pipe
[       OK ] Parameters/TestRpc.TestCallWithPasswordProtectedKey/SSL_UnixSocket (25 ms)
[ RUN      ] Parameters/TestRpc.TestCallToBadServer/SSL_UnixSocket
I20260925 19:01:00.141146   383 rpc-test.cc:394] Status: Network error: Client connection negotiation failed: client connection to 0.0.0.0:0: connect: Connection refused (error 111)
I20260925 19:01:00.141435   383 rpc-test.cc:394] Status: Network error: Client connection negotiation failed: client connection to 0.0.0.0:0: connect: Connection refused (error 111)
I20260925 19:01:00.141687   383 rpc-test.cc:394] Status: Network error: Client connection negotiation failed: client connection to 0.0.0.0:0: connect: Connection refused (error 111)
I20260925 19:01:00.141947   383 rpc-test.cc:394] Status: Network error: Client connection negotiation failed: client connection to 0.0.0.0:0: connect: Connection refused (error 111)
I20260925 19:01:00.142133   383 rpc-test.cc:394] Status: Network error: Client connection negotiation failed: client connection to 0.0.0.0:0: connect: Connection refused (error 111)
[       OK ] Parameters/TestRpc.TestCallToBadServer/SSL_UnixSocket (10 ms)
[ RUN      ] Parameters/TestRpc.TestWrongService/SSL_UnixSocket
I20260925 19:01:00.152966   480 acceptor_pool.cc:254] collecting diagnostics on the listening RPC socket unix:/tmp/dist-test-taskHmqM5n/test-tmp/rpc-test-9548994be26b4dd6bb2c74a4b396eb5a.sock every 8 connection(s)
I20260925 19:01:00.152904   479 acceptor_pool.cc:254] collecting diagnostics on the listening RPC socket unix:/tmp/dist-test-taskHmqM5n/test-tmp/rpc-test-9548994be26b4dd6bb2c74a4b396eb5a.sock every 8 connection(s)
I20260925 19:01:00.161932   476 messenger.cc:345] service WrongServiceName not registered on TestServer
W20260925 19:01:00.162609   476 connection.cc:196] Error closing socket: Network error: TlsSocket::Close: Broken pipe
[       OK ] Parameters/TestRpc.TestWrongService/SSL_UnixSocket (20 ms)
[ RUN      ] Parameters/TestRpc.TestConnectionKeepalive/SSL_UnixSocket
I20260925 19:01:00.181425   502 acceptor_pool.cc:254] collecting diagnostics on the listening RPC socket unix:/tmp/dist-test-taskHmqM5n/test-tmp/rpc-test-10534ded645043498aa1cf6d265fa4f3.sock every 8 connection(s)
I20260925 19:01:00.181478   503 acceptor_pool.cc:254] collecting diagnostics on the listening RPC socket unix:/tmp/dist-test-taskHmqM5n/test-tmp/rpc-test-10534ded645043498aa1cf6d265fa4f3.sock every 8 connection(s)
I20260925 19:01:00.181648   383 rpc-test.cc:488] Connecting to unix:/tmp/dist-test-taskHmqM5n/test-tmp/rpc-test-10534ded645043498aa1cf6d265fa4f3.sock
W20260925 19:01:00.664877   515 connection.cc:196] Error closing socket: Network error: TlsSocket::Close: Broken pipe
[       OK ] Parameters/TestRpc.TestConnectionKeepalive/SSL_UnixSocket (1036 ms)
[ RUN      ] Parameters/TestRpc.TestClientConnectionMetrics/SSL_UnixSocket
I20260925 19:01:01.213023   527 acceptor_pool.cc:254] collecting diagnostics on the listening RPC socket unix:/tmp/dist-test-taskHmqM5n/test-tmp/rpc-test-8e7db830cbdb4b888500b3dd9dbf5ac6.sock every 8 connection(s)
I20260925 19:01:01.213150   528 acceptor_pool.cc:254] collecting diagnostics on the listening RPC socket unix:/tmp/dist-test-taskHmqM5n/test-tmp/rpc-test-8e7db830cbdb4b888500b3dd9dbf5ac6.sock every 8 connection(s)
I20260925 19:01:01.213295   383 rpc-test.cc:569] Connecting to unix:/tmp/dist-test-taskHmqM5n/test-tmp/rpc-test-8e7db830cbdb4b888500b3dd9dbf5ac6.sock
W20260925 19:01:09.528745   524 connection.cc:196] Error closing socket: Network error: TlsSocket::Close: Broken pipe
[       OK ] Parameters/TestRpc.TestClientConnectionMetrics/SSL_UnixSocket (8329 ms)
[ RUN      ] Parameters/TestRpc.TestCredentialsPolicy/SSL_UnixSocket
I20260925 19:01:09.544653   550 acceptor_pool.cc:254] collecting diagnostics on the listening RPC socket unix:/tmp/dist-test-taskHmqM5n/test-tmp/rpc-test-c9ab1d53f6234a9d8f9a11251bd2e287.sock every 8 connection(s)
I20260925 19:01:09.544709   551 acceptor_pool.cc:254] collecting diagnostics on the listening RPC socket unix:/tmp/dist-test-taskHmqM5n/test-tmp/rpc-test-c9ab1d53f6234a9d8f9a11251bd2e287.sock every 8 connection(s)
I20260925 19:01:09.544929   383 rpc-test.cc:700] Connecting to unix:/tmp/dist-test-taskHmqM5n/test-tmp/rpc-test-c9ab1d53f6234a9d8f9a11251bd2e287.sock
W20260925 19:01:09.581758   549 connection.cc:196] Error closing socket: Network error: TlsSocket::Close: Broken pipe
W20260925 19:01:09.585577   549 connection.cc:196] Error closing socket: Network error: TlsSocket::Close: Broken pipe
[       OK ] Parameters/TestRpc.TestCredentialsPolicy/SSL_UnixSocket (56 ms)
[ RUN      ] Parameters/TestRpc.TestCallLongerThanKeepalive/SSL_UnixSocket
I20260925 19:01:09.605444   576 acceptor_pool.cc:254] collecting diagnostics on the listening RPC socket unix:/tmp/dist-test-taskHmqM5n/test-tmp/rpc-test-5d23defc7e884dcd84c9dc68dea7cd13.sock every 8 connection(s)
I20260925 19:01:09.605633   575 acceptor_pool.cc:254] collecting diagnostics on the listening RPC socket unix:/tmp/dist-test-taskHmqM5n/test-tmp/rpc-test-5d23defc7e884dcd84c9dc68dea7cd13.sock every 8 connection(s)
I20260925 19:01:09.613103   579 rpc-test-base.h:222] got call: sleep_micros: 3000000 deferred: true
I20260925 19:01:12.613778   579 rpcz_store.cc:275] Call kudu.rpc.GenericCalculatorService.Sleep from unix:<unnamed> (request call id 0) took 3000 ms. Trace:
I20260925 19:01:12.613899   579 rpcz_store.cc:276] 0925 19:01:09.613037 (+     0us) service_pool.cc:170] Inserting onto call queue
0925 19:01:09.613088 (+    51us) service_pool.cc:227] Handling call
0925 19:01:12.613762 (+3000674us) inbound_call.cc:173] Queueing success response
Metrics: {}
W20260925 19:01:12.614895   572 connection.cc:196] Error closing socket: Network error: TlsSocket::Close: Broken pipe
[       OK ] Parameters/TestRpc.TestCallLongerThanKeepalive/SSL_UnixSocket (3029 ms)
[ RUN      ] Parameters/TestRpc.TestRpcSidecar/SSL_UnixSocket
I20260925 19:01:12.630065   600 acceptor_pool.cc:254] collecting diagnostics on the listening RPC socket unix:/tmp/dist-test-taskHmqM5n/test-tmp/rpc-test-f897cce609ec4fa4b8a140a08d913503.sock every 8 connection(s)
I20260925 19:01:12.630110   601 acceptor_pool.cc:254] collecting diagnostics on the listening RPC socket unix:/tmp/dist-test-taskHmqM5n/test-tmp/rpc-test-f897cce609ec4fa4b8a140a08d913503.sock every 8 connection(s)
W20260925 19:01:12.664090   597 connection.cc:196] Error closing socket: Network error: TlsSocket::Close: Broken pipe
[       OK ] Parameters/TestRpc.TestRpcSidecar/SSL_UnixSocket (48 ms)
[ RUN      ] Parameters/TestRpc.TestRpcSidecarLimits/SSL_UnixSocket
I20260925 19:01:14.402662   625 acceptor_pool.cc:254] collecting diagnostics on the listening RPC socket unix:/tmp/dist-test-taskHmqM5n/test-tmp/rpc-test-71a9a11d2e5d42b69938586ba25490dd.sock every 8 connection(s)
I20260925 19:01:14.402690   626 acceptor_pool.cc:254] collecting diagnostics on the listening RPC socket unix:/tmp/dist-test-taskHmqM5n/test-tmp/rpc-test-71a9a11d2e5d42b69938586ba25490dd.sock every 8 connection(s)
W20260925 19:01:14.416342   383 serialization.cc:72] Serialized kudu.rpc_test.PushStringsRequestPB (2147483654 bytes) is larger than the maximum configured RPC message size (52428800 bytes). Sending anyway, but peer may reject the data.
W20260925 19:01:14.419366   622 connection.cc:535] server connection from unix:<unnamed> recv error: Network error: RPC frame had a length of 2147483714, but we only support messages up to 52428800 bytes long.
W20260925 19:01:14.419441   622 connection.cc:158] shutting down server connection from unix:<unnamed> with pending inbound data: 4/2147483714 bytes received; last active 0 ns ago: status Network error: RPC frame had a length of 2147483714, but we only support messages up to 52428800 bytes long.
W20260925 19:01:14.419610   638 connection.cc:698] client connection to unix:/tmp/dist-test-taskHmqM5n/test-tmp/rpc-test-71a9a11d2e5d42b69938586ba25490dd.sock send error: Network error: failed to write to TLS socket: Broken pipe
W20260925 19:01:14.419734   638 connection.cc:196] Error closing socket: Network error: TlsSocket::Close: Success
I20260925 19:01:14.427346   650 acceptor_pool.cc:254] collecting diagnostics on the listening RPC socket unix:/tmp/dist-test-taskHmqM5n/test-tmp/rpc-test-71a9a11d2e5d42b69938586ba25490dd.sock every 8 connection(s)
I20260925 19:01:14.427511   651 acceptor_pool.cc:254] collecting diagnostics on the listening RPC socket unix:/tmp/dist-test-taskHmqM5n/test-tmp/rpc-test-71a9a11d2e5d42b69938586ba25490dd.sock every 8 connection(s)
W20260925 19:01:18.673439   647 connection.cc:577] server connection from unix:<unnamed>: received bad data: 'Corruption: Invalid packet: message had a length of 2147483710, but we only support messages up to 2147483647 bytes
'
W20260925 19:01:18.673748   663 connection.cc:196] Error closing socket: Network error: TlsSocket::Close: Broken pipe
[       OK ] Parameters/TestRpc.TestRpcSidecarLimits/SSL_UnixSocket (6010 ms)
[ RUN      ] Parameters/TestRpc.TestCallTimeoutDoesntAffectNegotiation/SSL_UnixSocket
I20260925 19:01:18.691746   675 acceptor_pool.cc:254] collecting diagnostics on the listening RPC socket unix:/tmp/dist-test-taskHmqM5n/test-tmp/rpc-test-106905bd6641416289358306e712868d.sock every 8 connection(s)
I20260925 19:01:18.691776   676 acceptor_pool.cc:254] collecting diagnostics on the listening RPC socket unix:/tmp/dist-test-taskHmqM5n/test-tmp/rpc-test-106905bd6641416289358306e712868d.sock every 8 connection(s)
W20260925 19:01:18.724805   671 negotiation.cc:266] Injecting 500ms delay in negotiation
I20260925 19:01:18.775086   383 rpc-test-base.h:595] status: Timed out: connection negotiation to unix:/tmp/dist-test-taskHmqM5n/test-tmp/rpc-test-106905bd6641416289358306e712868d.sock for RPC Sleep timed out after 0.050s (ON_OUTBOUND_QUEUE), seconds elapsed: 0.0506489
W20260925 19:01:19.229256   672 connection.cc:196] Error closing socket: Network error: TlsSocket::Close: Broken pipe
[       OK ] Parameters/TestRpc.TestCallTimeoutDoesntAffectNegotiation/SSL_UnixSocket (554 ms)
[ RUN      ] Parameters/TestRpc.TestRpcHandlerLatencyMetric/SSL_UnixSocket
I20260925 19:01:19.239482   700 acceptor_pool.cc:254] collecting diagnostics on the listening RPC socket unix:/tmp/dist-test-taskHmqM5n/test-tmp/rpc-test-fb8b2eab9f504a918ca61d642f836c2b.sock every 8 connection(s)
I20260925 19:01:19.239513   701 acceptor_pool.cc:254] collecting diagnostics on the listening RPC socket unix:/tmp/dist-test-taskHmqM5n/test-tmp/rpc-test-fb8b2eab9f504a918ca61d642f836c2b.sock every 8 connection(s)
I20260925 19:01:19.292793   383 rpc-test.cc:1236] Sleep() min lat: 20251
I20260925 19:01:19.292908   383 rpc-test.cc:1237] Sleep() mean lat: 20251
I20260925 19:01:19.292948   383 rpc-test.cc:1238] Sleep() max lat: 20251
I20260925 19:01:19.293023   383 rpc-test.cc:1239] Sleep() #calls: 1
[       OK ] Parameters/TestRpc.TestRpcHandlerLatencyMetric/SSL_UnixSocket (64 ms)
[ RUN      ] Parameters/TestRpc.TimedOutOnResponseMetricServiceQueue/SSL_UnixSocket
I20260925 19:01:19.303964   726 acceptor_pool.cc:254] collecting diagnostics on the listening RPC socket unix:/tmp/dist-test-taskHmqM5n/test-tmp/rpc-test-ad279317cab7487aa8770c777a5ec819.sock every 8 connection(s)
I20260925 19:01:19.304042   727 acceptor_pool.cc:254] collecting diagnostics on the listening RPC socket unix:/tmp/dist-test-taskHmqM5n/test-tmp/rpc-test-ad279317cab7487aa8770c777a5ec819.sock every 8 connection(s)
W20260925 19:01:19.360504   728 rpcz_store.cc:267] Call kudu.rpc_test.CalculatorService.Sleep from unix:<unnamed> (request call id 2) took 20 ms (client timeout 20 ms). Trace:
W20260925 19:01:19.360649   728 rpcz_store.cc:269] 0925 19:01:19.340232 (+     0us) service_pool.cc:170] Inserting onto call queue
0925 19:01:19.360474 (+ 20242us) service_pool.cc:214] Skipping call since client already timed out
0925 19:01:19.360485 (+    11us) inbound_call.cc:173] Queueing failure response
Metrics: {}
W20260925 19:01:19.361155   723 connection.cc:196] Error closing socket: Network error: TlsSocket::Close: Broken pipe
[       OK ] Parameters/TestRpc.TimedOutOnResponseMetricServiceQueue/SSL_UnixSocket (67 ms)
[ RUN      ] Parameters/TestRpc.RpcPendingConnectionsMetric/SSL_UnixSocket
I20260925 19:01:19.364146   749 acceptor_pool.cc:254] collecting diagnostics on the listening RPC socket 0.0.0.0:37393 every 8 connection(s)
I20260925 19:01:19.364197   750 acceptor_pool.cc:254] collecting diagnostics on the listening RPC socket 0.0.0.0:37393 every 8 connection(s)
W20260925 19:01:19.372786   745 negotiation.cc:337] Failed RPC negotiation. Trace:
0925 19:01:19.372511 (+     0us) reactor.cc:625] Submitting negotiation task for server connection from 127.0.0.1:40154 (local address 127.0.0.1:37393)
0925 19:01:19.372592 (+    81us) server_negotiation.cc:206] Beginning negotiation
0925 19:01:19.372594 (+     2us) server_negotiation.cc:399] Waiting for connection header
0925 19:01:19.372693 (+    99us) negotiation.cc:327] Negotiation complete: Network error: Server connection negotiation failed: server connection from 127.0.0.1:40154: BlockingRecv error: recv got EOF from 127.0.0.1:40154 (error 108)
Metrics: {"server-negotiator.queue_time_us":41}
[       OK ] Parameters/TestRpc.RpcPendingConnectionsMetric/SSL_UnixSocket (21 ms)
[ RUN      ] Parameters/TestRpc.TestRpcContextClientDeadline/SSL_UnixSocket
I20260925 19:01:19.395686   765 acceptor_pool.cc:254] collecting diagnostics on the listening RPC socket unix:/tmp/dist-test-taskHmqM5n/test-tmp/rpc-test-ce6f301c125140d5b0edd179507624de.sock every 8 connection(s)
I20260925 19:01:19.395743   766 acceptor_pool.cc:254] collecting diagnostics on the listening RPC socket unix:/tmp/dist-test-taskHmqM5n/test-tmp/rpc-test-ce6f301c125140d5b0edd179507624de.sock every 8 connection(s)
W20260925 19:01:19.453709   762 connection.cc:196] Error closing socket: Network error: TlsSocket::Close: Broken pipe
[       OK ] Parameters/TestRpc.TestRpcContextClientDeadline/SSL_UnixSocket (71 ms)
[ RUN      ] Parameters/TestRpc.TestApplicationFeatureFlagUnsupportedServer/SSL_UnixSocket
I20260925 19:01:19.468317   790 acceptor_pool.cc:254] collecting diagnostics on the listening RPC socket unix:/tmp/dist-test-taskHmqM5n/test-tmp/rpc-test-d46b471076614bf0a468259af37770eb.sock every 8 connection(s)
I20260925 19:01:19.468359   791 acceptor_pool.cc:254] collecting diagnostics on the listening RPC socket unix:/tmp/dist-test-taskHmqM5n/test-tmp/rpc-test-d46b471076614bf0a468259af37770eb.sock every 8 connection(s)
[       OK ] Parameters/TestRpc.TestApplicationFeatureFlagUnsupportedServer/SSL_UnixSocket (25 ms)
[ RUN      ] Parameters/TestRpc.TestCancellationAsync/SSL_UnixSocket
I20260925 19:01:19.492106   815 acceptor_pool.cc:254] collecting diagnostics on the listening RPC socket unix:/tmp/dist-test-taskHmqM5n/test-tmp/rpc-test-3f3c0cba1c3a4709ada6124eda743766.sock every 8 connection(s)
I20260925 19:01:19.492137   816 acceptor_pool.cc:254] collecting diagnostics on the listening RPC socket unix:/tmp/dist-test-taskHmqM5n/test-tmp/rpc-test-3f3c0cba1c3a4709ada6124eda743766.sock every 8 connection(s)
I20260925 19:01:19.492308   383 rpc-test.cc:1716] Connecting to unix:/tmp/dist-test-taskHmqM5n/test-tmp/rpc-test-3f3c0cba1c3a4709ada6124eda743766.sock
I20260925 19:01:19.517748   383 test_util.cc:268] Using random seed: 1467212850
I20260925 19:01:19.531898   819 rpc-test-base.h:240] got call: sleep_micros: 500 pattern: 4294967295 num_repetitions: 2097152 sidecar_idx: 0
I20260925 19:01:19.542462   819 rpc-test-base.h:240] got call: sleep_micros: 500 pattern: 4294967295 num_repetitions: 2097152 sidecar_idx: 0
I20260925 19:01:19.552647   819 rpc-test-base.h:240] got call: sleep_micros: 500 pattern: 4294967295 num_repetitions: 2097152 sidecar_idx: 0
I20260925 19:01:19.562786   819 rpc-test-base.h:240] got call: sleep_micros: 500 pattern: 4294967295 num_repetitions: 2097152 sidecar_idx: 0
I20260925 19:01:19.573045   819 rpc-test-base.h:240] got call: sleep_micros: 500 pattern: 4294967295 num_repetitions: 2097152 sidecar_idx: 0
I20260925 19:01:19.583652   819 rpc-test-base.h:240] got call: sleep_micros: 500 pattern: 4294967295 num_repetitions: 2097152 sidecar_idx: 0
I20260925 19:01:19.593781   819 rpc-test-base.h:240] got call: sleep_micros: 500 pattern: 4294967295 num_repetitions: 2097152 sidecar_idx: 0
I20260925 19:01:19.603931   819 rpc-test-base.h:240] got call: sleep_micros: 500 pattern: 4294967295 num_repetitions: 2097152 sidecar_idx: 0
W20260925 19:01:19.605317   812 connection.cc:196] Error closing socket: Network error: TlsSocket::Close: Broken pipe
W20260925 19:01:19.606984   812 connection.cc:441] server connection from unix:<unnamed> torn down before Call kudu.rpc.GenericCalculatorService.SleepWithSidecar from unix:<unnamed> (request call id 9) could send its response
[       OK ] Parameters/TestRpc.TestCancellationAsync/SSL_UnixSocket (127 ms)
[ RUN      ] Parameters/TestRpc.TestPerformanceBySocketType/SSL_UnixSocket
I20260925 19:01:19.616278   840 acceptor_pool.cc:254] collecting diagnostics on the listening RPC socket unix:/tmp/dist-test-taskHmqM5n/test-tmp/rpc-test-122846746a7249b0a9dc50c72a937849.sock every 8 connection(s)
I20260925 19:01:19.616299   841 acceptor_pool.cc:254] collecting diagnostics on the listening RPC socket unix:/tmp/dist-test-taskHmqM5n/test-tmp/rpc-test-122846746a7249b0a9dc50c72a937849.sock every 8 connection(s)
I20260925 19:01:19.616470   383 rpc-test.cc:1846] Connecting to unix:/tmp/dist-test-taskHmqM5n/test-tmp/rpc-test-122846746a7249b0a9dc50c72a937849.sock
I20260925 19:01:20.801535   383 rpc-test.cc:1859] Sending 1024MB via ssl-enabled unix socket: real 1.173s	user 1.288s	sys 0.830s
I20260925 19:01:21.973109   383 rpc-test.cc:1859] Sending 1024MB via ssl-enabled unix socket: real 1.171s	user 1.309s	sys 0.804s
I20260925 19:01:23.190230   383 rpc-test.cc:1859] Sending 1024MB via ssl-enabled unix socket: real 1.217s	user 1.356s	sys 0.834s
I20260925 19:01:24.361069   383 rpc-test.cc:1859] Sending 1024MB via ssl-enabled unix socket: real 1.171s	user 1.291s	sys 0.824s
I20260925 19:01:25.562834   383 rpc-test.cc:1859] Sending 1024MB via ssl-enabled unix socket: real 1.202s	user 1.314s	sys 0.852s
W20260925 19:01:25.563637   837 connection.cc:196] Error closing socket: Network error: TlsSocket::Close: Broken pipe
[       OK ] Parameters/TestRpc.TestPerformanceBySocketType/SSL_UnixSocket (5956 ms)
[----------] 20 tests from Parameters/TestRpc (25535 ms total)

[----------] 1 test from Parameters/TestRpcSocketTxRxQueue
[ RUN      ] Parameters/TestRpcSocketTxRxQueue.AcceptorRxQueueSizeMetric/0
I20260925 19:01:25.569931   865 acceptor_pool.cc:254] collecting diagnostics on the listening RPC socket 0.0.0.0:45313 every 1 connection(s)
I20260925 19:01:25.569970   866 acceptor_pool.cc:254] collecting diagnostics on the listening RPC socket 0.0.0.0:45313 every 1 connection(s)
W20260925 19:01:25.570541   861 negotiation.cc:337] Failed RPC negotiation. Trace:
0925 19:01:25.570373 (+     0us) reactor.cc:625] Submitting negotiation task for server connection from 127.0.0.1:46346 (local address 127.0.0.1:45313)
0925 19:01:25.570447 (+    74us) server_negotiation.cc:206] Beginning negotiation
0925 19:01:25.570449 (+     2us) server_negotiation.cc:399] Waiting for connection header
0925 19:01:25.570515 (+    66us) negotiation.cc:327] Negotiation complete: Network error: Server connection negotiation failed: server connection from 127.0.0.1:46346: BlockingRecv error: recv got EOF from 127.0.0.1:46346 (error 108)
Metrics: {"server-negotiator.queue_time_us":40}
[       OK ] Parameters/TestRpcSocketTxRxQueue.AcceptorRxQueueSizeMetric/0 (8 ms)
[----------] 1 test from Parameters/TestRpcSocketTxRxQueue (8 ms total)

[----------] Global test environment tear-down
[==========] 21 tests from 2 test suites ran. (25543 ms total)
[  PASSED  ] 20 tests.
[  FAILED  ] 1 test, listed below:
[  FAILED  ] Parameters/TestRpc.TestCallWithChainCertAndChainCA/SSL_UnixSocket, where GetParam() = (true, true)

 1 FAILED TEST