Diagnosed failure
Parameters/TestRpc.TestCallWithChainCertAndChainCA/SSL_TCP: /data0/somelongdirectorytoavoidrpathissues/src/kudu/src/kudu/rpc/rpc-test.cc:270: Failure
Failed
Bad status: Runtime error: could not verify certificate chain (error with cert: subject=CN = localhost, ST = sadfjas, C = AS, emailAddress = sdflkdsajf, O = lskdfjlsad, OU = sldfkja, issuer=C = AS, ST = ASDfkjdhf, L = lskdjf, O = saldfja, OU = skdjf, CN = localhost, emailAddress = sadjflkadsj): : certificate has expired
Google Test trace:
/data0/somelongdirectorytoavoidrpathissues/src/kudu/src/kudu/rpc/rpc-test.cc:267: Connecting to 0.0.0.0:42881
I20260928 23:54:10.674923 20081 test_util.cc:175] -----------------------------------------------
I20260928 23:54:10.675151 20081 test_util.cc:176] Had fatal failures, leaving test files at /tmp/dist-test-taskAH3e3Y/test-tmp/rpc-test.5.Parameters_TestRpc.TestCallWithChainCertAndChainCA_SSL_TCP.1790639649277955-20081-0
Full log
Note: This is test shard 6 of 8.
[==========] Running 21 tests from 2 test suites.
[----------] Global test environment set-up.
[----------] 20 tests from Parameters/TestRpc
[ RUN ] Parameters/TestRpc.TestMessengerCreateDestroy/SSL_TCP
WARNING: Logging before InitGoogleLogging() is written to STDERR
I20260928 23:54:09.385519 20081 rpc-test.cc:169] started messenger TestCreateDestroy
[ OK ] Parameters/TestRpc.TestMessengerCreateDestroy/SSL_TCP (1189 ms)
[ RUN ] Parameters/TestRpc.TestNegotiationDeadlock/SSL_TCP
I20260928 23:54:10.554797 20103 acceptor_pool.cc:254] collecting diagnostics on the listening RPC socket 0.0.0.0:42975 every 8 connection(s)
I20260928 23:54:10.556396 20104 acceptor_pool.cc:254] collecting diagnostics on the listening RPC socket 0.0.0.0:42975 every 8 connection(s)
[ OK ] Parameters/TestRpc.TestNegotiationDeadlock/SSL_TCP (84 ms)
[ RUN ] Parameters/TestRpc.TestCallWithChainCertAndChainCA/SSL_TCP
I20260928 23:54:10.643070 20119 acceptor_pool.cc:254] collecting diagnostics on the listening RPC socket 0.0.0.0:42881 every 8 connection(s)
I20260928 23:54:10.645378 20120 acceptor_pool.cc:254] collecting diagnostics on the listening RPC socket 0.0.0.0:42881 every 8 connection(s)
/data0/somelongdirectorytoavoidrpathissues/src/kudu/src/kudu/rpc/rpc-test.cc:270: Failure
Failed
Bad status: Runtime error: could not verify certificate chain (error with cert: subject=CN = localhost, ST = sadfjas, C = AS, emailAddress = sdflkdsajf, O = lskdfjlsad, OU = sldfkja, issuer=C = AS, ST = ASDfkjdhf, L = lskdjf, O = saldfja, OU = skdjf, CN = localhost, emailAddress = sadjflkadsj): : certificate has expired
Google Test trace:
/data0/somelongdirectorytoavoidrpathissues/src/kudu/src/kudu/rpc/rpc-test.cc:267: Connecting to 0.0.0.0:42881
I20260928 23:54:10.674923 20081 test_util.cc:175] -----------------------------------------------
I20260928 23:54:10.675151 20081 test_util.cc:176] Had fatal failures, leaving test files at /tmp/dist-test-taskAH3e3Y/test-tmp/rpc-test.5.Parameters_TestRpc.TestCallWithChainCertAndChainCA_SSL_TCP.1790639649277955-20081-0
[ FAILED ] Parameters/TestRpc.TestCallWithChainCertAndChainCA/SSL_TCP, where GetParam() = (true, false) (64 ms)
[ RUN ] Parameters/TestRpc.TestCallWithPasswordProtectedKey/SSL_TCP
I20260928 23:54:10.711196 20144 acceptor_pool.cc:254] collecting diagnostics on the listening RPC socket 0.0.0.0:46467 every 8 connection(s)
I20260928 23:54:10.712001 20145 acceptor_pool.cc:254] collecting diagnostics on the listening RPC socket 0.0.0.0:46467 every 8 connection(s)
[ OK ] Parameters/TestRpc.TestCallWithPasswordProtectedKey/SSL_TCP (86 ms)
[ RUN ] Parameters/TestRpc.TestCallToBadServer/SSL_TCP
I20260928 23:54:10.788849 20081 rpc-test.cc:394] Status: Network error: Client connection negotiation failed: client connection to 0.0.0.0:0: connect: Connection refused (error 111)
I20260928 23:54:10.790242 20081 rpc-test.cc:394] Status: Network error: Client connection negotiation failed: client connection to 0.0.0.0:0: connect: Connection refused (error 111)
I20260928 23:54:10.791603 20081 rpc-test.cc:394] Status: Network error: Client connection negotiation failed: client connection to 0.0.0.0:0: connect: Connection refused (error 111)
I20260928 23:54:10.792981 20081 rpc-test.cc:394] Status: Network error: Client connection negotiation failed: client connection to 0.0.0.0:0: connect: Connection refused (error 111)
I20260928 23:54:10.794422 20081 rpc-test.cc:394] Status: Network error: Client connection negotiation failed: client connection to 0.0.0.0:0: connect: Connection refused (error 111)
[ OK ] Parameters/TestRpc.TestCallToBadServer/SSL_TCP (34 ms)
[ RUN ] Parameters/TestRpc.TestWrongService/SSL_TCP
I20260928 23:54:10.825095 20179 acceptor_pool.cc:254] collecting diagnostics on the listening RPC socket 0.0.0.0:45935 every 8 connection(s)
I20260928 23:54:10.825977 20180 acceptor_pool.cc:254] collecting diagnostics on the listening RPC socket 0.0.0.0:45935 every 8 connection(s)
I20260928 23:54:10.871744 20176 messenger.cc:345] service WrongServiceName not registered on TestServer
[ OK ] Parameters/TestRpc.TestWrongService/SSL_TCP (83 ms)
[ RUN ] Parameters/TestRpc.TestConnectionKeepalive/SSL_TCP
I20260928 23:54:10.907625 20202 acceptor_pool.cc:254] collecting diagnostics on the listening RPC socket 0.0.0.0:45069 every 8 connection(s)
I20260928 23:54:10.908432 20203 acceptor_pool.cc:254] collecting diagnostics on the listening RPC socket 0.0.0.0:45069 every 8 connection(s)
I20260928 23:54:10.911957 20081 rpc-test.cc:488] Connecting to 0.0.0.0:45069
[ OK ] Parameters/TestRpc.TestConnectionKeepalive/SSL_TCP (1081 ms)
[ RUN ] Parameters/TestRpc.TestClientConnectionMetrics/SSL_TCP
I20260928 23:54:11.991470 20227 acceptor_pool.cc:254] collecting diagnostics on the listening RPC socket 0.0.0.0:39791 every 8 connection(s)
I20260928 23:54:11.992228 20228 acceptor_pool.cc:254] collecting diagnostics on the listening RPC socket 0.0.0.0:39791 every 8 connection(s)
I20260928 23:54:11.995805 20081 rpc-test.cc:569] Connecting to 0.0.0.0:39791
[ OK ] Parameters/TestRpc.TestClientConnectionMetrics/SSL_TCP (127540 ms)
[ RUN ] Parameters/TestRpc.TestCredentialsPolicy/SSL_TCP
I20260928 23:56:19.520228 20262 acceptor_pool.cc:254] collecting diagnostics on the listening RPC socket 0.0.0.0:46855 every 8 connection(s)
I20260928 23:56:19.521052 20263 acceptor_pool.cc:254] collecting diagnostics on the listening RPC socket 0.0.0.0:46855 every 8 connection(s)
I20260928 23:56:19.524708 20081 rpc-test.cc:700] Connecting to 0.0.0.0:46855
[ OK ] Parameters/TestRpc.TestCredentialsPolicy/SSL_TCP (83 ms)
[ RUN ] Parameters/TestRpc.TestCallLongerThanKeepalive/SSL_TCP
I20260928 23:56:19.602236 20287 acceptor_pool.cc:254] collecting diagnostics on the listening RPC socket 0.0.0.0:42289 every 8 connection(s)
I20260928 23:56:19.603015 20288 acceptor_pool.cc:254] collecting diagnostics on the listening RPC socket 0.0.0.0:42289 every 8 connection(s)
I20260928 23:56:19.639804 20291 rpc-test-base.h:222] got call: sleep_micros: 3000000 deferred: true
I20260928 23:56:22.644847 20291 rpcz_store.cc:275] Call kudu.rpc.GenericCalculatorService.Sleep from 127.0.0.1:51914 (request call id 0) took 3005 ms. Trace:
I20260928 23:56:22.645153 20291 rpcz_store.cc:276] 0928 23:56:19.639487 (+ 0us) service_pool.cc:170] Inserting onto call queue
0928 23:56:19.639643 (+ 156us) service_pool.cc:227] Handling call
0928 23:56:22.644780 (+3005137us) inbound_call.cc:173] Queueing success response
Metrics: {}
[ OK ] Parameters/TestRpc.TestCallLongerThanKeepalive/SSL_TCP (3071 ms)
[ RUN ] Parameters/TestRpc.TestRpcSidecar/SSL_TCP
I20260928 23:56:22.676302 20313 acceptor_pool.cc:254] collecting diagnostics on the listening RPC socket 0.0.0.0:36331 every 8 connection(s)
I20260928 23:56:22.677101 20314 acceptor_pool.cc:254] collecting diagnostics on the listening RPC socket 0.0.0.0:36331 every 8 connection(s)
[ OK ] Parameters/TestRpc.TestRpcSidecar/SSL_TCP (530 ms)
[ RUN ] Parameters/TestRpc.TestRpcSidecarLimits/SSL_TCP
I20260928 23:56:42.121692 20340 acceptor_pool.cc:254] collecting diagnostics on the listening RPC socket 0.0.0.0:35037 every 8 connection(s)
I20260928 23:56:42.122524 20341 acceptor_pool.cc:254] collecting diagnostics on the listening RPC socket 0.0.0.0:35037 every 8 connection(s)
W20260928 23:56:42.145895 20081 serialization.cc:72] Serialized kudu.rpc_test.PushStringsRequestPB (2147483654 bytes) is larger than the maximum configured RPC message size (52428800 bytes). Sending anyway, but peer may reject the data.
W20260928 23:56:42.157533 20339 connection.cc:535] server connection from 127.0.0.1:34482 recv error: Network error: RPC frame had a length of 2147483714, but we only support messages up to 52428800 bytes long.
W20260928 23:56:42.157933 20339 connection.cc:158] shutting down server connection from 127.0.0.1:34482 with pending inbound data: 4/2147483714 bytes received; last active 0 ns ago: status Network error: RPC frame had a length of 2147483714, but we only support messages up to 52428800 bytes long.
W20260928 23:56:42.159051 20353 connection.cc:698] client connection to 0.0.0.0:35037 send error: Network error: failed to write to TLS socket: Connection reset by peer
W20260928 23:56:42.159894 20353 connection.cc:196] Error closing socket: Network error: TlsSocket::Close: Success
[ OK ] Parameters/TestRpc.TestRpcSidecarLimits/SSL_TCP (19628 ms)
[ RUN ] Parameters/TestRpc.TestCallTimeoutDoesntAffectNegotiation/SSL_TCP
I20260928 23:56:42.838408 20365 acceptor_pool.cc:254] collecting diagnostics on the listening RPC socket 0.0.0.0:38839 every 8 connection(s)
I20260928 23:56:42.839108 20366 acceptor_pool.cc:254] collecting diagnostics on the listening RPC socket 0.0.0.0:38839 every 8 connection(s)
W20260928 23:56:42.859748 20361 negotiation.cc:266] Injecting 500ms delay in negotiation
I20260928 23:56:42.910059 20081 rpc-test-base.h:595] status: Timed out: connection negotiation to 0.0.0.0:38839 for RPC Sleep timed out after 0.050s (ON_OUTBOUND_QUEUE), seconds elapsed: 0.0514
[ OK ] Parameters/TestRpc.TestCallTimeoutDoesntAffectNegotiation/SSL_TCP (560 ms)
[ RUN ] Parameters/TestRpc.TestRpcHandlerLatencyMetric/SSL_TCP
I20260928 23:56:43.403103 20390 acceptor_pool.cc:254] collecting diagnostics on the listening RPC socket 0.0.0.0:33915 every 8 connection(s)
I20260928 23:56:43.403874 20391 acceptor_pool.cc:254] collecting diagnostics on the listening RPC socket 0.0.0.0:33915 every 8 connection(s)
I20260928 23:56:43.478143 20081 rpc-test.cc:1236] Sleep() min lat: 21724
I20260928 23:56:43.478430 20081 rpc-test.cc:1237] Sleep() mean lat: 21724
I20260928 23:56:43.478668 20081 rpc-test.cc:1238] Sleep() max lat: 21724
I20260928 23:56:43.478848 20081 rpc-test.cc:1239] Sleep() #calls: 1
[ OK ] Parameters/TestRpc.TestRpcHandlerLatencyMetric/SSL_TCP (110 ms)
[ RUN ] Parameters/TestRpc.TimedOutOnResponseMetricServiceQueue/SSL_TCP
I20260928 23:56:43.539582 20416 acceptor_pool.cc:254] collecting diagnostics on the listening RPC socket 0.0.0.0:46249 every 8 connection(s)
I20260928 23:56:43.540272 20417 acceptor_pool.cc:254] collecting diagnostics on the listening RPC socket 0.0.0.0:46249 every 8 connection(s)
W20260928 23:56:43.621548 20418 rpcz_store.cc:267] Call kudu.rpc_test.CalculatorService.Sleep from 127.0.0.1:46484 (request call id 2) took 20 ms (client timeout 20 ms). Trace:
W20260928 23:56:43.621933 20418 rpcz_store.cc:269] 0928 23:56:43.601009 (+ 0us) service_pool.cc:170] Inserting onto call queue
0928 23:56:43.621421 (+ 20412us) service_pool.cc:214] Skipping call since client already timed out
0928 23:56:43.621500 (+ 79us) inbound_call.cc:173] Queueing failure response
Metrics: {}
[ OK ] Parameters/TestRpc.TimedOutOnResponseMetricServiceQueue/SSL_TCP (140 ms)
[ RUN ] Parameters/TestRpc.RpcPendingConnectionsMetric/SSL_TCP
I20260928 23:56:43.639801 20439 acceptor_pool.cc:254] collecting diagnostics on the listening RPC socket 0.0.0.0:41175 every 8 connection(s)
I20260928 23:56:43.640592 20440 acceptor_pool.cc:254] collecting diagnostics on the listening RPC socket 0.0.0.0:41175 every 8 connection(s)
W20260928 23:56:43.645946 20435 negotiation.cc:337] Failed RPC negotiation. Trace:
0928 23:56:43.644638 (+ 0us) reactor.cc:625] Submitting negotiation task for server connection from 127.0.0.1:34152 (local address 127.0.0.1:41175)
0928 23:56:43.645112 (+ 474us) server_negotiation.cc:206] Beginning negotiation
0928 23:56:43.645130 (+ 18us) server_negotiation.cc:399] Waiting for connection header
0928 23:56:43.645369 (+ 239us) negotiation.cc:327] Negotiation complete: Network error: Server connection negotiation failed: server connection from 127.0.0.1:34152: BlockingRecv error: recv got EOF from 127.0.0.1:34152 (error 108)
Metrics: {"server-negotiator.queue_time_us":135}
[ OK ] Parameters/TestRpc.RpcPendingConnectionsMetric/SSL_TCP (30 ms)
[ RUN ] Parameters/TestRpc.TestRpcContextClientDeadline/SSL_TCP
I20260928 23:56:43.675539 20455 acceptor_pool.cc:254] collecting diagnostics on the listening RPC socket 0.0.0.0:35199 every 8 connection(s)
I20260928 23:56:43.676283 20456 acceptor_pool.cc:254] collecting diagnostics on the listening RPC socket 0.0.0.0:35199 every 8 connection(s)
[ OK ] Parameters/TestRpc.TestRpcContextClientDeadline/SSL_TCP (87 ms)
[ RUN ] Parameters/TestRpc.TestApplicationFeatureFlagUnsupportedServer/SSL_TCP
I20260928 23:56:43.771612 20480 acceptor_pool.cc:254] collecting diagnostics on the listening RPC socket 0.0.0.0:43295 every 8 connection(s)
I20260928 23:56:43.772311 20481 acceptor_pool.cc:254] collecting diagnostics on the listening RPC socket 0.0.0.0:43295 every 8 connection(s)
[ OK ] Parameters/TestRpc.TestApplicationFeatureFlagUnsupportedServer/SSL_TCP (75 ms)
[ RUN ] Parameters/TestRpc.TestCancellationAsync/SSL_TCP
I20260928 23:56:43.853628 20505 acceptor_pool.cc:254] collecting diagnostics on the listening RPC socket 0.0.0.0:39259 every 8 connection(s)
I20260928 23:56:43.854401 20506 acceptor_pool.cc:254] collecting diagnostics on the listening RPC socket 0.0.0.0:39259 every 8 connection(s)
I20260928 23:56:43.857702 20081 rpc-test.cc:1716] Connecting to 0.0.0.0:39259
I20260928 23:56:43.889914 20081 test_util.cc:268] Using random seed: -781289243
I20260928 23:56:44.140024 20509 rpc-test-base.h:240] got call: sleep_micros: 500 pattern: 4294967295 num_repetitions: 2097152 sidecar_idx: 0
I20260928 23:56:44.312786 20508 rpc-test-base.h:240] got call: sleep_micros: 500 pattern: 4294967295 num_repetitions: 2097152 sidecar_idx: 0
I20260928 23:56:44.510299 20509 rpc-test-base.h:240] got call: sleep_micros: 500 pattern: 4294967295 num_repetitions: 2097152 sidecar_idx: 0
I20260928 23:56:44.694128 20508 rpc-test-base.h:240] got call: sleep_micros: 500 pattern: 4294967295 num_repetitions: 2097152 sidecar_idx: 0
I20260928 23:56:44.890383 20509 rpc-test-base.h:240] got call: sleep_micros: 500 pattern: 4294967295 num_repetitions: 2097152 sidecar_idx: 0
I20260928 23:56:45.079986 20508 rpc-test-base.h:240] got call: sleep_micros: 500 pattern: 4294967295 num_repetitions: 2097152 sidecar_idx: 0
I20260928 23:56:45.259130 20509 rpc-test-base.h:240] got call: sleep_micros: 500 pattern: 4294967295 num_repetitions: 2097152 sidecar_idx: 0
W20260928 23:56:45.339124 20518 outbound_call.cc:322] RPC callback for RPC call kudu.rpc.GenericCalculatorService.SleepWithSidecar -> {remote=0.0.0.0:39259 (localhost), user_credentials={real_user=slave}} blocked reactor thread for 43652.6us
I20260928 23:56:45.451295 20508 rpc-test-base.h:240] got call: sleep_micros: 500 pattern: 4294967295 num_repetitions: 2097152 sidecar_idx: 0
W20260928 23:56:45.629309 20502 connection.cc:535] server connection from 127.0.0.1:42644 recv error: Network error: failed to read from TLS socket (remote: unknown): Connection reset by peer (error 104)
W20260928 23:56:45.629624 20502 connection.cc:158] shutting down server connection from 127.0.0.1:42644 with pending inbound data: 7962709/8388693 bytes received; last active 0 ns ago: status Network error: failed to read from TLS socket (remote: unknown): Connection reset by peer (error 104)
W20260928 23:56:45.630085 20502 connection.cc:196] Error closing socket: Network error: TlsSocket::Close: Broken pipe
W20260928 23:56:45.673507 20502 connection.cc:441] server connection from 127.0.0.1:42644 torn down before Call kudu.rpc.GenericCalculatorService.SleepWithSidecar from 127.0.0.1:42644 (request call id 8) could send its response
[ OK ] Parameters/TestRpc.TestCancellationAsync/SSL_TCP (1865 ms)
[ RUN ] Parameters/TestRpc.TestPerformanceBySocketType/SSL_TCP
I20260928 23:56:45.802110 20530 acceptor_pool.cc:254] collecting diagnostics on the listening RPC socket 0.0.0.0:46777 every 8 connection(s)
I20260928 23:56:45.802882 20531 acceptor_pool.cc:254] collecting diagnostics on the listening RPC socket 0.0.0.0:46777 every 8 connection(s)
I20260928 23:56:45.806365 20081 rpc-test.cc:1846] Connecting to 0.0.0.0:46777
I20260928 23:57:06.438875 20081 rpc-test.cc:1859] Sending 1024MB via ssl-enabled tcp socket: real 20.614s user 17.362s sys 12.021s
I20260928 23:57:26.956655 20081 rpc-test.cc:1859] Sending 1024MB via ssl-enabled tcp socket: real 20.517s user 17.836s sys 11.530s
I20260928 23:57:47.610428 20081 rpc-test.cc:1859] Sending 1024MB via ssl-enabled tcp socket: real 20.653s user 17.553s sys 11.922s
I20260928 23:58:08.173820 20081 rpc-test.cc:1859] Sending 1024MB via ssl-enabled tcp socket: real 20.563s user 17.669s sys 11.706s
I20260928 23:58:28.625579 20081 rpc-test.cc:1859] Sending 1024MB via ssl-enabled tcp socket: real 20.451s user 17.460s sys 11.671s
[ OK ] Parameters/TestRpc.TestPerformanceBySocketType/SSL_TCP (102954 ms)
[----------] 20 tests from Parameters/TestRpc (259308 ms total)
[----------] 1 test from Parameters/TestRpcSocketTxRxQueue
[ RUN ] Parameters/TestRpcSocketTxRxQueue.OverCapacity/0
W20260928 23:58:29.103008 20557 negotiation.cc:337] Failed RPC negotiation. Trace:
0928 23:58:28.655762 (+ 0us) reactor.cc:625] Submitting negotiation task for client connection to 0.0.0.0:43513 (local address 127.0.0.1:40620)
0928 23:58:28.656350 (+ 588us) negotiation.cc:107] Waiting for socket to connect
0928 23:58:28.656380 (+ 30us) client_negotiation.cc:174] Beginning negotiation
0928 23:58:28.656715 (+ 335us) client_negotiation.cc:252] Sending NEGOTIATE NegotiatePB request
0928 23:58:29.096693 (+439978us) negotiation.cc:327] Negotiation complete: Network error: Client connection negotiation failed: client connection to 0.0.0.0:43513: BlockingRecv error: recv error from unknown peer: Transport endpoint is not connected (error 107)
Metrics: {"client-negotiator.queue_time_us":100}
W20260928 23:58:29.102684 20584 negotiation.cc:337] Failed RPC negotiation. Trace:
0928 23:58:28.684607 (+ 0us) reactor.cc:625] Submitting negotiation task for client connection to 0.0.0.0:43513 (local address 127.0.0.1:40642)
0928 23:58:28.685176 (+ 569us) negotiation.cc:107] Waiting for socket to connect
0928 23:58:28.685208 (+ 32us) client_negotiation.cc:174] Beginning negotiation
0928 23:58:28.685396 (+ 188us) client_negotiation.cc:252] Sending NEGOTIATE NegotiatePB request
0928 23:58:29.096690 (+411294us) negotiation.cc:327] Negotiation complete: Network error: Client connection negotiation failed: client connection to 0.0.0.0:43513: BlockingRecv error: recv error from unknown peer: Transport endpoint is not connected (error 107)
Metrics: {"client-negotiator.queue_time_us":161}
W20260928 23:58:29.104110 20593 negotiation.cc:337] Failed RPC negotiation. Trace:
0928 23:58:28.698338 (+ 0us) reactor.cc:625] Submitting negotiation task for client connection to 0.0.0.0:43513 (local address 127.0.0.1:40652)
0928 23:58:28.698886 (+ 548us) negotiation.cc:107] Waiting for socket to connect
0928 23:58:28.698917 (+ 31us) client_negotiation.cc:174] Beginning negotiation
0928 23:58:28.699126 (+ 209us) client_negotiation.cc:252] Sending NEGOTIATE NegotiatePB request
0928 23:58:29.102592 (+403466us) negotiation.cc:327] Negotiation complete: Network error: Client connection negotiation failed: client connection to 0.0.0.0:43513: BlockingRecv error: recv error from unknown peer: Transport endpoint is not connected (error 107)
Metrics: {"client-negotiator.queue_time_us":188}
W20260928 23:58:29.104316 20602 negotiation.cc:337] Failed RPC negotiation. Trace:
0928 23:58:28.711664 (+ 0us) reactor.cc:625] Submitting negotiation task for client connection to 0.0.0.0:43513 (local address 127.0.0.1:40656)
0928 23:58:28.712310 (+ 646us) negotiation.cc:107] Waiting for socket to connect
0928 23:58:28.712343 (+ 33us) client_negotiation.cc:174] Beginning negotiation
0928 23:58:28.712624 (+ 281us) client_negotiation.cc:252] Sending NEGOTIATE NegotiatePB request
0928 23:58:29.102085 (+389461us) negotiation.cc:327] Negotiation complete: Network error: Client connection negotiation failed: client connection to 0.0.0.0:43513: BlockingRecv error: recv error from unknown peer: Transport endpoint is not connected (error 107)
Metrics: {"client-negotiator.queue_time_us":155}
W20260928 23:58:29.104401 20575 negotiation.cc:337] Failed RPC negotiation. Trace:
0928 23:58:28.671158 (+ 0us) reactor.cc:625] Submitting negotiation task for client connection to 0.0.0.0:43513 (local address 127.0.0.1:40634)
0928 23:58:28.671750 (+ 592us) negotiation.cc:107] Waiting for socket to connect
0928 23:58:28.671782 (+ 32us) client_negotiation.cc:174] Beginning negotiation
0928 23:58:28.671974 (+ 192us) client_negotiation.cc:252] Sending NEGOTIATE NegotiatePB request
0928 23:58:29.096817 (+424843us) negotiation.cc:327] Negotiation complete: Network error: Client connection negotiation failed: client connection to 0.0.0.0:43513: BlockingRecv error: recv error from unknown peer: Transport endpoint is not connected (error 107)
Metrics: {"client-negotiator.queue_time_us":166}
W20260928 23:58:29.104691 20566 negotiation.cc:337] Failed RPC negotiation. Trace:
0928 23:58:28.663379 (+ 0us) reactor.cc:625] Submitting negotiation task for client connection to 0.0.0.0:43513 (local address 127.0.0.1:40628)
0928 23:58:28.663977 (+ 598us) negotiation.cc:107] Waiting for socket to connect
0928 23:58:28.664006 (+ 29us) client_negotiation.cc:174] Beginning negotiation
0928 23:58:28.664211 (+ 205us) client_negotiation.cc:252] Sending NEGOTIATE NegotiatePB request
0928 23:58:29.096716 (+432505us) negotiation.cc:327] Negotiation complete: Network error: Client connection negotiation failed: client connection to 0.0.0.0:43513: BlockingRecv error: recv error from unknown peer: Transport endpoint is not connected (error 107)
Metrics: {"client-negotiator.queue_time_us":158}
[ OK ] Parameters/TestRpcSocketTxRxQueue.OverCapacity/0 (1244 ms)
[----------] 1 test from Parameters/TestRpcSocketTxRxQueue (1244 ms total)
[----------] Global test environment tear-down
[==========] 21 tests from 2 test suites ran. (260554 ms total)
[ PASSED ] 20 tests.
[ FAILED ] 1 test, listed below:
[ FAILED ] Parameters/TestRpc.TestCallWithChainCertAndChainCA/SSL_TCP, where GetParam() = (true, false)
1 FAILED TEST