Diagnosed failure

Parameters/TestRpc.TestCallWithChainCertAndChainCA/SSL_UnixSocket: /data0/somelongdirectorytoavoidrpathissues/src/kudu/src/kudu/rpc/rpc-test.cc:270: Failure
Failed
Bad status: Runtime error: could not verify certificate chain (error with cert: subject=CN = localhost, ST = sadfjas, C = AS, emailAddress = sdflkdsajf, O = lskdfjlsad, OU = sldfkja, issuer=C = AS, ST = ASDfkjdhf, L = lskdjf, O = saldfja, OU = skdjf, CN = localhost, emailAddress = sadjflkadsj): : certificate has expired
Google Test trace:
/data0/somelongdirectorytoavoidrpathissues/src/kudu/src/kudu/rpc/rpc-test.cc:267: Connecting to unix:/tmp/dist-test-taskeIxwbO/test-tmp/rpc-test-a1848d6cf19f40e3b7cdd583cd7afd6f.sock
I20260927 09:54:09.699473  2276 test_util.cc:175] -----------------------------------------------
I20260927 09:54:09.699573  2276 test_util.cc:176] Had fatal failures, leaving test files at /tmp/dist-test-taskeIxwbO/test-tmp/rpc-test.6.Parameters_TestRpc.TestCallWithChainCertAndChainCA_SSL_UnixSocket.1790502849568296-2276-0

Full log

Note: This is test shard 7 of 8.
[==========] Running 21 tests from 2 test suites.
[----------] Global test environment set-up.
[----------] 20 tests from Parameters/TestRpc
[ RUN      ] Parameters/TestRpc.TestMessengerCreateDestroy/SSL_UnixSocket
WARNING: Logging before InitGoogleLogging() is written to STDERR
I20260927 09:54:09.632876  2276 rpc-test.cc:169] started messenger TestCreateDestroy
[       OK ] Parameters/TestRpc.TestMessengerCreateDestroy/SSL_UnixSocket (48 ms)
[ RUN      ] Parameters/TestRpc.TestNegotiationDeadlock/SSL_UnixSocket
I20260927 09:54:09.655123  2296 acceptor_pool.cc:254] collecting diagnostics on the listening RPC socket unix:/tmp/dist-test-taskeIxwbO/test-tmp/rpc-test-98913154bfba40b784afa2d8976c0a39.sock every 8 connection(s)
I20260927 09:54:09.655359  2297 acceptor_pool.cc:254] collecting diagnostics on the listening RPC socket unix:/tmp/dist-test-taskeIxwbO/test-tmp/rpc-test-98913154bfba40b784afa2d8976c0a39.sock every 8 connection(s)
[       OK ] Parameters/TestRpc.TestNegotiationDeadlock/SSL_UnixSocket (39 ms)
[ RUN      ] Parameters/TestRpc.TestCallWithChainCertAndChainCA/SSL_UnixSocket
I20260927 09:54:09.688063  2312 acceptor_pool.cc:254] collecting diagnostics on the listening RPC socket unix:/tmp/dist-test-taskeIxwbO/test-tmp/rpc-test-a1848d6cf19f40e3b7cdd583cd7afd6f.sock every 8 connection(s)
I20260927 09:54:09.688395  2313 acceptor_pool.cc:254] collecting diagnostics on the listening RPC socket unix:/tmp/dist-test-taskeIxwbO/test-tmp/rpc-test-a1848d6cf19f40e3b7cdd583cd7afd6f.sock every 8 connection(s)
/data0/somelongdirectorytoavoidrpathissues/src/kudu/src/kudu/rpc/rpc-test.cc:270: Failure
Failed
Bad status: Runtime error: could not verify certificate chain (error with cert: subject=CN = localhost, ST = sadfjas, C = AS, emailAddress = sdflkdsajf, O = lskdfjlsad, OU = sldfkja, issuer=C = AS, ST = ASDfkjdhf, L = lskdjf, O = saldfja, OU = skdjf, CN = localhost, emailAddress = sadjflkadsj): : certificate has expired
Google Test trace:
/data0/somelongdirectorytoavoidrpathissues/src/kudu/src/kudu/rpc/rpc-test.cc:267: Connecting to unix:/tmp/dist-test-taskeIxwbO/test-tmp/rpc-test-a1848d6cf19f40e3b7cdd583cd7afd6f.sock
I20260927 09:54:09.699473  2276 test_util.cc:175] -----------------------------------------------
I20260927 09:54:09.699573  2276 test_util.cc:176] Had fatal failures, leaving test files at /tmp/dist-test-taskeIxwbO/test-tmp/rpc-test.6.Parameters_TestRpc.TestCallWithChainCertAndChainCA_SSL_UnixSocket.1790502849568296-2276-0
[  FAILED  ] Parameters/TestRpc.TestCallWithChainCertAndChainCA/SSL_UnixSocket, where GetParam() = (true, true) (24 ms)
[ RUN      ] Parameters/TestRpc.TestCallWithPasswordProtectedKey/SSL_UnixSocket
I20260927 09:54:09.715418  2337 acceptor_pool.cc:254] collecting diagnostics on the listening RPC socket unix:/tmp/dist-test-taskeIxwbO/test-tmp/rpc-test-e27719c0c7f443eea2e35bb90b4e8637.sock every 8 connection(s)
I20260927 09:54:09.715643  2338 acceptor_pool.cc:254] collecting diagnostics on the listening RPC socket unix:/tmp/dist-test-taskeIxwbO/test-tmp/rpc-test-e27719c0c7f443eea2e35bb90b4e8637.sock every 8 connection(s)
W20260927 09:54:09.746042  2334 connection.cc:196] Error closing socket: Network error: TlsSocket::Close: Broken pipe
[       OK ] Parameters/TestRpc.TestCallWithPasswordProtectedKey/SSL_UnixSocket (49 ms)
[ RUN      ] Parameters/TestRpc.TestCallToBadServer/SSL_UnixSocket
I20260927 09:54:09.757215  2276 rpc-test.cc:394] Status: Network error: Client connection negotiation failed: client connection to 0.0.0.0:0: connect: Connection refused (error 111)
I20260927 09:54:09.757867  2276 rpc-test.cc:394] Status: Network error: Client connection negotiation failed: client connection to 0.0.0.0:0: connect: Connection refused (error 111)
I20260927 09:54:09.758499  2276 rpc-test.cc:394] Status: Network error: Client connection negotiation failed: client connection to 0.0.0.0:0: connect: Connection refused (error 111)
I20260927 09:54:09.759037  2276 rpc-test.cc:394] Status: Network error: Client connection negotiation failed: client connection to 0.0.0.0:0: connect: Connection refused (error 111)
I20260927 09:54:09.759594  2276 rpc-test.cc:394] Status: Network error: Client connection negotiation failed: client connection to 0.0.0.0:0: connect: Connection refused (error 111)
[       OK ] Parameters/TestRpc.TestCallToBadServer/SSL_UnixSocket (12 ms)
[ RUN      ] Parameters/TestRpc.TestWrongService/SSL_UnixSocket
I20260927 09:54:09.784394  2372 acceptor_pool.cc:254] collecting diagnostics on the listening RPC socket unix:/tmp/dist-test-taskeIxwbO/test-tmp/rpc-test-58fc2a9c1c32422bb738ca9911f54a05.sock every 8 connection(s)
I20260927 09:54:09.784633  2373 acceptor_pool.cc:254] collecting diagnostics on the listening RPC socket unix:/tmp/dist-test-taskeIxwbO/test-tmp/rpc-test-58fc2a9c1c32422bb738ca9911f54a05.sock every 8 connection(s)
I20260927 09:54:09.811048  2369 messenger.cc:345] service WrongServiceName not registered on TestServer
W20260927 09:54:09.812294  2369 connection.cc:196] Error closing socket: Network error: TlsSocket::Close: Broken pipe
[       OK ] Parameters/TestRpc.TestWrongService/SSL_UnixSocket (54 ms)
[ RUN      ] Parameters/TestRpc.TestConnectionKeepalive/SSL_UnixSocket
I20260927 09:54:09.833629  2395 acceptor_pool.cc:254] collecting diagnostics on the listening RPC socket unix:/tmp/dist-test-taskeIxwbO/test-tmp/rpc-test-9b2c938d6d684bb09df745bbb9b58568.sock every 8 connection(s)
I20260927 09:54:09.833902  2396 acceptor_pool.cc:254] collecting diagnostics on the listening RPC socket unix:/tmp/dist-test-taskeIxwbO/test-tmp/rpc-test-9b2c938d6d684bb09df745bbb9b58568.sock every 8 connection(s)
I20260927 09:54:09.834770  2276 rpc-test.cc:488] Connecting to unix:/tmp/dist-test-taskeIxwbO/test-tmp/rpc-test-9b2c938d6d684bb09df745bbb9b58568.sock
W20260927 09:54:10.318851  2408 connection.cc:196] Error closing socket: Network error: TlsSocket::Close: Broken pipe
[       OK ] Parameters/TestRpc.TestConnectionKeepalive/SSL_UnixSocket (1050 ms)
[ RUN      ] Parameters/TestRpc.TestClientConnectionMetrics/SSL_UnixSocket
I20260927 09:54:10.885649  2420 acceptor_pool.cc:254] collecting diagnostics on the listening RPC socket unix:/tmp/dist-test-taskeIxwbO/test-tmp/rpc-test-5e1338847af7481a91ee57650c32c6f5.sock every 8 connection(s)
I20260927 09:54:10.885864  2421 acceptor_pool.cc:254] collecting diagnostics on the listening RPC socket unix:/tmp/dist-test-taskeIxwbO/test-tmp/rpc-test-5e1338847af7481a91ee57650c32c6f5.sock every 8 connection(s)
I20260927 09:54:10.886929  2276 rpc-test.cc:569] Connecting to unix:/tmp/dist-test-taskeIxwbO/test-tmp/rpc-test-5e1338847af7481a91ee57650c32c6f5.sock
W20260927 09:54:32.172390  2417 connection.cc:196] Error closing socket: Network error: TlsSocket::Close: Broken pipe
[       OK ] Parameters/TestRpc.TestClientConnectionMetrics/SSL_UnixSocket (21311 ms)
[ RUN      ] Parameters/TestRpc.TestCredentialsPolicy/SSL_UnixSocket
I20260927 09:54:32.196412  2443 acceptor_pool.cc:254] collecting diagnostics on the listening RPC socket unix:/tmp/dist-test-taskeIxwbO/test-tmp/rpc-test-f6ed9c019bf24c929969b5a9217a0ed7.sock every 8 connection(s)
I20260927 09:54:32.196648  2444 acceptor_pool.cc:254] collecting diagnostics on the listening RPC socket unix:/tmp/dist-test-taskeIxwbO/test-tmp/rpc-test-f6ed9c019bf24c929969b5a9217a0ed7.sock every 8 connection(s)
I20260927 09:54:32.197569  2276 rpc-test.cc:700] Connecting to unix:/tmp/dist-test-taskeIxwbO/test-tmp/rpc-test-f6ed9c019bf24c929969b5a9217a0ed7.sock
W20260927 09:54:32.264070  2442 connection.cc:196] Error closing socket: Network error: TlsSocket::Close: Broken pipe
[       OK ] Parameters/TestRpc.TestCredentialsPolicy/SSL_UnixSocket (95 ms)
[ RUN      ] Parameters/TestRpc.TestCallLongerThanKeepalive/SSL_UnixSocket
I20260927 09:54:32.288764  2468 acceptor_pool.cc:254] collecting diagnostics on the listening RPC socket unix:/tmp/dist-test-taskeIxwbO/test-tmp/rpc-test-0e6f67ea83d94cf7aa544c708506aab5.sock every 8 connection(s)
I20260927 09:54:32.289021  2469 acceptor_pool.cc:254] collecting diagnostics on the listening RPC socket unix:/tmp/dist-test-taskeIxwbO/test-tmp/rpc-test-0e6f67ea83d94cf7aa544c708506aab5.sock every 8 connection(s)
I20260927 09:54:32.316367  2472 rpc-test-base.h:222] got call: sleep_micros: 3000000 deferred: true
I20260927 09:54:35.318063  2472 rpcz_store.cc:275] Call kudu.rpc.GenericCalculatorService.Sleep from unix:<unnamed> (request call id 0) took 3001 ms. Trace:
I20260927 09:54:35.318233  2472 rpcz_store.cc:276] 0927 09:54:32.316267 (+     0us) service_pool.cc:170] Inserting onto call queue
0927 09:54:32.316326 (+    59us) service_pool.cc:227] Handling call
0927 09:54:35.318014 (+3001688us) inbound_call.cc:173] Queueing success response
Metrics: {}
[       OK ] Parameters/TestRpc.TestCallLongerThanKeepalive/SSL_UnixSocket (3049 ms)
[ RUN      ] Parameters/TestRpc.TestRpcSidecar/SSL_UnixSocket
I20260927 09:54:35.346029  2493 acceptor_pool.cc:254] collecting diagnostics on the listening RPC socket unix:/tmp/dist-test-taskeIxwbO/test-tmp/rpc-test-e9dff176eb4843bead61cf810d5ef31a.sock every 8 connection(s)
I20260927 09:54:35.346235  2494 acceptor_pool.cc:254] collecting diagnostics on the listening RPC socket unix:/tmp/dist-test-taskeIxwbO/test-tmp/rpc-test-e9dff176eb4843bead61cf810d5ef31a.sock every 8 connection(s)
W20260927 09:54:35.435672  2490 connection.cc:196] Error closing socket: Network error: TlsSocket::Close: Broken pipe
[       OK ] Parameters/TestRpc.TestRpcSidecar/SSL_UnixSocket (114 ms)
[ RUN      ] Parameters/TestRpc.TestRpcSidecarLimits/SSL_UnixSocket
I20260927 09:54:37.528527  2518 acceptor_pool.cc:254] collecting diagnostics on the listening RPC socket unix:/tmp/dist-test-taskeIxwbO/test-tmp/rpc-test-663672c2784a44288346706c4e7facc2.sock every 8 connection(s)
I20260927 09:54:37.528757  2519 acceptor_pool.cc:254] collecting diagnostics on the listening RPC socket unix:/tmp/dist-test-taskeIxwbO/test-tmp/rpc-test-663672c2784a44288346706c4e7facc2.sock every 8 connection(s)
W20260927 09:54:37.550127  2276 serialization.cc:72] Serialized kudu.rpc_test.PushStringsRequestPB (2147483654 bytes) is larger than the maximum configured RPC message size (52428800 bytes). Sending anyway, but peer may reject the data.
W20260927 09:54:37.555439  2515 connection.cc:535] server connection from unix:<unnamed> recv error: Network error: RPC frame had a length of 2147483714, but we only support messages up to 52428800 bytes long.
W20260927 09:54:37.555532  2515 connection.cc:158] shutting down server connection from unix:<unnamed> with pending inbound data: 4/2147483714 bytes received; last active 0 ns ago: status Network error: RPC frame had a length of 2147483714, but we only support messages up to 52428800 bytes long.
W20260927 09:54:37.556011  2531 connection.cc:196] Error closing socket: Network error: TlsSocket::Close: Broken pipe
I20260927 09:54:37.571611  2543 acceptor_pool.cc:254] collecting diagnostics on the listening RPC socket unix:/tmp/dist-test-taskeIxwbO/test-tmp/rpc-test-663672c2784a44288346706c4e7facc2.sock every 8 connection(s)
I20260927 09:54:37.571810  2544 acceptor_pool.cc:254] collecting diagnostics on the listening RPC socket unix:/tmp/dist-test-taskeIxwbO/test-tmp/rpc-test-663672c2784a44288346706c4e7facc2.sock every 8 connection(s)
W20260927 09:54:43.347723  2540 connection.cc:577] server connection from unix:<unnamed>: received bad data: 'Corruption: Invalid packet: message had a length of 2147483710, but we only support messages up to 2147483647 bytes
'
W20260927 09:54:43.348330  2556 connection.cc:196] Error closing socket: Network error: TlsSocket::Close: Broken pipe
[       OK ] Parameters/TestRpc.TestRpcSidecarLimits/SSL_UnixSocket (8368 ms)
[ RUN      ] Parameters/TestRpc.TestCallTimeoutDoesntAffectNegotiation/SSL_UnixSocket
I20260927 09:54:43.847496  2568 acceptor_pool.cc:254] collecting diagnostics on the listening RPC socket unix:/tmp/dist-test-taskeIxwbO/test-tmp/rpc-test-5a80dc4ee23e40e8905b5a371a542353.sock every 8 connection(s)
I20260927 09:54:43.847764  2569 acceptor_pool.cc:254] collecting diagnostics on the listening RPC socket unix:/tmp/dist-test-taskeIxwbO/test-tmp/rpc-test-5a80dc4ee23e40e8905b5a371a542353.sock every 8 connection(s)
W20260927 09:54:43.859977  2564 negotiation.cc:266] Injecting 500ms delay in negotiation
I20260927 09:54:43.910508  2276 rpc-test-base.h:595] status: Timed out: connection negotiation to unix:/tmp/dist-test-taskeIxwbO/test-tmp/rpc-test-5a80dc4ee23e40e8905b5a371a542353.sock for RPC Sleep timed out after 0.050s (ON_OUTBOUND_QUEUE), seconds elapsed: 0.0511379
[       OK ] Parameters/TestRpc.TestCallTimeoutDoesntAffectNegotiation/SSL_UnixSocket (563 ms)
[ RUN      ] Parameters/TestRpc.TestRpcHandlerLatencyMetric/SSL_UnixSocket
I20260927 09:54:44.389302  2593 acceptor_pool.cc:254] collecting diagnostics on the listening RPC socket unix:/tmp/dist-test-taskeIxwbO/test-tmp/rpc-test-bef8e4a311f6441a9d1b9f19bea06d98.sock every 8 connection(s)
I20260927 09:54:44.389536  2594 acceptor_pool.cc:254] collecting diagnostics on the listening RPC socket unix:/tmp/dist-test-taskeIxwbO/test-tmp/rpc-test-bef8e4a311f6441a9d1b9f19bea06d98.sock every 8 connection(s)
I20260927 09:54:44.426393  2276 rpc-test.cc:1236] Sleep() min lat: 20524
I20260927 09:54:44.426473  2276 rpc-test.cc:1237] Sleep() mean lat: 20524
I20260927 09:54:44.426512  2276 rpc-test.cc:1238] Sleep() max lat: 20524
I20260927 09:54:44.426530  2276 rpc-test.cc:1239] Sleep() #calls: 1
W20260927 09:54:44.427423  2590 connection.cc:196] Error closing socket: Network error: TlsSocket::Close: Broken pipe
[       OK ] Parameters/TestRpc.TestRpcHandlerLatencyMetric/SSL_UnixSocket (60 ms)
[ RUN      ] Parameters/TestRpc.TimedOutOnResponseMetricServiceQueue/SSL_UnixSocket
I20260927 09:54:44.454185  2619 acceptor_pool.cc:254] collecting diagnostics on the listening RPC socket unix:/tmp/dist-test-taskeIxwbO/test-tmp/rpc-test-89c86a0f86f440cc85eaec2ba7a759a4.sock every 8 connection(s)
I20260927 09:54:44.454423  2620 acceptor_pool.cc:254] collecting diagnostics on the listening RPC socket unix:/tmp/dist-test-taskeIxwbO/test-tmp/rpc-test-89c86a0f86f440cc85eaec2ba7a759a4.sock every 8 connection(s)
W20260927 09:54:44.520954  2621 rpcz_store.cc:267] Call kudu.rpc_test.CalculatorService.Sleep from unix:<unnamed> (request call id 2) took 20 ms (client timeout 20 ms). Trace:
W20260927 09:54:44.521112  2621 rpcz_store.cc:269] 0927 09:54:44.500599 (+     0us) service_pool.cc:170] Inserting onto call queue
0927 09:54:44.520893 (+ 20294us) service_pool.cc:214] Skipping call since client already timed out
0927 09:54:44.520938 (+    45us) inbound_call.cc:173] Queueing failure response
Metrics: {}
W20260927 09:54:44.522614  2616 connection.cc:196] Error closing socket: Network error: TlsSocket::Close: Broken pipe
[       OK ] Parameters/TestRpc.TimedOutOnResponseMetricServiceQueue/SSL_UnixSocket (94 ms)
[ RUN      ] Parameters/TestRpc.RpcPendingConnectionsMetric/SSL_UnixSocket
I20260927 09:54:44.530289  2642 acceptor_pool.cc:254] collecting diagnostics on the listening RPC socket 0.0.0.0:33213 every 8 connection(s)
I20260927 09:54:44.530543  2643 acceptor_pool.cc:254] collecting diagnostics on the listening RPC socket 0.0.0.0:33213 every 8 connection(s)
W20260927 09:54:44.542661  2638 negotiation.cc:337] Failed RPC negotiation. Trace:
0927 09:54:44.541765 (+     0us) reactor.cc:625] Submitting negotiation task for server connection from 127.0.0.1:54612 (local address 127.0.0.1:33213)
0927 09:54:44.542006 (+   241us) server_negotiation.cc:206] Beginning negotiation
0927 09:54:44.542012 (+     6us) server_negotiation.cc:399] Waiting for connection header
0927 09:54:44.542199 (+   187us) negotiation.cc:327] Negotiation complete: Network error: Server connection negotiation failed: server connection from 127.0.0.1:54612: BlockingRecv error: recv got EOF from 127.0.0.1:54612 (error 108)
Metrics: {"server-negotiator.queue_time_us":56}
[       OK ] Parameters/TestRpc.RpcPendingConnectionsMetric/SSL_UnixSocket (28 ms)
[ RUN      ] Parameters/TestRpc.TestRpcContextClientDeadline/SSL_UnixSocket
I20260927 09:54:44.568464  2658 acceptor_pool.cc:254] collecting diagnostics on the listening RPC socket unix:/tmp/dist-test-taskeIxwbO/test-tmp/rpc-test-5d19da543c1f4751bfe934c13d132630.sock every 8 connection(s)
I20260927 09:54:44.568672  2659 acceptor_pool.cc:254] collecting diagnostics on the listening RPC socket unix:/tmp/dist-test-taskeIxwbO/test-tmp/rpc-test-5d19da543c1f4751bfe934c13d132630.sock every 8 connection(s)
[       OK ] Parameters/TestRpc.TestRpcContextClientDeadline/SSL_UnixSocket (54 ms)
[ RUN      ] Parameters/TestRpc.TestApplicationFeatureFlagUnsupportedServer/SSL_UnixSocket
I20260927 09:54:44.625396  2683 acceptor_pool.cc:254] collecting diagnostics on the listening RPC socket unix:/tmp/dist-test-taskeIxwbO/test-tmp/rpc-test-e7d4aa7bf7d64311b3842a22336d4dcb.sock every 8 connection(s)
I20260927 09:54:44.625639  2684 acceptor_pool.cc:254] collecting diagnostics on the listening RPC socket unix:/tmp/dist-test-taskeIxwbO/test-tmp/rpc-test-e7d4aa7bf7d64311b3842a22336d4dcb.sock every 8 connection(s)
[       OK ] Parameters/TestRpc.TestApplicationFeatureFlagUnsupportedServer/SSL_UnixSocket (36 ms)
[ RUN      ] Parameters/TestRpc.TestCancellationAsync/SSL_UnixSocket
I20260927 09:54:44.658238  2708 acceptor_pool.cc:254] collecting diagnostics on the listening RPC socket unix:/tmp/dist-test-taskeIxwbO/test-tmp/rpc-test-2437b90c5f3249aabd028163b33da97d.sock every 8 connection(s)
I20260927 09:54:44.658469  2709 acceptor_pool.cc:254] collecting diagnostics on the listening RPC socket unix:/tmp/dist-test-taskeIxwbO/test-tmp/rpc-test-2437b90c5f3249aabd028163b33da97d.sock every 8 connection(s)
I20260927 09:54:44.659271  2276 rpc-test.cc:1716] Connecting to unix:/tmp/dist-test-taskeIxwbO/test-tmp/rpc-test-2437b90c5f3249aabd028163b33da97d.sock
I20260927 09:54:44.679250  2276 test_util.cc:268] Using random seed: -261546432
I20260927 09:54:44.723834  2712 rpc-test-base.h:240] got call: sleep_micros: 500 pattern: 4294967295 num_repetitions: 2097152 sidecar_idx: 0
I20260927 09:54:44.751173  2711 rpc-test-base.h:240] got call: sleep_micros: 500 pattern: 4294967295 num_repetitions: 2097152 sidecar_idx: 0
I20260927 09:54:44.779458  2712 rpc-test-base.h:240] got call: sleep_micros: 500 pattern: 4294967295 num_repetitions: 2097152 sidecar_idx: 0
I20260927 09:54:44.808175  2710 rpc-test-base.h:240] got call: sleep_micros: 500 pattern: 4294967295 num_repetitions: 2097152 sidecar_idx: 0
I20260927 09:54:44.836302  2712 rpc-test-base.h:240] got call: sleep_micros: 500 pattern: 4294967295 num_repetitions: 2097152 sidecar_idx: 0
I20260927 09:54:44.864581  2711 rpc-test-base.h:240] got call: sleep_micros: 500 pattern: 4294967295 num_repetitions: 2097152 sidecar_idx: 0
I20260927 09:54:44.897387  2712 rpc-test-base.h:240] got call: sleep_micros: 500 pattern: 4294967295 num_repetitions: 2097152 sidecar_idx: 0
W20260927 09:54:44.900200  2705 connection.cc:196] Error closing socket: Network error: TlsSocket::Close: Broken pipe
W20260927 09:54:44.917997  2705 connection.cc:441] server connection from unix:<unnamed> torn down before Call kudu.rpc.GenericCalculatorService.SleepWithSidecar from unix:<unnamed> (request call id 8) could send its response
W20260927 09:54:44.939940  2705 connection.cc:441] server connection from unix:<unnamed> torn down before Call kudu.rpc.GenericCalculatorService.SleepWithSidecar from unix:<unnamed> (request call id 9) could send its response
[       OK ] Parameters/TestRpc.TestCancellationAsync/SSL_UnixSocket (297 ms)
[ RUN      ] Parameters/TestRpc.TestPerformanceBySocketType/SSL_UnixSocket
I20260927 09:54:44.956430  2733 acceptor_pool.cc:254] collecting diagnostics on the listening RPC socket unix:/tmp/dist-test-taskeIxwbO/test-tmp/rpc-test-9466a47bbae445dc9d50f863aaad6cf9.sock every 8 connection(s)
I20260927 09:54:44.956679  2734 acceptor_pool.cc:254] collecting diagnostics on the listening RPC socket unix:/tmp/dist-test-taskeIxwbO/test-tmp/rpc-test-9466a47bbae445dc9d50f863aaad6cf9.sock every 8 connection(s)
I20260927 09:54:44.957517  2276 rpc-test.cc:1846] Connecting to unix:/tmp/dist-test-taskeIxwbO/test-tmp/rpc-test-9466a47bbae445dc9d50f863aaad6cf9.sock
I20260927 09:54:48.054510  2276 rpc-test.cc:1859] Sending 1024MB via ssl-enabled unix socket: real 3.087s	user 3.122s	sys 2.136s
I20260927 09:54:51.202183  2276 rpc-test.cc:1859] Sending 1024MB via ssl-enabled unix socket: real 3.148s	user 3.062s	sys 2.324s
I20260927 09:54:54.217214  2276 rpc-test.cc:1859] Sending 1024MB via ssl-enabled unix socket: real 3.015s	user 2.941s	sys 2.190s
I20260927 09:54:57.286756  2276 rpc-test.cc:1859] Sending 1024MB via ssl-enabled unix socket: real 3.069s	user 2.914s	sys 2.315s
I20260927 09:55:00.358047  2276 rpc-test.cc:1859] Sending 1024MB via ssl-enabled unix socket: real 3.071s	user 2.992s	sys 2.236s
W20260927 09:55:00.360599  2730 connection.cc:196] Error closing socket: Network error: TlsSocket::Close: Broken pipe
[       OK ] Parameters/TestRpc.TestPerformanceBySocketType/SSL_UnixSocket (15422 ms)
[----------] 20 tests from Parameters/TestRpc (50778 ms total)

[----------] 1 test from Parameters/TestRpcSocketTxRxQueue
[ RUN      ] Parameters/TestRpcSocketTxRxQueue.AcceptorRxQueueSizeMetric/0
I20260927 09:55:00.370263  2758 acceptor_pool.cc:254] collecting diagnostics on the listening RPC socket 0.0.0.0:40673 every 1 connection(s)
I20260927 09:55:00.370482  2759 acceptor_pool.cc:254] collecting diagnostics on the listening RPC socket 0.0.0.0:40673 every 1 connection(s)
W20260927 09:55:00.372001  2754 negotiation.cc:337] Failed RPC negotiation. Trace:
0927 09:55:00.371673 (+     0us) reactor.cc:625] Submitting negotiation task for server connection from 127.0.0.1:39314 (local address 127.0.0.1:40673)
0927 09:55:00.371784 (+   111us) server_negotiation.cc:206] Beginning negotiation
0927 09:55:00.371788 (+     4us) server_negotiation.cc:399] Waiting for connection header
0927 09:55:00.371909 (+   121us) negotiation.cc:327] Negotiation complete: Network error: Server connection negotiation failed: server connection from 127.0.0.1:39314: BlockingRecv error: recv got EOF from 127.0.0.1:39314 (error 108)
Metrics: {"server-negotiator.queue_time_us":26}
[       OK ] Parameters/TestRpcSocketTxRxQueue.AcceptorRxQueueSizeMetric/0 (9 ms)
[----------] 1 test from Parameters/TestRpcSocketTxRxQueue (9 ms total)

[----------] Global test environment tear-down
[==========] 21 tests from 2 test suites ran. (50788 ms total)
[  PASSED  ] 20 tests.
[  FAILED  ] 1 test, listed below:
[  FAILED  ] Parameters/TestRpc.TestCallWithChainCertAndChainCA/SSL_UnixSocket, where GetParam() = (true, true)

 1 FAILED TEST