Diagnosed failure

Parameters/TestRpc.TestCallWithChainCertAndRootCA/SSL_TCP: /data0/somelongdirectorytoavoidrpathissues/src/kudu/src/kudu/rpc/rpc-test.cc:303: Failure
Failed
Bad status: Runtime error: could not verify certificate chain (error with cert: subject=CN = localhost, ST = sadfjas, C = AS, emailAddress = sdflkdsajf, O = lskdfjlsad, OU = sldfkja, issuer=C = AS, ST = ASDfkjdhf, L = lskdjf, O = saldfja, OU = skdjf, CN = localhost, emailAddress = sadjflkadsj): : certificate has expired
Google Test trace:
/data0/somelongdirectorytoavoidrpathissues/src/kudu/src/kudu/rpc/rpc-test.cc:300: Connecting to 0.0.0.0:36187
I20260925 21:59:45.153494  3656 test_util.cc:175] -----------------------------------------------
I20260925 21:59:45.153652  3656 test_util.cc:176] Had fatal failures, leaving test files at /tmp/dist-test-task0ezXPR/test-tmp/rpc-test.1.Parameters_TestRpc.TestCallWithChainCertAndRootCA_SSL_TCP.1790373583750719-3656-0

Full log

Note: This is test shard 2 of 8.
[==========] Running 21 tests from 2 test suites.
[----------] Global test environment set-up.
[----------] 1 test from TestRpc
[ RUN      ] TestRpc.TestMethodsByName
[       OK ] TestRpc.TestMethodsByName (6 ms)
[----------] 1 test from TestRpc (6 ms total)

[----------] 20 tests from Parameters/TestRpc
[ RUN      ] Parameters/TestRpc.TestAcceptorPoolStartStop/SSL_TCP
WARNING: Logging before InitGoogleLogging() is written to STDERR
I20260925 21:59:43.856295  3671 acceptor_pool.cc:254] collecting diagnostics on the listening RPC socket 0.0.0.0:43129 every 8 connection(s)
W20260925 21:59:44.858578  3656 thread.cc:536] Waited for 1000ms trying to join with acceptor (tid 3672)
I20260925 21:59:43.858083  3672 acceptor_pool.cc:254] collecting diagnostics on the listening RPC socket 0.0.0.0:43129 every 8 connection(s)
I20260925 21:59:44.912158  3683 acceptor_pool.cc:254] collecting diagnostics on the listening RPC socket 0.0.0.0:36411 every 8 connection(s)
I20260925 21:59:44.913887  3684 acceptor_pool.cc:254] collecting diagnostics on the listening RPC socket 0.0.0.0:36411 every 8 connection(s)
I20260925 21:59:44.929800  3694 acceptor_pool.cc:254] collecting diagnostics on the listening RPC socket 0.0.0.0:36293 every 8 connection(s)
I20260925 21:59:44.931556  3695 acceptor_pool.cc:254] collecting diagnostics on the listening RPC socket 0.0.0.0:36293 every 8 connection(s)
I20260925 21:59:44.963785  3705 acceptor_pool.cc:254] collecting diagnostics on the listening RPC socket 0.0.0.0:44847 every 8 connection(s)
I20260925 21:59:44.964452  3706 acceptor_pool.cc:254] collecting diagnostics on the listening RPC socket 0.0.0.0:44847 every 8 connection(s)
I20260925 21:59:44.981333  3716 acceptor_pool.cc:254] collecting diagnostics on the listening RPC socket 0.0.0.0:33849 every 8 connection(s)
I20260925 21:59:44.981997  3717 acceptor_pool.cc:254] collecting diagnostics on the listening RPC socket 0.0.0.0:33849 every 8 connection(s)
[       OK ] Parameters/TestRpc.TestAcceptorPoolStartStop/SSL_TCP (1177 ms)
[ RUN      ] Parameters/TestRpc.TestCall/SSL_TCP
I20260925 21:59:45.011407  3729 acceptor_pool.cc:254] collecting diagnostics on the listening RPC socket 0.0.0.0:38509 every 8 connection(s)
I20260925 21:59:45.013116  3730 acceptor_pool.cc:254] collecting diagnostics on the listening RPC socket 0.0.0.0:38509 every 8 connection(s)
I20260925 21:59:45.017911  3656 rpc-test.cc:234] Connecting to 0.0.0.0:38509
[       OK ] Parameters/TestRpc.TestCall/SSL_TCP (124 ms)
[ RUN      ] Parameters/TestRpc.TestCallWithChainCertAndRootCA/SSL_TCP
I20260925 21:59:45.135102  3754 acceptor_pool.cc:254] collecting diagnostics on the listening RPC socket 0.0.0.0:36187 every 8 connection(s)
I20260925 21:59:45.135761  3755 acceptor_pool.cc:254] collecting diagnostics on the listening RPC socket 0.0.0.0:36187 every 8 connection(s)
/data0/somelongdirectorytoavoidrpathissues/src/kudu/src/kudu/rpc/rpc-test.cc:303: Failure
Failed
Bad status: Runtime error: could not verify certificate chain (error with cert: subject=CN = localhost, ST = sadfjas, C = AS, emailAddress = sdflkdsajf, O = lskdfjlsad, OU = sldfkja, issuer=C = AS, ST = ASDfkjdhf, L = lskdjf, O = saldfja, OU = skdjf, CN = localhost, emailAddress = sadjflkadsj): : certificate has expired
Google Test trace:
/data0/somelongdirectorytoavoidrpathissues/src/kudu/src/kudu/rpc/rpc-test.cc:300: Connecting to 0.0.0.0:36187
I20260925 21:59:45.153494  3656 test_util.cc:175] -----------------------------------------------
I20260925 21:59:45.153652  3656 test_util.cc:176] Had fatal failures, leaving test files at /tmp/dist-test-task0ezXPR/test-tmp/rpc-test.1.Parameters_TestRpc.TestCallWithChainCertAndRootCA_SSL_TCP.1790373583750719-3656-0
[  FAILED  ] Parameters/TestRpc.TestCallWithChainCertAndRootCA/SSL_TCP, where GetParam() = (true, false) (43 ms)
[ RUN      ] Parameters/TestRpc.TestCallWithBadPasswordProtectedKey/SSL_TCP
[       OK ] Parameters/TestRpc.TestCallWithBadPasswordProtectedKey/SSL_TCP (27 ms)
[ RUN      ] Parameters/TestRpc.TestInvalidMethodCall/SSL_TCP
I20260925 21:59:45.198693  3791 acceptor_pool.cc:254] collecting diagnostics on the listening RPC socket 0.0.0.0:39447 every 8 connection(s)
I20260925 21:59:45.199443  3792 acceptor_pool.cc:254] collecting diagnostics on the listening RPC socket 0.0.0.0:39447 every 8 connection(s)
I20260925 21:59:45.202472  3656 rpc-test.cc:406] Connecting to 0.0.0.0:39447
[       OK ] Parameters/TestRpc.TestInvalidMethodCall/SSL_TCP (51 ms)
[ RUN      ] Parameters/TestRpc.TestHighFDs/SSL_TCP
I20260925 21:59:45.418521  3816 acceptor_pool.cc:254] collecting diagnostics on the listening RPC socket 0.0.0.0:42309 every 8 connection(s)
I20260925 21:59:45.419231  3817 acceptor_pool.cc:254] collecting diagnostics on the listening RPC socket 0.0.0.0:42309 every 8 connection(s)
[       OK ] Parameters/TestRpc.TestHighFDs/SSL_TCP (246 ms)
[ RUN      ] Parameters/TestRpc.TestConnectionAlwaysKeepalive/SSL_TCP
I20260925 21:59:45.504182  3839 acceptor_pool.cc:254] collecting diagnostics on the listening RPC socket 0.0.0.0:34027 every 8 connection(s)
I20260925 21:59:45.504817  3840 acceptor_pool.cc:254] collecting diagnostics on the listening RPC socket 0.0.0.0:34027 every 8 connection(s)
I20260925 21:59:45.507620  3656 rpc-test.cc:532] Connecting to 0.0.0.0:34027
[       OK ] Parameters/TestRpc.TestConnectionAlwaysKeepalive/SSL_TCP (3079 ms)
[ RUN      ] Parameters/TestRpc.TestReopenOutboundConnections/SSL_TCP
I20260925 21:59:48.590327  3862 acceptor_pool.cc:254] collecting diagnostics on the listening RPC socket 0.0.0.0:37949 every 8 connection(s)
I20260925 21:59:48.590958  3863 acceptor_pool.cc:254] collecting diagnostics on the listening RPC socket 0.0.0.0:37949 every 8 connection(s)
I20260925 21:59:48.593776  3656 rpc-test.cc:658] Connecting to 0.0.0.0:37949
[       OK ] Parameters/TestRpc.TestReopenOutboundConnections/SSL_TCP (352 ms)
[ RUN      ] Parameters/TestRpc.TestConnectionNetworkPlane/SSL_TCP
I20260925 21:59:48.939716  3885 acceptor_pool.cc:254] collecting diagnostics on the listening RPC socket 0.0.0.0:45053 every 8 connection(s)
I20260925 21:59:48.940382  3886 acceptor_pool.cc:254] collecting diagnostics on the listening RPC socket 0.0.0.0:45053 every 8 connection(s)
I20260925 21:59:48.943259  3656 rpc-test.cc:772] Connecting to 0.0.0.0:45053
[       OK ] Parameters/TestRpc.TestConnectionNetworkPlane/SSL_TCP (89 ms)
[ RUN      ] Parameters/TestRpc.TestTCPKeepalive/SSL_TCP
I20260925 21:59:49.014804  3910 acceptor_pool.cc:254] collecting diagnostics on the listening RPC socket 0.0.0.0:37021 every 8 connection(s)
I20260925 21:59:49.015488  3911 acceptor_pool.cc:254] collecting diagnostics on the listening RPC socket 0.0.0.0:37021 every 8 connection(s)
I20260925 21:59:49.057258  3914 rpc-test-base.h:222] got call: sleep_micros: 8000000 deferred: true
I20260925 21:59:57.061174  3914 rpcz_store.cc:275] Call kudu.rpc.GenericCalculatorService.Sleep from 127.0.0.1:49182 (request call id 0) took 8004 ms. Trace:
I20260925 21:59:57.061617  3914 rpcz_store.cc:276] 0925 21:59:49.057016 (+     0us) service_pool.cc:170] Inserting onto call queue
0925 21:59:49.057114 (+    98us) service_pool.cc:227] Handling call
0925 21:59:57.061017 (+8003903us) inbound_call.cc:173] Queueing success response
Metrics: {}
[       OK ] Parameters/TestRpc.TestTCPKeepalive/SSL_TCP (8074 ms)
[ RUN      ] Parameters/TestRpc.TestMaxSmallSidecars/SSL_TCP
I20260925 21:59:57.100519  3936 acceptor_pool.cc:254] collecting diagnostics on the listening RPC socket 0.0.0.0:38903 every 8 connection(s)
I20260925 21:59:57.101142  3937 acceptor_pool.cc:254] collecting diagnostics on the listening RPC socket 0.0.0.0:38903 every 8 connection(s)
[       OK ] Parameters/TestRpc.TestMaxSmallSidecars/SSL_TCP (190 ms)
[ RUN      ] Parameters/TestRpc.TestCallTimeout/SSL_TCP
I20260925 21:59:57.296959  3961 acceptor_pool.cc:254] collecting diagnostics on the listening RPC socket 0.0.0.0:35005 every 8 connection(s)
I20260925 21:59:57.297627  3962 acceptor_pool.cc:254] collecting diagnostics on the listening RPC socket 0.0.0.0:35005 every 8 connection(s)
I20260925 21:59:57.321640  3656 rpc-test-base.h:595] status: Timed out: connection negotiation to 0.0.0.0:35005 for RPC Sleep timed out after 0.000s (ON_OUTBOUND_QUEUE), seconds elapsed: 0.00223827
I20260925 21:59:57.328357  3965 rpc-test-base.h:222] got call: sleep_micros: 700000
I20260925 21:59:57.522887  3656 rpc-test-base.h:595] status: Timed out: Sleep RPC to 0.0.0.0:35005 timed out after 0.200s (SENT), seconds elapsed: 0.20093
I20260925 21:59:57.524220  3964 rpc-test-base.h:222] got call: sleep_micros: 2000000
W20260925 21:59:58.028945  3965 rpcz_store.cc:267] Call kudu.rpc.GenericCalculatorService.Sleep from 127.0.0.1:43986 (request call id 1) took 700 ms (client timeout 200 ms). Trace:
W20260925 21:59:58.029270  3965 rpcz_store.cc:269] 0925 21:59:57.328208 (+     0us) service_pool.cc:170] Inserting onto call queue
0925 21:59:57.328305 (+    97us) service_pool.cc:227] Handling call
0925 21:59:58.028885 (+700580us) inbound_call.cc:173] Queueing success response
Metrics: {}
I20260925 21:59:59.024652  3656 rpc-test-base.h:595] status: Timed out: Sleep RPC to 0.0.0.0:35005 timed out after 1.500s (SENT), seconds elapsed: 1.50146
W20260925 21:59:59.524682  3964 rpcz_store.cc:267] Call kudu.rpc.GenericCalculatorService.Sleep from 127.0.0.1:43986 (request call id 2) took 2000 ms (client timeout 1500 ms). Trace:
W20260925 21:59:59.524967  3964 rpcz_store.cc:269] 0925 21:59:57.523938 (+     0us) service_pool.cc:170] Inserting onto call queue
0925 21:59:57.524068 (+   130us) service_pool.cc:227] Handling call
0925 21:59:59.524631 (+2000563us) inbound_call.cc:173] Queueing success response
Metrics: {}
W20260925 21:59:59.525484  3959 connection.cc:441] server connection from 127.0.0.1:43986 torn down before Call kudu.rpc.GenericCalculatorService.Sleep from 127.0.0.1:43986 (request call id 2) could send its response
[       OK ] Parameters/TestRpc.TestCallTimeout/SSL_TCP (2263 ms)
[ RUN      ] Parameters/TestRpc.TestServerShutsDown/SSL_TCP
I20260925 21:59:59.531706  3656 rpc-test.cc:1125] Connecting to 0.0.0.0:36853
W20260925 21:59:59.540028  3978 negotiation.cc:337] Failed RPC negotiation. Trace:
0925 21:59:59.538588 (+     0us) reactor.cc:625] Submitting negotiation task for client connection to 0.0.0.0:36853 (local address 127.0.0.1:47454)
0925 21:59:59.538986 (+   398us) negotiation.cc:107] Waiting for socket to connect
0925 21:59:59.539015 (+    29us) client_negotiation.cc:174] Beginning negotiation
0925 21:59:59.539242 (+   227us) client_negotiation.cc:252] Sending NEGOTIATE NegotiatePB request
0925 21:59:59.539467 (+   225us) negotiation.cc:327] Negotiation complete: Network error: Client connection negotiation failed: client connection to 0.0.0.0:36853: BlockingWrite error: write error: Broken pipe (error 32)
Metrics: {"client-negotiator.queue_time_us":93}
[       OK ] Parameters/TestRpc.TestServerShutsDown/SSL_TCP (11 ms)
[ RUN      ] Parameters/TestRpc.TimedOutOnResponseMetric/SSL_TCP
I20260925 21:59:59.581481  3995 acceptor_pool.cc:254] collecting diagnostics on the listening RPC socket 0.0.0.0:35367 every 8 connection(s)
I20260925 21:59:59.582144  3996 acceptor_pool.cc:254] collecting diagnostics on the listening RPC socket 0.0.0.0:35367 every 8 connection(s)
W20260925 21:59:59.811678  3999 rpcz_store.cc:267] Call kudu.rpc_test.CalculatorService.Sleep from 127.0.0.1:58322 (request call id 3) took 50 ms (client timeout 25 ms). Trace:
W20260925 21:59:59.811983  3999 rpcz_store.cc:269] 0925 21:59:59.761185 (+     0us) service_pool.cc:170] Inserting onto call queue
0925 21:59:59.761280 (+    95us) service_pool.cc:227] Handling call
0925 21:59:59.811618 (+ 50338us) inbound_call.cc:173] Queueing success response
Related trace 'test_child':
Metrics: {"test_sleep_us":50000,"child_traces":[["test_child",{"related_trace_metric":1}]]}
W20260925 21:59:59.870069  3999 rpcz_store.cc:267] Call kudu.rpc_test.CalculatorService.Sleep from 127.0.0.1:58322 (request call id 4) took 50 ms (client timeout 50 ms). Trace:
W20260925 21:59:59.870321  3999 rpcz_store.cc:269] 0925 21:59:59.819598 (+     0us) service_pool.cc:170] Inserting onto call queue
0925 21:59:59.819693 (+    95us) service_pool.cc:227] Handling call
0925 21:59:59.870012 (+ 50319us) inbound_call.cc:173] Queueing success response
Related trace 'test_child':
Metrics: {"test_sleep_us":50000,"child_traces":[["test_child",{"related_trace_metric":1}]]}
[       OK ] Parameters/TestRpc.TimedOutOnResponseMetric/SSL_TCP (335 ms)
[ RUN      ] Parameters/TestRpc.AcceptorDispatchingTimesMetric/SSL_TCP
I20260925 21:59:59.887321  4020 acceptor_pool.cc:254] collecting diagnostics on the listening RPC socket 0.0.0.0:43223 every 8 connection(s)
I20260925 21:59:59.888005  4021 acceptor_pool.cc:254] collecting diagnostics on the listening RPC socket 0.0.0.0:43223 every 8 connection(s)
W20260925 21:59:59.893405  4016 negotiation.cc:337] Failed RPC negotiation. Trace:
0925 21:59:59.891643 (+     0us) reactor.cc:625] Submitting negotiation task for server connection from 127.0.0.1:35136 (local address 127.0.0.1:43223)
0925 21:59:59.892191 (+   548us) server_negotiation.cc:206] Beginning negotiation
0925 21:59:59.892222 (+    31us) server_negotiation.cc:399] Waiting for connection header
0925 21:59:59.892562 (+   340us) negotiation.cc:327] Negotiation complete: Network error: Server connection negotiation failed: server connection from 127.0.0.1:35136: BlockingRecv error: recv got EOF from 127.0.0.1:35136 (error 108)
Metrics: {"server-negotiator.queue_time_us":136}
[       OK ] Parameters/TestRpc.AcceptorDispatchingTimesMetric/SSL_TCP (18 ms)
[ RUN      ] Parameters/TestRpc.TestRpcCallbackDestroysMessenger/SSL_TCP
[       OK ] Parameters/TestRpc.TestRpcCallbackDestroysMessenger/SSL_TCP (14 ms)
[ RUN      ] Parameters/TestRpc.TestApplicationFeatureFlag/SSL_TCP
I20260925 21:59:59.931679  4045 acceptor_pool.cc:254] collecting diagnostics on the listening RPC socket 0.0.0.0:41125 every 8 connection(s)
I20260925 21:59:59.932353  4046 acceptor_pool.cc:254] collecting diagnostics on the listening RPC socket 0.0.0.0:41125 every 8 connection(s)
W20260925 21:59:59.967146  4043 messenger.cc:357] Unable to handle RPC call: Not implemented: call requires unsupported application feature flags: 99
[       OK ] Parameters/TestRpc.TestApplicationFeatureFlag/SSL_TCP (63 ms)
[ RUN      ] Parameters/TestRpc.TestCancellation/SSL_TCP
I20260925 21:59:59.997352  4070 acceptor_pool.cc:254] collecting diagnostics on the listening RPC socket 0.0.0.0:41063 every 8 connection(s)
I20260925 21:59:59.998020  4071 acceptor_pool.cc:254] collecting diagnostics on the listening RPC socket 0.0.0.0:41063 every 8 connection(s)
I20260925 22:00:00.001269  3656 rpc-test.cc:1648] Connecting to 0.0.0.0:41063
I20260925 22:00:00.103318  3656 rpc-test-base.h:595] status: Aborted: Sleep RPC to 0.0.0.0:41063 is cancelled in state READY, seconds elapsed: 0.000300361
I20260925 22:00:00.242816  3656 rpc-test-base.h:595] status: Aborted: Sleep RPC to 0.0.0.0:41063 is cancelled in state SENT, seconds elapsed: 0.000773738
I20260925 22:00:00.281268  4073 rpc-test-base.h:222] got call: sleep_micros: 510000
I20260925 22:00:00.390030  3656 rpc-test-base.h:595] status: Aborted: Sleep RPC to 0.0.0.0:41063 is cancelled in state SENT, seconds elapsed: 0.000695702
I20260925 22:00:00.428830  4072 rpc-test-base.h:222] got call: sleep_micros: 510000
I20260925 22:00:00.538652  3656 rpc-test-base.h:595] status: Aborted: Sleep RPC to 0.0.0.0:41063 is cancelled in state SENT, seconds elapsed: 0.000737905
W20260925 22:00:00.577857  4074 rpcz_store.cc:267] Call kudu.rpc.GenericCalculatorService.Sleep from 127.0.0.1:60908 (request call id 11) took 16 ms (client timeout 10 ms). Trace:
W20260925 22:00:00.578147  4074 rpcz_store.cc:269] 0925 22:00:00.561393 (+     0us) service_pool.cc:170] Inserting onto call queue
0925 22:00:00.577596 (+ 16203us) service_pool.cc:214] Skipping call since client already timed out
0925 22:00:00.577697 (+   101us) inbound_call.cc:173] Queueing failure response
Metrics: {}
I20260925 22:00:00.578583  4074 rpc-test-base.h:222] got call: sleep_micros: 1500000
W20260925 22:00:00.791903  4073 rpcz_store.cc:267] Call kudu.rpc.GenericCalculatorService.Sleep from 127.0.0.1:60908 (request call id 3) took 510 ms (client timeout 10 ms). Trace:
W20260925 22:00:00.792209  4073 rpcz_store.cc:269] 0925 22:00:00.281016 (+     0us) service_pool.cc:170] Inserting onto call queue
0925 22:00:00.281184 (+   168us) service_pool.cc:227] Handling call
0925 22:00:00.791853 (+510669us) inbound_call.cc:173] Queueing success response
Metrics: {}
W20260925 22:00:00.939536  4072 rpcz_store.cc:267] Call kudu.rpc.GenericCalculatorService.Sleep from 127.0.0.1:60908 (request call id 7) took 511 ms (client timeout 10 ms). Trace:
W20260925 22:00:00.939836  4072 rpcz_store.cc:269] 0925 22:00:00.428634 (+     0us) service_pool.cc:170] Inserting onto call queue
0925 22:00:00.428763 (+   129us) service_pool.cc:227] Handling call
0925 22:00:00.939481 (+510718us) inbound_call.cc:173] Queueing success response
Metrics: {}
I20260925 22:00:01.540079  3656 rpc-test-base.h:595] status: Timed out: Sleep RPC to 0.0.0.0:41063 timed out after 1.000s (SENT), seconds elapsed: 1.00109
I20260925 22:00:01.541256  4072 rpc-test-base.h:222] got call: sleep_micros: 1500000
W20260925 22:00:02.079015  4074 rpcz_store.cc:267] Call kudu.rpc.GenericCalculatorService.Sleep from 127.0.0.1:60908 (request call id 12) took 1517 ms (client timeout 1000 ms). Trace:
W20260925 22:00:02.079356  4074 rpcz_store.cc:269] 0925 22:00:00.561733 (+     0us) service_pool.cc:170] Inserting onto call queue
0925 22:00:00.578547 (+ 16814us) service_pool.cc:227] Handling call
0925 22:00:02.078969 (+1500422us) inbound_call.cc:173] Queueing success response
Metrics: {}
I20260925 22:00:02.542053  3656 rpc-test-base.h:595] status: Timed out: Sleep RPC to 0.0.0.0:41063 timed out after 1.000s (SENT), seconds elapsed: 1.00168
W20260925 22:00:02.543370  4068 messenger.cc:357] Unable to handle RPC call: Not implemented: call requires unsupported application feature flags: 99, 1
W20260925 22:00:02.544638  4068 messenger.cc:357] Unable to handle RPC call: Not implemented: call requires unsupported application feature flags: 99, 1
W20260925 22:00:03.041719  4072 rpcz_store.cc:267] Call kudu.rpc.GenericCalculatorService.Sleep from 127.0.0.1:60908 (request call id 13) took 1500 ms (client timeout 1000 ms). Trace:
W20260925 22:00:03.042007  4072 rpcz_store.cc:269] 0925 22:00:01.541085 (+     0us) service_pool.cc:170] Inserting onto call queue
0925 22:00:01.541213 (+   128us) service_pool.cc:227] Handling call
0925 22:00:03.041669 (+1500456us) inbound_call.cc:173] Queueing success response
Metrics: {}
W20260925 22:00:03.042471  4068 connection.cc:441] server connection from 127.0.0.1:60908 torn down before Call kudu.rpc.GenericCalculatorService.Sleep from 127.0.0.1:60908 (request call id 13) could send its response
[       OK ] Parameters/TestRpc.TestCancellation/SSL_TCP (3073 ms)
[ RUN      ] Parameters/TestRpc.TestCancellationMultiThreads/SSL_TCP
I20260925 22:00:03.092953  4095 acceptor_pool.cc:254] collecting diagnostics on the listening RPC socket 0.0.0.0:39665 every 8 connection(s)
I20260925 22:00:03.093619  4096 acceptor_pool.cc:254] collecting diagnostics on the listening RPC socket 0.0.0.0:39665 every 8 connection(s)
I20260925 22:00:03.096475  3656 rpc-test.cc:1808] Connecting to 0.0.0.0:39665
I20260925 22:00:03.226281  4109 test_util.cc:268] Using random seed: -693980531
I20260925 22:00:03.227322  4110 test_util.cc:268] Using random seed: -693979485
I20260925 22:00:03.228830  4111 test_util.cc:268] Using random seed: -693977976
I20260925 22:00:03.230208  4112 test_util.cc:268] Using random seed: -693976624
I20260925 22:00:03.231588  4113 test_util.cc:268] Using random seed: -693975334
I20260925 22:00:03.232939  4114 test_util.cc:268] Using random seed: -693974004
I20260925 22:00:03.234200  4115 test_util.cc:268] Using random seed: -693972725
I20260925 22:00:03.236104  4116 test_util.cc:268] Using random seed: -693971265
I20260925 22:00:03.237421  4117 test_util.cc:268] Using random seed: -693969495
I20260925 22:00:03.238976  4118 test_util.cc:268] Using random seed: -693967952
I20260925 22:00:03.240931  4119 test_util.cc:268] Using random seed: -693966028
I20260925 22:00:03.242832  4120 test_util.cc:268] Using random seed: -693964072
I20260925 22:00:03.244966  4121 test_util.cc:268] Using random seed: -693961969
I20260925 22:00:03.246795  4122 test_util.cc:268] Using random seed: -693960558
I20260925 22:00:03.248175  4123 test_util.cc:268] Using random seed: -693958736
I20260925 22:00:03.250502  4124 test_util.cc:268] Using random seed: -693956433
I20260925 22:00:03.252300  4125 test_util.cc:268] Using random seed: -693954651
I20260925 22:00:03.254022  4126 test_util.cc:268] Using random seed: -693952912
I20260925 22:00:03.255640  4127 test_util.cc:268] Using random seed: -693951821
I20260925 22:00:03.259153  4128 test_util.cc:268] Using random seed: -693947760
I20260925 22:00:03.260866  4129 test_util.cc:268] Using random seed: -693946496
I20260925 22:00:03.262040  4130 test_util.cc:268] Using random seed: -693944920
I20260925 22:00:03.264070  4131 test_util.cc:268] Using random seed: -693942957
I20260925 22:00:03.266322  4132 test_util.cc:268] Using random seed: -693940624
I20260925 22:00:03.268155  4133 test_util.cc:268] Using random seed: -693938763
I20260925 22:00:03.270135  4134 test_util.cc:268] Using random seed: -693936815
I20260925 22:00:03.272001  4135 test_util.cc:268] Using random seed: -693934937
I20260925 22:00:03.274001  4136 test_util.cc:268] Using random seed: -693932941
I20260925 22:00:03.275401  4137 test_util.cc:268] Using random seed: -693931526
I20260925 22:00:03.277215  4138 test_util.cc:268] Using random seed: -693929742
[       OK ] Parameters/TestRpc.TestCancellationMultiThreads/SSL_TCP (16582 ms)
[ RUN      ] Parameters/TestRpc.TestCallId/SSL_TCP
I20260925 22:00:19.653940  4152 acceptor_pool.cc:254] collecting diagnostics on the listening RPC socket 0.0.0.0:33563 every 8 connection(s)
I20260925 22:00:19.654644  4153 acceptor_pool.cc:254] collecting diagnostics on the listening RPC socket 0.0.0.0:33563 every 8 connection(s)
[       OK ] Parameters/TestRpc.TestCallId/SSL_TCP (70 ms)
[----------] 20 tests from Parameters/TestRpc (35893 ms total)

[----------] Global test environment tear-down
[==========] 21 tests from 2 test suites ran. (35900 ms total)
[  PASSED  ] 20 tests.
[  FAILED  ] 1 test, listed below:
[  FAILED  ] Parameters/TestRpc.TestCallWithChainCertAndRootCA/SSL_TCP, where GetParam() = (true, false)

 1 FAILED TEST