Diagnosed failure

Parameters/TestRpc.TestCallWithChainCertAndRootCA/SSL_UnixSocket: /data0/somelongdirectorytoavoidrpathissues/src/kudu/src/kudu/rpc/rpc-test.cc:303: Failure
Failed
Bad status: Runtime error: could not verify certificate chain (error with cert: subject=CN = localhost, ST = sadfjas, C = AS, emailAddress = sdflkdsajf, O = lskdfjlsad, OU = sldfkja, issuer=C = AS, ST = ASDfkjdhf, L = lskdjf, O = saldfja, OU = skdjf, CN = localhost, emailAddress = sadjflkadsj): : certificate has expired
Google Test trace:
/data0/somelongdirectorytoavoidrpathissues/src/kudu/src/kudu/rpc/rpc-test.cc:300: Connecting to unix:/tmp/dist-test-task9ozB9D/test-tmp/rpc-test-29fa2ebaefb5499a9779897fe636b3ca.sock
I20260925 21:59:37.396934  2061 test_util.cc:175] -----------------------------------------------
I20260925 21:59:37.397156  2061 test_util.cc:176] Had fatal failures, leaving test files at /tmp/dist-test-task9ozB9D/test-tmp/rpc-test.2.Parameters_TestRpc.TestCallWithChainCertAndRootCA_SSL_UnixSocket.1790373573797995-2061-0

Full log

Note: This is test shard 3 of 8.
[==========] Running 21 tests from 2 test suites.
[----------] Global test environment set-up.
[----------] 1 test from TestRpc
[ RUN      ] TestRpc.TestNegotiationTimeout
WARNING: Logging before InitGoogleLogging() is written to STDERR
I20260925 21:59:33.997148  2061 rpc-test-base.h:595] status: Timed out: connection negotiation to 0.0.0.0:44327 for RPC Sleep timed out after 0.100s (ON_OUTBOUND_QUEUE), seconds elapsed: 0.101857
W20260925 21:59:37.100917  2071 negotiation.cc:337] Failed RPC negotiation. Trace:
0925 21:59:33.896324 (+     0us) reactor.cc:625] Submitting negotiation task for client connection to 0.0.0.0:44327 (local address 127.0.0.1:59478)
0925 21:59:33.896990 (+   666us) negotiation.cc:107] Waiting for socket to connect
0925 21:59:33.897041 (+    51us) client_negotiation.cc:174] Beginning negotiation
0925 21:59:33.909847 (+ 12806us) client_negotiation.cc:252] Sending NEGOTIATE NegotiatePB request
0925 21:59:37.099742 (+3189895us) negotiation.cc:327] Negotiation complete: Timed out: Client connection negotiation failed: client connection to 0.0.0.0:44327: received 0 of 4 requested bytes
Metrics: {"client-negotiator.queue_time_us":198}
[       OK ] TestRpc.TestNegotiationTimeout (3251 ms)
[----------] 1 test from TestRpc (3251 ms total)

[----------] 20 tests from Parameters/TestRpc
[ RUN      ] Parameters/TestRpc.TestAcceptorPoolStartStop/SSL_UnixSocket
I20260925 21:59:37.148816  2087 acceptor_pool.cc:254] collecting diagnostics on the listening RPC socket unix:/tmp/dist-test-task9ozB9D/test-tmp/rpc-test-1f0d8a7c29604b34a1650a268e460db6.sock every 8 connection(s)
I20260925 21:59:37.150454  2088 acceptor_pool.cc:254] collecting diagnostics on the listening RPC socket unix:/tmp/dist-test-task9ozB9D/test-tmp/rpc-test-1f0d8a7c29604b34a1650a268e460db6.sock every 8 connection(s)
I20260925 21:59:37.185280  2098 acceptor_pool.cc:254] collecting diagnostics on the listening RPC socket unix:/tmp/dist-test-task9ozB9D/test-tmp/rpc-test-1f0d8a7c29604b34a1650a268e460db6.sock every 8 connection(s)
I20260925 21:59:37.186657  2099 acceptor_pool.cc:254] collecting diagnostics on the listening RPC socket unix:/tmp/dist-test-task9ozB9D/test-tmp/rpc-test-1f0d8a7c29604b34a1650a268e460db6.sock every 8 connection(s)
I20260925 21:59:37.206934  2109 acceptor_pool.cc:254] collecting diagnostics on the listening RPC socket unix:/tmp/dist-test-task9ozB9D/test-tmp/rpc-test-1f0d8a7c29604b34a1650a268e460db6.sock every 8 connection(s)
I20260925 21:59:37.207774  2110 acceptor_pool.cc:254] collecting diagnostics on the listening RPC socket unix:/tmp/dist-test-task9ozB9D/test-tmp/rpc-test-1f0d8a7c29604b34a1650a268e460db6.sock every 8 connection(s)
I20260925 21:59:37.222414  2120 acceptor_pool.cc:254] collecting diagnostics on the listening RPC socket unix:/tmp/dist-test-task9ozB9D/test-tmp/rpc-test-1f0d8a7c29604b34a1650a268e460db6.sock every 8 connection(s)
I20260925 21:59:37.223119  2121 acceptor_pool.cc:254] collecting diagnostics on the listening RPC socket unix:/tmp/dist-test-task9ozB9D/test-tmp/rpc-test-1f0d8a7c29604b34a1650a268e460db6.sock every 8 connection(s)
I20260925 21:59:37.245223  2131 acceptor_pool.cc:254] collecting diagnostics on the listening RPC socket unix:/tmp/dist-test-task9ozB9D/test-tmp/rpc-test-1f0d8a7c29604b34a1650a268e460db6.sock every 8 connection(s)
I20260925 21:59:37.245970  2132 acceptor_pool.cc:254] collecting diagnostics on the listening RPC socket unix:/tmp/dist-test-task9ozB9D/test-tmp/rpc-test-1f0d8a7c29604b34a1650a268e460db6.sock every 8 connection(s)
[       OK ] Parameters/TestRpc.TestAcceptorPoolStartStop/SSL_UnixSocket (144 ms)
[ RUN      ] Parameters/TestRpc.TestCall/SSL_UnixSocket
I20260925 21:59:37.267035  2144 acceptor_pool.cc:254] collecting diagnostics on the listening RPC socket unix:/tmp/dist-test-task9ozB9D/test-tmp/rpc-test-24aa7ec8b2584f908943126ac3507942.sock every 8 connection(s)
I20260925 21:59:37.269076  2145 acceptor_pool.cc:254] collecting diagnostics on the listening RPC socket unix:/tmp/dist-test-task9ozB9D/test-tmp/rpc-test-24aa7ec8b2584f908943126ac3507942.sock every 8 connection(s)
I20260925 21:59:37.274544  2061 rpc-test.cc:234] Connecting to unix:/tmp/dist-test-task9ozB9D/test-tmp/rpc-test-24aa7ec8b2584f908943126ac3507942.sock
[       OK ] Parameters/TestRpc.TestCall/SSL_UnixSocket (88 ms)
[ RUN      ] Parameters/TestRpc.TestCallWithChainCertAndRootCA/SSL_UnixSocket
I20260925 21:59:37.374361  2169 acceptor_pool.cc:254] collecting diagnostics on the listening RPC socket unix:/tmp/dist-test-task9ozB9D/test-tmp/rpc-test-29fa2ebaefb5499a9779897fe636b3ca.sock every 8 connection(s)
I20260925 21:59:37.375273  2170 acceptor_pool.cc:254] collecting diagnostics on the listening RPC socket unix:/tmp/dist-test-task9ozB9D/test-tmp/rpc-test-29fa2ebaefb5499a9779897fe636b3ca.sock every 8 connection(s)
/data0/somelongdirectorytoavoidrpathissues/src/kudu/src/kudu/rpc/rpc-test.cc:303: Failure
Failed
Bad status: Runtime error: could not verify certificate chain (error with cert: subject=CN = localhost, ST = sadfjas, C = AS, emailAddress = sdflkdsajf, O = lskdfjlsad, OU = sldfkja, issuer=C = AS, ST = ASDfkjdhf, L = lskdjf, O = saldfja, OU = skdjf, CN = localhost, emailAddress = sadjflkadsj): : certificate has expired
Google Test trace:
/data0/somelongdirectorytoavoidrpathissues/src/kudu/src/kudu/rpc/rpc-test.cc:300: Connecting to unix:/tmp/dist-test-task9ozB9D/test-tmp/rpc-test-29fa2ebaefb5499a9779897fe636b3ca.sock
I20260925 21:59:37.396934  2061 test_util.cc:175] -----------------------------------------------
I20260925 21:59:37.397156  2061 test_util.cc:176] Had fatal failures, leaving test files at /tmp/dist-test-task9ozB9D/test-tmp/rpc-test.2.Parameters_TestRpc.TestCallWithChainCertAndRootCA_SSL_UnixSocket.1790373573797995-2061-0
[  FAILED  ] Parameters/TestRpc.TestCallWithChainCertAndRootCA/SSL_UnixSocket, where GetParam() = (true, true) (58 ms)
[ RUN      ] Parameters/TestRpc.TestCallWithBadPasswordProtectedKey/SSL_UnixSocket
[       OK ] Parameters/TestRpc.TestCallWithBadPasswordProtectedKey/SSL_UnixSocket (33 ms)
[ RUN      ] Parameters/TestRpc.TestInvalidMethodCall/SSL_UnixSocket
I20260925 21:59:37.449791  2206 acceptor_pool.cc:254] collecting diagnostics on the listening RPC socket unix:/tmp/dist-test-task9ozB9D/test-tmp/rpc-test-bb90e896d0b3465f8f7006b9be49dc3e.sock every 8 connection(s)
I20260925 21:59:37.450615  2207 acceptor_pool.cc:254] collecting diagnostics on the listening RPC socket unix:/tmp/dist-test-task9ozB9D/test-tmp/rpc-test-bb90e896d0b3465f8f7006b9be49dc3e.sock every 8 connection(s)
I20260925 21:59:37.454200  2061 rpc-test.cc:406] Connecting to unix:/tmp/dist-test-task9ozB9D/test-tmp/rpc-test-bb90e896d0b3465f8f7006b9be49dc3e.sock
[       OK ] Parameters/TestRpc.TestInvalidMethodCall/SSL_UnixSocket (83 ms)
[ RUN      ] Parameters/TestRpc.TestHighFDs/SSL_UnixSocket
I20260925 21:59:37.727859  2231 acceptor_pool.cc:254] collecting diagnostics on the listening RPC socket unix:/tmp/dist-test-task9ozB9D/test-tmp/rpc-test-e39866182c3545678d4f4bebdf862803.sock every 8 connection(s)
I20260925 21:59:37.728566  2232 acceptor_pool.cc:254] collecting diagnostics on the listening RPC socket unix:/tmp/dist-test-task9ozB9D/test-tmp/rpc-test-e39866182c3545678d4f4bebdf862803.sock every 8 connection(s)
W20260925 21:59:37.754753  2228 connection.cc:196] Error closing socket: Network error: TlsSocket::Close: Broken pipe
[       OK ] Parameters/TestRpc.TestHighFDs/SSL_UnixSocket (252 ms)
[ RUN      ] Parameters/TestRpc.TestConnectionAlwaysKeepalive/SSL_UnixSocket
I20260925 21:59:37.785579  2254 acceptor_pool.cc:254] collecting diagnostics on the listening RPC socket unix:/tmp/dist-test-task9ozB9D/test-tmp/rpc-test-71e6220790dd4ce2b5f687106142cdc7.sock every 8 connection(s)
I20260925 21:59:37.786293  2255 acceptor_pool.cc:254] collecting diagnostics on the listening RPC socket unix:/tmp/dist-test-task9ozB9D/test-tmp/rpc-test-71e6220790dd4ce2b5f687106142cdc7.sock every 8 connection(s)
I20260925 21:59:37.789397  2061 rpc-test.cc:532] Connecting to unix:/tmp/dist-test-task9ozB9D/test-tmp/rpc-test-71e6220790dd4ce2b5f687106142cdc7.sock
W20260925 21:59:40.819747  2253 connection.cc:196] Error closing socket: Network error: TlsSocket::Close: Broken pipe
[       OK ] Parameters/TestRpc.TestConnectionAlwaysKeepalive/SSL_UnixSocket (3056 ms)
[ RUN      ] Parameters/TestRpc.TestReopenOutboundConnections/SSL_UnixSocket
I20260925 21:59:40.843295  2277 acceptor_pool.cc:254] collecting diagnostics on the listening RPC socket unix:/tmp/dist-test-task9ozB9D/test-tmp/rpc-test-4bbb2c9af5924267b85c7f1a21a273c1.sock every 8 connection(s)
I20260925 21:59:40.843983  2278 acceptor_pool.cc:254] collecting diagnostics on the listening RPC socket unix:/tmp/dist-test-task9ozB9D/test-tmp/rpc-test-4bbb2c9af5924267b85c7f1a21a273c1.sock every 8 connection(s)
I20260925 21:59:40.847102  2061 rpc-test.cc:658] Connecting to unix:/tmp/dist-test-task9ozB9D/test-tmp/rpc-test-4bbb2c9af5924267b85c7f1a21a273c1.sock
W20260925 21:59:40.882503  2276 connection.cc:196] Error closing socket: Network error: TlsSocket::Close: Broken pipe
W20260925 21:59:40.892086  2276 connection.cc:196] Error closing socket: Network error: TlsSocket::Close: Broken pipe
W20260925 21:59:40.901830  2276 connection.cc:196] Error closing socket: Network error: TlsSocket::Close: Broken pipe
W20260925 21:59:40.912549  2276 connection.cc:196] Error closing socket: Network error: TlsSocket::Close: Broken pipe
W20260925 21:59:40.922314  2276 connection.cc:196] Error closing socket: Network error: TlsSocket::Close: Broken pipe
W20260925 21:59:40.931927  2276 connection.cc:196] Error closing socket: Network error: TlsSocket::Close: Broken pipe
W20260925 21:59:40.941430  2276 connection.cc:196] Error closing socket: Network error: TlsSocket::Close: Broken pipe
W20260925 21:59:40.951516  2276 connection.cc:196] Error closing socket: Network error: TlsSocket::Close: Broken pipe
W20260925 21:59:40.961253  2276 connection.cc:196] Error closing socket: Network error: TlsSocket::Close: Broken pipe
W20260925 21:59:40.971351  2276 connection.cc:196] Error closing socket: Network error: TlsSocket::Close: Broken pipe
W20260925 21:59:40.981227  2276 connection.cc:196] Error closing socket: Network error: TlsSocket::Close: Broken pipe
W20260925 21:59:40.990717  2276 connection.cc:196] Error closing socket: Network error: TlsSocket::Close: Broken pipe
W20260925 21:59:41.000195  2276 connection.cc:196] Error closing socket: Network error: TlsSocket::Close: Broken pipe
W20260925 21:59:41.010296  2276 connection.cc:196] Error closing socket: Network error: TlsSocket::Close: Broken pipe
W20260925 21:59:41.010424  2277 acceptor_pool.cc:285] unable to collect diagnostics on RPC socket unix:/tmp/dist-test-task9ozB9D/test-tmp/rpc-test-4bbb2c9af5924267b85c7f1a21a273c1.sock: Not implemented: netlink diagnostics is currently supported only on IPv4 TCP sockets
W20260925 21:59:41.020010  2276 connection.cc:196] Error closing socket: Network error: TlsSocket::Close: Broken pipe
W20260925 21:59:41.030162  2276 connection.cc:196] Error closing socket: Network error: TlsSocket::Close: Broken pipe
W20260925 21:59:41.040863  2276 connection.cc:196] Error closing socket: Network error: TlsSocket::Close: Broken pipe
W20260925 21:59:41.051944  2276 connection.cc:196] Error closing socket: Network error: TlsSocket::Close: Broken pipe
W20260925 21:59:41.062288  2276 connection.cc:196] Error closing socket: Network error: TlsSocket::Close: Broken pipe
W20260925 21:59:41.072911  2276 connection.cc:196] Error closing socket: Network error: TlsSocket::Close: Broken pipe
W20260925 21:59:41.084215  2276 connection.cc:196] Error closing socket: Network error: TlsSocket::Close: Broken pipe
W20260925 21:59:41.094998  2276 connection.cc:196] Error closing socket: Network error: TlsSocket::Close: Broken pipe
W20260925 21:59:41.106300  2276 connection.cc:196] Error closing socket: Network error: TlsSocket::Close: Broken pipe
W20260925 21:59:41.129196  2276 connection.cc:196] Error closing socket: Network error: TlsSocket::Close: Broken pipe
W20260925 21:59:41.139384  2276 connection.cc:196] Error closing socket: Network error: TlsSocket::Close: Broken pipe
W20260925 21:59:41.149904  2276 connection.cc:196] Error closing socket: Network error: TlsSocket::Close: Broken pipe
W20260925 21:59:41.158869  2276 connection.cc:196] Error closing socket: Network error: TlsSocket::Close: Broken pipe
W20260925 21:59:41.168972  2276 connection.cc:196] Error closing socket: Network error: TlsSocket::Close: Broken pipe
W20260925 21:59:41.179011  2276 connection.cc:196] Error closing socket: Network error: TlsSocket::Close: Broken pipe
W20260925 21:59:41.187995  2276 connection.cc:196] Error closing socket: Network error: TlsSocket::Close: Broken pipe
W20260925 21:59:41.199849  2276 connection.cc:196] Error closing socket: Network error: TlsSocket::Close: Broken pipe
[       OK ] Parameters/TestRpc.TestReopenOutboundConnections/SSL_UnixSocket (380 ms)
[ RUN      ] Parameters/TestRpc.TestConnectionNetworkPlane/SSL_UnixSocket
I20260925 21:59:41.228801  2300 acceptor_pool.cc:254] collecting diagnostics on the listening RPC socket unix:/tmp/dist-test-task9ozB9D/test-tmp/rpc-test-47d4ae40ae1c428c82417a6197f6e743.sock every 8 connection(s)
I20260925 21:59:41.229478  2301 acceptor_pool.cc:254] collecting diagnostics on the listening RPC socket unix:/tmp/dist-test-task9ozB9D/test-tmp/rpc-test-47d4ae40ae1c428c82417a6197f6e743.sock every 8 connection(s)
I20260925 21:59:41.232643  2061 rpc-test.cc:772] Connecting to unix:/tmp/dist-test-task9ozB9D/test-tmp/rpc-test-47d4ae40ae1c428c82417a6197f6e743.sock
W20260925 21:59:41.275297  2299 connection.cc:196] Error closing socket: Network error: TlsSocket::Close: Broken pipe
[       OK ] Parameters/TestRpc.TestConnectionNetworkPlane/SSL_UnixSocket (76 ms)
[ RUN      ] Parameters/TestRpc.TestTCPKeepalive/SSL_UnixSocket
I20260925 21:59:41.306267  2325 acceptor_pool.cc:254] collecting diagnostics on the listening RPC socket unix:/tmp/dist-test-task9ozB9D/test-tmp/rpc-test-853c7bf406c348bb80e8b0f4766dbcc7.sock every 8 connection(s)
I20260925 21:59:41.307035  2326 acceptor_pool.cc:254] collecting diagnostics on the listening RPC socket unix:/tmp/dist-test-task9ozB9D/test-tmp/rpc-test-853c7bf406c348bb80e8b0f4766dbcc7.sock every 8 connection(s)
I20260925 21:59:41.350050  2329 rpc-test-base.h:222] got call: sleep_micros: 8000000 deferred: true
I20260925 21:59:49.354136  2329 rpcz_store.cc:275] Call kudu.rpc.GenericCalculatorService.Sleep from unix:<unnamed> (request call id 0) took 8004 ms. Trace:
I20260925 21:59:49.354588  2329 rpcz_store.cc:276] 0925 21:59:41.349879 (+     0us) service_pool.cc:170] Inserting onto call queue
0925 21:59:41.349996 (+   117us) service_pool.cc:227] Handling call
0925 21:59:49.353957 (+8003961us) inbound_call.cc:173] Queueing success response
Metrics: {}
W20260925 21:59:49.360905  2322 connection.cc:196] Error closing socket: Network error: TlsSocket::Close: Broken pipe
[       OK ] Parameters/TestRpc.TestTCPKeepalive/SSL_UnixSocket (8087 ms)
[ RUN      ] Parameters/TestRpc.TestMaxSmallSidecars/SSL_UnixSocket
I20260925 21:59:49.389940  2351 acceptor_pool.cc:254] collecting diagnostics on the listening RPC socket unix:/tmp/dist-test-task9ozB9D/test-tmp/rpc-test-198e02a760634f87b8763894405c2610.sock every 8 connection(s)
I20260925 21:59:49.390787  2352 acceptor_pool.cc:254] collecting diagnostics on the listening RPC socket unix:/tmp/dist-test-task9ozB9D/test-tmp/rpc-test-198e02a760634f87b8763894405c2610.sock every 8 connection(s)
W20260925 21:59:49.549708  2348 connection.cc:196] Error closing socket: Network error: TlsSocket::Close: Broken pipe
[       OK ] Parameters/TestRpc.TestMaxSmallSidecars/SSL_UnixSocket (186 ms)
[ RUN      ] Parameters/TestRpc.TestCallTimeout/SSL_UnixSocket
I20260925 21:59:49.579639  2376 acceptor_pool.cc:254] collecting diagnostics on the listening RPC socket unix:/tmp/dist-test-task9ozB9D/test-tmp/rpc-test-92ba027ec7a74a49adf0677268932221.sock every 8 connection(s)
I20260925 21:59:49.580370  2377 acceptor_pool.cc:254] collecting diagnostics on the listening RPC socket unix:/tmp/dist-test-task9ozB9D/test-tmp/rpc-test-92ba027ec7a74a49adf0677268932221.sock every 8 connection(s)
I20260925 21:59:49.615139  2061 rpc-test-base.h:595] status: Timed out: connection negotiation to unix:/tmp/dist-test-task9ozB9D/test-tmp/rpc-test-92ba027ec7a74a49adf0677268932221.sock for RPC Sleep timed out after 0.000s (ON_OUTBOUND_QUEUE), seconds elapsed: 0.00281768
I20260925 21:59:49.623128  2380 rpc-test-base.h:222] got call: sleep_micros: 700000
I20260925 21:59:49.816850  2061 rpc-test-base.h:595] status: Timed out: Sleep RPC to unix:/tmp/dist-test-task9ozB9D/test-tmp/rpc-test-92ba027ec7a74a49adf0677268932221.sock timed out after 0.200s (SENT), seconds elapsed: 0.2012
I20260925 21:59:49.818279  2379 rpc-test-base.h:222] got call: sleep_micros: 2000000
W20260925 21:59:50.323837  2380 rpcz_store.cc:267] Call kudu.rpc.GenericCalculatorService.Sleep from unix:<unnamed> (request call id 1) took 701 ms (client timeout 200 ms). Trace:
W20260925 21:59:50.324220  2380 rpcz_store.cc:269] 0925 21:59:49.622924 (+     0us) service_pool.cc:170] Inserting onto call queue
0925 21:59:49.623077 (+   153us) service_pool.cc:227] Handling call
0925 21:59:50.323772 (+700695us) inbound_call.cc:173] Queueing success response
Metrics: {}
I20260925 21:59:51.318713  2061 rpc-test-base.h:595] status: Timed out: Sleep RPC to unix:/tmp/dist-test-task9ozB9D/test-tmp/rpc-test-92ba027ec7a74a49adf0677268932221.sock timed out after 1.500s (SENT), seconds elapsed: 1.50153
W20260925 21:59:51.321805  2373 connection.cc:196] Error closing socket: Network error: TlsSocket::Close: Broken pipe
W20260925 21:59:51.818804  2379 rpcz_store.cc:267] Call kudu.rpc.GenericCalculatorService.Sleep from unix:<unnamed> (request call id 2) took 2000 ms (client timeout 1500 ms). Trace:
W20260925 21:59:51.819134  2379 rpcz_store.cc:269] 0925 21:59:49.818008 (+     0us) service_pool.cc:170] Inserting onto call queue
0925 21:59:49.818126 (+   118us) service_pool.cc:227] Handling call
0925 21:59:51.818750 (+2000624us) inbound_call.cc:173] Queueing success response
Metrics: {}
W20260925 21:59:51.819914  2373 connection.cc:441] server connection from unix:<unnamed> torn down before Call kudu.rpc.GenericCalculatorService.Sleep from unix:<unnamed> (request call id 2) could send its response
[       OK ] Parameters/TestRpc.TestCallTimeout/SSL_UnixSocket (2270 ms)
[ RUN      ] Parameters/TestRpc.TestServerShutsDown/SSL_UnixSocket
I20260925 21:59:51.827157  2061 rpc-test.cc:1125] Connecting to 0.0.0.0:33039
W20260925 21:59:51.836877  2393 negotiation.cc:337] Failed RPC negotiation. Trace:
0925 21:59:51.835263 (+     0us) reactor.cc:625] Submitting negotiation task for client connection to 0.0.0.0:33039 (local address 127.0.0.1:46178)
0925 21:59:51.835745 (+   482us) negotiation.cc:107] Waiting for socket to connect
0925 21:59:51.835778 (+    33us) client_negotiation.cc:174] Beginning negotiation
0925 21:59:51.836003 (+   225us) client_negotiation.cc:252] Sending NEGOTIATE NegotiatePB request
0925 21:59:51.836278 (+   275us) negotiation.cc:327] Negotiation complete: Network error: Client connection negotiation failed: client connection to 0.0.0.0:33039: BlockingWrite error: write error: Broken pipe (error 32)
Metrics: {"client-negotiator.queue_time_us":121}
[       OK ] Parameters/TestRpc.TestServerShutsDown/SSL_UnixSocket (14 ms)
[ RUN      ] Parameters/TestRpc.TimedOutOnResponseMetric/SSL_UnixSocket
I20260925 21:59:51.871235  2410 acceptor_pool.cc:254] collecting diagnostics on the listening RPC socket unix:/tmp/dist-test-task9ozB9D/test-tmp/rpc-test-851137b3e44e40cdb27ef862c2528390.sock every 8 connection(s)
I20260925 21:59:51.872063  2411 acceptor_pool.cc:254] collecting diagnostics on the listening RPC socket unix:/tmp/dist-test-task9ozB9D/test-tmp/rpc-test-851137b3e44e40cdb27ef862c2528390.sock every 8 connection(s)
W20260925 21:59:52.120451  2414 rpcz_store.cc:267] Call kudu.rpc_test.CalculatorService.Sleep from unix:<unnamed> (request call id 3) took 50 ms (client timeout 25 ms). Trace:
W20260925 21:59:52.120787  2414 rpcz_store.cc:269] 0925 21:59:52.069848 (+     0us) service_pool.cc:170] Inserting onto call queue
0925 21:59:52.069965 (+   117us) service_pool.cc:227] Handling call
0925 21:59:52.120376 (+ 50411us) inbound_call.cc:173] Queueing success response
Related trace 'test_child':
Metrics: {"test_sleep_us":50000,"child_traces":[["test_child",{"related_trace_metric":1}]]}
W20260925 21:59:52.180124  2414 rpcz_store.cc:267] Call kudu.rpc_test.CalculatorService.Sleep from unix:<unnamed> (request call id 4) took 50 ms (client timeout 50 ms). Trace:
W20260925 21:59:52.180457  2414 rpcz_store.cc:269] 0925 21:59:52.129551 (+     0us) service_pool.cc:170] Inserting onto call queue
0925 21:59:52.129694 (+   143us) service_pool.cc:227] Handling call
0925 21:59:52.180055 (+ 50361us) inbound_call.cc:173] Queueing success response
Related trace 'test_child':
Metrics: {"test_sleep_us":50000,"child_traces":[["test_child",{"related_trace_metric":1}]]}
[       OK ] Parameters/TestRpc.TimedOutOnResponseMetric/SSL_UnixSocket (349 ms)
[ RUN      ] Parameters/TestRpc.AcceptorDispatchingTimesMetric/SSL_UnixSocket
I20260925 21:59:52.200183  2435 acceptor_pool.cc:254] collecting diagnostics on the listening RPC socket 0.0.0.0:45391 every 8 connection(s)
I20260925 21:59:52.200819  2436 acceptor_pool.cc:254] collecting diagnostics on the listening RPC socket 0.0.0.0:45391 every 8 connection(s)
W20260925 21:59:52.206254  2431 negotiation.cc:337] Failed RPC negotiation. Trace:
0925 21:59:52.205008 (+     0us) reactor.cc:625] Submitting negotiation task for server connection from 127.0.0.1:36104 (local address 127.0.0.1:45391)
0925 21:59:52.205583 (+   575us) server_negotiation.cc:206] Beginning negotiation
0925 21:59:52.205603 (+    20us) server_negotiation.cc:399] Waiting for connection header
0925 21:59:52.205819 (+   216us) negotiation.cc:327] Negotiation complete: Network error: Server connection negotiation failed: server connection from 127.0.0.1:36104: BlockingRecv error: recv got EOF from 127.0.0.1:36104 (error 108)
Metrics: {"server-negotiator.queue_time_us":134}
[       OK ] Parameters/TestRpc.AcceptorDispatchingTimesMetric/SSL_UnixSocket (25 ms)
[ RUN      ] Parameters/TestRpc.TestRpcCallbackDestroysMessenger/SSL_UnixSocket
[       OK ] Parameters/TestRpc.TestRpcCallbackDestroysMessenger/SSL_UnixSocket (38 ms)
[ RUN      ] Parameters/TestRpc.TestApplicationFeatureFlag/SSL_UnixSocket
I20260925 21:59:52.284384  2460 acceptor_pool.cc:254] collecting diagnostics on the listening RPC socket unix:/tmp/dist-test-task9ozB9D/test-tmp/rpc-test-5caddc1dd2c5452599b44f629e992353.sock every 8 connection(s)
I20260925 21:59:52.285113  2461 acceptor_pool.cc:254] collecting diagnostics on the listening RPC socket unix:/tmp/dist-test-task9ozB9D/test-tmp/rpc-test-5caddc1dd2c5452599b44f629e992353.sock every 8 connection(s)
W20260925 21:59:52.315218  2457 messenger.cc:357] Unable to handle RPC call: Not implemented: call requires unsupported application feature flags: 99
[       OK ] Parameters/TestRpc.TestApplicationFeatureFlag/SSL_UnixSocket (70 ms)
[ RUN      ] Parameters/TestRpc.TestCancellation/SSL_UnixSocket
I20260925 21:59:52.344973  2485 acceptor_pool.cc:254] collecting diagnostics on the listening RPC socket unix:/tmp/dist-test-task9ozB9D/test-tmp/rpc-test-421ff84882004f11a73aea85e8ec235d.sock every 8 connection(s)
I20260925 21:59:52.345659  2486 acceptor_pool.cc:254] collecting diagnostics on the listening RPC socket unix:/tmp/dist-test-task9ozB9D/test-tmp/rpc-test-421ff84882004f11a73aea85e8ec235d.sock every 8 connection(s)
I20260925 21:59:52.348785  2061 rpc-test.cc:1648] Connecting to unix:/tmp/dist-test-task9ozB9D/test-tmp/rpc-test-421ff84882004f11a73aea85e8ec235d.sock
I20260925 21:59:52.461850  2061 rpc-test-base.h:595] status: Aborted: Sleep RPC to unix:/tmp/dist-test-task9ozB9D/test-tmp/rpc-test-421ff84882004f11a73aea85e8ec235d.sock is cancelled in state READY, seconds elapsed: 0.000384872
I20260925 21:59:52.644150  2061 rpc-test-base.h:595] status: Aborted: Sleep RPC to unix:/tmp/dist-test-task9ozB9D/test-tmp/rpc-test-421ff84882004f11a73aea85e8ec235d.sock is cancelled in state SENT, seconds elapsed: 0.000973422
I20260925 21:59:52.644385  2488 rpc-test-base.h:222] got call: sleep_micros: 510000
I20260925 21:59:52.815526  2061 rpc-test-base.h:595] status: Aborted: Sleep RPC to unix:/tmp/dist-test-task9ozB9D/test-tmp/rpc-test-421ff84882004f11a73aea85e8ec235d.sock is cancelled in state SENT, seconds elapsed: 0.0007355
I20260925 21:59:52.815864  2487 rpc-test-base.h:222] got call: sleep_micros: 510000
I20260925 21:59:53.006579  2061 rpc-test-base.h:595] status: Aborted: Sleep RPC to unix:/tmp/dist-test-task9ozB9D/test-tmp/rpc-test-421ff84882004f11a73aea85e8ec235d.sock is cancelled in state SENT, seconds elapsed: 0.000700969
W20260925 21:59:53.017129  2489 rpcz_store.cc:267] Call kudu.rpc.GenericCalculatorService.Sleep from unix:<unnamed> (request call id 11) took 10 ms (client timeout 10 ms). Trace:
W20260925 21:59:53.017437  2489 rpcz_store.cc:269] 0925 21:59:53.006742 (+     0us) service_pool.cc:170] Inserting onto call queue
0925 21:59:53.016981 (+ 10239us) service_pool.cc:214] Skipping call since client already timed out
0925 21:59:53.017087 (+   106us) inbound_call.cc:173] Queueing failure response
Metrics: {}
I20260925 21:59:53.017985  2489 rpc-test-base.h:222] got call: sleep_micros: 1500000
W20260925 21:59:53.155078  2488 rpcz_store.cc:267] Call kudu.rpc.GenericCalculatorService.Sleep from unix:<unnamed> (request call id 3) took 510 ms (client timeout 10 ms). Trace:
W20260925 21:59:53.155419  2488 rpcz_store.cc:269] 0925 21:59:52.644190 (+     0us) service_pool.cc:170] Inserting onto call queue
0925 21:59:52.644332 (+   142us) service_pool.cc:227] Handling call
0925 21:59:53.154995 (+510663us) inbound_call.cc:173] Queueing success response
Metrics: {}
W20260925 21:59:53.326435  2487 rpcz_store.cc:267] Call kudu.rpc.GenericCalculatorService.Sleep from unix:<unnamed> (request call id 7) took 510 ms (client timeout 10 ms). Trace:
W20260925 21:59:53.326733  2487 rpcz_store.cc:269] 0925 21:59:52.815673 (+     0us) service_pool.cc:170] Inserting onto call queue
0925 21:59:52.815819 (+   146us) service_pool.cc:227] Handling call
0925 21:59:53.326384 (+510565us) inbound_call.cc:173] Queueing success response
Metrics: {}
I20260925 21:59:54.009271  2061 rpc-test-base.h:595] status: Timed out: Sleep RPC to unix:/tmp/dist-test-task9ozB9D/test-tmp/rpc-test-421ff84882004f11a73aea85e8ec235d.sock timed out after 1.000s (SENT), seconds elapsed: 1.00222
I20260925 21:59:54.011703  2487 rpc-test-base.h:222] got call: sleep_micros: 1500000
W20260925 21:59:54.518687  2489 rpcz_store.cc:267] Call kudu.rpc.GenericCalculatorService.Sleep from unix:<unnamed> (request call id 12) took 1511 ms (client timeout 1000 ms). Trace:
W20260925 21:59:54.519099  2489 rpcz_store.cc:269] 0925 21:59:53.007698 (+     0us) service_pool.cc:170] Inserting onto call queue
0925 21:59:53.017950 (+ 10252us) service_pool.cc:227] Handling call
0925 21:59:54.518544 (+1500594us) inbound_call.cc:173] Queueing success response
Metrics: {}
I20260925 21:59:55.011687  2061 rpc-test-base.h:595] status: Timed out: Sleep RPC to unix:/tmp/dist-test-task9ozB9D/test-tmp/rpc-test-421ff84882004f11a73aea85e8ec235d.sock timed out after 1.000s (SENT), seconds elapsed: 1.00191
W20260925 21:59:55.013072  2482 messenger.cc:357] Unable to handle RPC call: Not implemented: call requires unsupported application feature flags: 99, 1
W20260925 21:59:55.014565  2482 messenger.cc:357] Unable to handle RPC call: Not implemented: call requires unsupported application feature flags: 99, 1
W20260925 21:59:55.241040  2482 connection.cc:196] Error closing socket: Network error: TlsSocket::Close: Broken pipe
W20260925 21:59:55.512387  2487 rpcz_store.cc:267] Call kudu.rpc.GenericCalculatorService.Sleep from unix:<unnamed> (request call id 13) took 1501 ms (client timeout 1000 ms). Trace:
W20260925 21:59:55.512691  2487 rpcz_store.cc:269] 0925 21:59:54.011290 (+     0us) service_pool.cc:170] Inserting onto call queue
0925 21:59:54.011568 (+   278us) service_pool.cc:227] Handling call
0925 21:59:55.512336 (+1500768us) inbound_call.cc:173] Queueing success response
Metrics: {}
W20260925 21:59:55.513236  2482 connection.cc:441] server connection from unix:<unnamed> torn down before Call kudu.rpc.GenericCalculatorService.Sleep from unix:<unnamed> (request call id 13) could send its response
[       OK ] Parameters/TestRpc.TestCancellation/SSL_UnixSocket (3197 ms)
[ RUN      ] Parameters/TestRpc.TestCancellationMultiThreads/SSL_UnixSocket
I20260925 21:59:55.546893  2511 acceptor_pool.cc:254] collecting diagnostics on the listening RPC socket unix:/tmp/dist-test-task9ozB9D/test-tmp/rpc-test-f837cc8e60b94e349815f2cdf135eaf5.sock every 8 connection(s)
I20260925 21:59:55.547763  2512 acceptor_pool.cc:254] collecting diagnostics on the listening RPC socket unix:/tmp/dist-test-task9ozB9D/test-tmp/rpc-test-f837cc8e60b94e349815f2cdf135eaf5.sock every 8 connection(s)
I20260925 21:59:55.551014  2061 rpc-test.cc:1808] Connecting to unix:/tmp/dist-test-task9ozB9D/test-tmp/rpc-test-f837cc8e60b94e349815f2cdf135eaf5.sock
I20260925 21:59:55.690366  2525 test_util.cc:268] Using random seed: -701516525
I20260925 21:59:55.691511  2526 test_util.cc:268] Using random seed: -701515296
I20260925 21:59:55.693521  2527 test_util.cc:268] Using random seed: -701513408
I20260925 21:59:55.694789  2528 test_util.cc:268] Using random seed: -701512041
I20260925 21:59:55.696650  2529 test_util.cc:268] Using random seed: -701510304
I20260925 21:59:55.698253  2530 test_util.cc:268] Using random seed: -701508726
I20260925 21:59:55.700208  2531 test_util.cc:268] Using random seed: -701506720
I20260925 21:59:55.702195  2532 test_util.cc:268] Using random seed: -701504736
I20260925 21:59:55.704131  2533 test_util.cc:268] Using random seed: -701502806
I20260925 21:59:55.705674  2534 test_util.cc:268] Using random seed: -701501264
I20260925 21:59:55.707592  2535 test_util.cc:268] Using random seed: -701499427
I20260925 21:59:55.709528  2536 test_util.cc:268] Using random seed: -701497421
I20260925 21:59:55.711299  2537 test_util.cc:268] Using random seed: -701495651
I20260925 21:59:55.713256  2538 test_util.cc:268] Using random seed: -701493661
I20260925 21:59:55.715111  2539 test_util.cc:268] Using random seed: -701491853
I20260925 21:59:55.717200  2540 test_util.cc:268] Using random seed: -701489768
I20260925 21:59:55.719187  2541 test_util.cc:268] Using random seed: -701487804
I20260925 21:59:55.721313  2542 test_util.cc:268] Using random seed: -701485636
I20260925 21:59:55.723225  2543 test_util.cc:268] Using random seed: -701483749
I20260925 21:59:55.725236  2544 test_util.cc:268] Using random seed: -701482171
I20260925 21:59:55.727542  2545 test_util.cc:268] Using random seed: -701479858
I20260925 21:59:55.729504  2546 test_util.cc:268] Using random seed: -701477488
I20260925 21:59:55.731599  2547 test_util.cc:268] Using random seed: -701475294
I20260925 21:59:55.733575  2548 test_util.cc:268] Using random seed: -701473394
I20260925 21:59:55.735467  2549 test_util.cc:268] Using random seed: -701471474
I20260925 21:59:55.737404  2550 test_util.cc:268] Using random seed: -701469525
I20260925 21:59:55.739514  2551 test_util.cc:268] Using random seed: -701467893
I20260925 21:59:55.740821  2552 test_util.cc:268] Using random seed: -701466084
I20260925 21:59:55.742595  2553 test_util.cc:268] Using random seed: -701464366
I20260925 21:59:55.744371  2554 test_util.cc:268] Using random seed: -701462559
W20260925 22:00:15.528115  2508 connection.cc:196] Error closing socket: Network error: TlsSocket::Close: Broken pipe
[       OK ] Parameters/TestRpc.TestCancellationMultiThreads/SSL_UnixSocket (20024 ms)
[ RUN      ] Parameters/TestRpc.TestCallId/SSL_UnixSocket
I20260925 22:00:15.581544  2568 acceptor_pool.cc:254] collecting diagnostics on the listening RPC socket unix:/tmp/dist-test-task9ozB9D/test-tmp/rpc-test-492ea306f6ba4a0f97323c5fe8502e93.sock every 8 connection(s)
I20260925 22:00:15.582423  2569 acceptor_pool.cc:254] collecting diagnostics on the listening RPC socket unix:/tmp/dist-test-task9ozB9D/test-tmp/rpc-test-492ea306f6ba4a0f97323c5fe8502e93.sock every 8 connection(s)
W20260925 22:00:15.640247  2565 connection.cc:196] Error closing socket: Network error: TlsSocket::Close: Broken pipe
[       OK ] Parameters/TestRpc.TestCallId/SSL_UnixSocket (101 ms)
[----------] 20 tests from Parameters/TestRpc (38542 ms total)

[----------] Global test environment tear-down
[==========] 21 tests from 2 test suites ran. (41795 ms total)
[  PASSED  ] 20 tests.
[  FAILED  ] 1 test, listed below:
[  FAILED  ] Parameters/TestRpc.TestCallWithChainCertAndRootCA/SSL_UnixSocket, where GetParam() = (true, true)

 1 FAILED TEST
I20260925 22:00:15.664474  2061 logging.cc:424] LogThrottler /data0/somelongdirectorytoavoidrpathissues/src/kudu/src/kudu/rpc/acceptor_pool.cc:285: suppressed but not reported on 3 messages since previous log ~34 seconds ago