Diagnosed failure

Parameters/TestRpc.TestCallWithChainCertAndChainCA/SSL_UnixSocket: /data0/somelongdirectorytoavoidrpathissues/src/kudu/src/kudu/rpc/rpc-test.cc:270: Failure
Failed
Bad status: Runtime error: could not verify certificate chain (error with cert: subject=CN = localhost, ST = sadfjas, C = AS, emailAddress = sdflkdsajf, O = lskdfjlsad, OU = sldfkja, issuer=C = AS, ST = ASDfkjdhf, L = lskdjf, O = saldfja, OU = skdjf, CN = localhost, emailAddress = sadjflkadsj): : certificate has expired
Google Test trace:
/data0/somelongdirectorytoavoidrpathissues/src/kudu/src/kudu/rpc/rpc-test.cc:267: Connecting to unix:/tmp/dist-test-taskgZ3H31/test-tmp/rpc-test-9b5872368cfc44e78f04656bdec93d6c.sock
I20260924 21:10:52.233144  1924 test_util.cc:175] -----------------------------------------------
I20260924 21:10:52.233196  1924 test_util.cc:176] Had fatal failures, leaving test files at /tmp/dist-test-taskgZ3H31/test-tmp/rpc-test.6.Parameters_TestRpc.TestCallWithChainCertAndChainCA_SSL_UnixSocket.1790284252122607-1924-0

Full log

Note: This is test shard 7 of 8.
[==========] Running 21 tests from 2 test suites.
[----------] Global test environment set-up.
[----------] 20 tests from Parameters/TestRpc
[ RUN      ] Parameters/TestRpc.TestMessengerCreateDestroy/SSL_UnixSocket
WARNING: Logging before InitGoogleLogging() is written to STDERR
I20260924 21:10:52.135434  1924 rpc-test.cc:169] started messenger TestCreateDestroy
[       OK ] Parameters/TestRpc.TestMessengerCreateDestroy/SSL_UnixSocket (11 ms)
[ RUN      ] Parameters/TestRpc.TestNegotiationDeadlock/SSL_UnixSocket
I20260924 21:10:52.164844  1944 acceptor_pool.cc:254] collecting diagnostics on the listening RPC socket unix:/tmp/dist-test-taskgZ3H31/test-tmp/rpc-test-4486620ab86147d0a532d6df4aa71420.sock every 8 connection(s)
I20260924 21:10:52.164877  1945 acceptor_pool.cc:254] collecting diagnostics on the listening RPC socket unix:/tmp/dist-test-taskgZ3H31/test-tmp/rpc-test-4486620ab86147d0a532d6df4aa71420.sock every 8 connection(s)
[       OK ] Parameters/TestRpc.TestNegotiationDeadlock/SSL_UnixSocket (35 ms)
[ RUN      ] Parameters/TestRpc.TestCallWithChainCertAndChainCA/SSL_UnixSocket
I20260924 21:10:52.229175  1960 acceptor_pool.cc:254] collecting diagnostics on the listening RPC socket unix:/tmp/dist-test-taskgZ3H31/test-tmp/rpc-test-9b5872368cfc44e78f04656bdec93d6c.sock every 8 connection(s)
I20260924 21:10:52.229197  1961 acceptor_pool.cc:254] collecting diagnostics on the listening RPC socket unix:/tmp/dist-test-taskgZ3H31/test-tmp/rpc-test-9b5872368cfc44e78f04656bdec93d6c.sock every 8 connection(s)
/data0/somelongdirectorytoavoidrpathissues/src/kudu/src/kudu/rpc/rpc-test.cc:270: Failure
Failed
Bad status: Runtime error: could not verify certificate chain (error with cert: subject=CN = localhost, ST = sadfjas, C = AS, emailAddress = sdflkdsajf, O = lskdfjlsad, OU = sldfkja, issuer=C = AS, ST = ASDfkjdhf, L = lskdjf, O = saldfja, OU = skdjf, CN = localhost, emailAddress = sadjflkadsj): : certificate has expired
Google Test trace:
/data0/somelongdirectorytoavoidrpathissues/src/kudu/src/kudu/rpc/rpc-test.cc:267: Connecting to unix:/tmp/dist-test-taskgZ3H31/test-tmp/rpc-test-9b5872368cfc44e78f04656bdec93d6c.sock
I20260924 21:10:52.233144  1924 test_util.cc:175] -----------------------------------------------
I20260924 21:10:52.233196  1924 test_util.cc:176] Had fatal failures, leaving test files at /tmp/dist-test-taskgZ3H31/test-tmp/rpc-test.6.Parameters_TestRpc.TestCallWithChainCertAndChainCA_SSL_UnixSocket.1790284252122607-1924-0
[  FAILED  ] Parameters/TestRpc.TestCallWithChainCertAndChainCA/SSL_UnixSocket, where GetParam() = (true, true) (61 ms)
[ RUN      ] Parameters/TestRpc.TestCallWithPasswordProtectedKey/SSL_UnixSocket
I20260924 21:10:52.275240  1986 acceptor_pool.cc:254] collecting diagnostics on the listening RPC socket unix:/tmp/dist-test-taskgZ3H31/test-tmp/rpc-test-4d3b01e8e31d4ebf9edfd3cd72c48ba6.sock every 8 connection(s)
I20260924 21:10:52.275239  1985 acceptor_pool.cc:254] collecting diagnostics on the listening RPC socket unix:/tmp/dist-test-taskgZ3H31/test-tmp/rpc-test-4d3b01e8e31d4ebf9edfd3cd72c48ba6.sock every 8 connection(s)
W20260924 21:10:52.287446  1982 connection.cc:196] Error closing socket: Network error: TlsSocket::Close: Broken pipe
[       OK ] Parameters/TestRpc.TestCallWithPasswordProtectedKey/SSL_UnixSocket (55 ms)
[ RUN      ] Parameters/TestRpc.TestCallToBadServer/SSL_UnixSocket
I20260924 21:10:52.293929  1924 rpc-test.cc:394] Status: Network error: Client connection negotiation failed: client connection to 0.0.0.0:0: connect: Connection refused (error 111)
I20260924 21:10:52.294236  1924 rpc-test.cc:394] Status: Network error: Client connection negotiation failed: client connection to 0.0.0.0:0: connect: Connection refused (error 111)
I20260924 21:10:52.294467  1924 rpc-test.cc:394] Status: Network error: Client connection negotiation failed: client connection to 0.0.0.0:0: connect: Connection refused (error 111)
I20260924 21:10:52.294667  1924 rpc-test.cc:394] Status: Network error: Client connection negotiation failed: client connection to 0.0.0.0:0: connect: Connection refused (error 111)
I20260924 21:10:52.294858  1924 rpc-test.cc:394] Status: Network error: Client connection negotiation failed: client connection to 0.0.0.0:0: connect: Connection refused (error 111)
[       OK ] Parameters/TestRpc.TestCallToBadServer/SSL_UnixSocket (6 ms)
[ RUN      ] Parameters/TestRpc.TestWrongService/SSL_UnixSocket
I20260924 21:10:52.303954  2020 acceptor_pool.cc:254] collecting diagnostics on the listening RPC socket unix:/tmp/dist-test-taskgZ3H31/test-tmp/rpc-test-b4b50890bffa42649265d67f657ebf87.sock every 8 connection(s)
I20260924 21:10:52.303994  2021 acceptor_pool.cc:254] collecting diagnostics on the listening RPC socket unix:/tmp/dist-test-taskgZ3H31/test-tmp/rpc-test-b4b50890bffa42649265d67f657ebf87.sock every 8 connection(s)
I20260924 21:10:52.323428  2017 messenger.cc:345] service WrongServiceName not registered on TestServer
[       OK ] Parameters/TestRpc.TestWrongService/SSL_UnixSocket (29 ms)
[ RUN      ] Parameters/TestRpc.TestConnectionKeepalive/SSL_UnixSocket
I20260924 21:10:52.335527  2043 acceptor_pool.cc:254] collecting diagnostics on the listening RPC socket unix:/tmp/dist-test-taskgZ3H31/test-tmp/rpc-test-8075f65f6e1a4fecafe976af0e6640e3.sock every 8 connection(s)
I20260924 21:10:52.335579  2044 acceptor_pool.cc:254] collecting diagnostics on the listening RPC socket unix:/tmp/dist-test-taskgZ3H31/test-tmp/rpc-test-8075f65f6e1a4fecafe976af0e6640e3.sock every 8 connection(s)
I20260924 21:10:52.335733  1924 rpc-test.cc:488] Connecting to unix:/tmp/dist-test-taskgZ3H31/test-tmp/rpc-test-8075f65f6e1a4fecafe976af0e6640e3.sock
W20260924 21:10:52.826534  2056 connection.cc:196] Error closing socket: Network error: TlsSocket::Close: Broken pipe
[       OK ] Parameters/TestRpc.TestConnectionKeepalive/SSL_UnixSocket (1030 ms)
[ RUN      ] Parameters/TestRpc.TestClientConnectionMetrics/SSL_UnixSocket
I20260924 21:10:53.365249  2068 acceptor_pool.cc:254] collecting diagnostics on the listening RPC socket unix:/tmp/dist-test-taskgZ3H31/test-tmp/rpc-test-3b08151396584b91a150a9ff697b691c.sock every 8 connection(s)
I20260924 21:10:53.365324  2069 acceptor_pool.cc:254] collecting diagnostics on the listening RPC socket unix:/tmp/dist-test-taskgZ3H31/test-tmp/rpc-test-3b08151396584b91a150a9ff697b691c.sock every 8 connection(s)
I20260924 21:10:53.365473  1924 rpc-test.cc:569] Connecting to unix:/tmp/dist-test-taskgZ3H31/test-tmp/rpc-test-3b08151396584b91a150a9ff697b691c.sock
W20260924 21:11:01.819696  2065 connection.cc:196] Error closing socket: Network error: TlsSocket::Close: Broken pipe
[       OK ] Parameters/TestRpc.TestClientConnectionMetrics/SSL_UnixSocket (8464 ms)
[ RUN      ] Parameters/TestRpc.TestCredentialsPolicy/SSL_UnixSocket
I20260924 21:11:01.830976  2091 acceptor_pool.cc:254] collecting diagnostics on the listening RPC socket unix:/tmp/dist-test-taskgZ3H31/test-tmp/rpc-test-b4ee0a30d8e8484aaeda789a809dfe2b.sock every 8 connection(s)
I20260924 21:11:01.831024  2092 acceptor_pool.cc:254] collecting diagnostics on the listening RPC socket unix:/tmp/dist-test-taskgZ3H31/test-tmp/rpc-test-b4ee0a30d8e8484aaeda789a809dfe2b.sock every 8 connection(s)
I20260924 21:11:01.831182  1924 rpc-test.cc:700] Connecting to unix:/tmp/dist-test-taskgZ3H31/test-tmp/rpc-test-b4ee0a30d8e8484aaeda789a809dfe2b.sock
W20260924 21:11:01.862149  2090 connection.cc:196] Error closing socket: Network error: TlsSocket::Close: Broken pipe
[       OK ] Parameters/TestRpc.TestCredentialsPolicy/SSL_UnixSocket (48 ms)
[ RUN      ] Parameters/TestRpc.TestCallLongerThanKeepalive/SSL_UnixSocket
I20260924 21:11:01.880276  2116 acceptor_pool.cc:254] collecting diagnostics on the listening RPC socket unix:/tmp/dist-test-taskgZ3H31/test-tmp/rpc-test-96fb60b827cb4f009b37bf19a78b0b7f.sock every 8 connection(s)
I20260924 21:11:01.880297  2117 acceptor_pool.cc:254] collecting diagnostics on the listening RPC socket unix:/tmp/dist-test-taskgZ3H31/test-tmp/rpc-test-96fb60b827cb4f009b37bf19a78b0b7f.sock every 8 connection(s)
I20260924 21:11:01.895668  2119 rpc-test-base.h:222] got call: sleep_micros: 3000000 deferred: true
I20260924 21:11:04.896378  2119 rpcz_store.cc:275] Call kudu.rpc.GenericCalculatorService.Sleep from unix:<unnamed> (request call id 0) took 3000 ms. Trace:
I20260924 21:11:04.896486  2119 rpcz_store.cc:276] 0924 21:11:01.895589 (+     0us) service_pool.cc:170] Inserting onto call queue
0924 21:11:01.895647 (+    58us) service_pool.cc:227] Handling call
0924 21:11:04.896361 (+3000714us) inbound_call.cc:173] Queueing success response
Metrics: {}
[       OK ] Parameters/TestRpc.TestCallLongerThanKeepalive/SSL_UnixSocket (3029 ms)
[ RUN      ] Parameters/TestRpc.TestRpcSidecar/SSL_UnixSocket
I20260924 21:11:04.911007  2141 acceptor_pool.cc:254] collecting diagnostics on the listening RPC socket unix:/tmp/dist-test-taskgZ3H31/test-tmp/rpc-test-568b2023144b43748be84c58c928f3c0.sock every 8 connection(s)
I20260924 21:11:04.911113  2142 acceptor_pool.cc:254] collecting diagnostics on the listening RPC socket unix:/tmp/dist-test-taskgZ3H31/test-tmp/rpc-test-568b2023144b43748be84c58c928f3c0.sock every 8 connection(s)
W20260924 21:11:04.950058  2138 connection.cc:196] Error closing socket: Network error: TlsSocket::Close: Broken pipe
[       OK ] Parameters/TestRpc.TestRpcSidecar/SSL_UnixSocket (52 ms)
[ RUN      ] Parameters/TestRpc.TestRpcSidecarLimits/SSL_UnixSocket
I20260924 21:11:06.650769  2166 acceptor_pool.cc:254] collecting diagnostics on the listening RPC socket unix:/tmp/dist-test-taskgZ3H31/test-tmp/rpc-test-6123ba306f1b4776bba6ce23f162a4db.sock every 8 connection(s)
I20260924 21:11:06.650830  2167 acceptor_pool.cc:254] collecting diagnostics on the listening RPC socket unix:/tmp/dist-test-taskgZ3H31/test-tmp/rpc-test-6123ba306f1b4776bba6ce23f162a4db.sock every 8 connection(s)
W20260924 21:11:06.665179  1924 serialization.cc:72] Serialized kudu.rpc_test.PushStringsRequestPB (2147483654 bytes) is larger than the maximum configured RPC message size (52428800 bytes). Sending anyway, but peer may reject the data.
W20260924 21:11:06.668063  2163 connection.cc:535] server connection from unix:<unnamed> recv error: Network error: RPC frame had a length of 2147483714, but we only support messages up to 52428800 bytes long.
W20260924 21:11:06.668116  2163 connection.cc:158] shutting down server connection from unix:<unnamed> with pending inbound data: 4/2147483714 bytes received; last active 0 ns ago: status Network error: RPC frame had a length of 2147483714, but we only support messages up to 52428800 bytes long.
W20260924 21:11:06.668231  2179 connection.cc:698] client connection to unix:/tmp/dist-test-taskgZ3H31/test-tmp/rpc-test-6123ba306f1b4776bba6ce23f162a4db.sock send error: Network error: failed to write to TLS socket: Broken pipe
W20260924 21:11:06.668375  2179 connection.cc:196] Error closing socket: Network error: TlsSocket::Close: Success
I20260924 21:11:06.683002  2192 acceptor_pool.cc:254] collecting diagnostics on the listening RPC socket unix:/tmp/dist-test-taskgZ3H31/test-tmp/rpc-test-6123ba306f1b4776bba6ce23f162a4db.sock every 8 connection(s)
I20260924 21:11:06.683148  2191 acceptor_pool.cc:254] collecting diagnostics on the listening RPC socket unix:/tmp/dist-test-taskgZ3H31/test-tmp/rpc-test-6123ba306f1b4776bba6ce23f162a4db.sock every 8 connection(s)
W20260924 21:11:11.073266  2188 connection.cc:577] server connection from unix:<unnamed>: received bad data: 'Corruption: Invalid packet: message had a length of 2147483710, but we only support messages up to 2147483647 bytes
'
W20260924 21:11:11.073659  2204 connection.cc:196] Error closing socket: Network error: TlsSocket::Close: Broken pipe
[       OK ] Parameters/TestRpc.TestRpcSidecarLimits/SSL_UnixSocket (6124 ms)
[ RUN      ] Parameters/TestRpc.TestCallTimeoutDoesntAffectNegotiation/SSL_UnixSocket
I20260924 21:11:11.099908  2216 acceptor_pool.cc:254] collecting diagnostics on the listening RPC socket unix:/tmp/dist-test-taskgZ3H31/test-tmp/rpc-test-2c589add3e1e431fbd2c47800e3c95f7.sock every 8 connection(s)
I20260924 21:11:11.099961  2217 acceptor_pool.cc:254] collecting diagnostics on the listening RPC socket unix:/tmp/dist-test-taskgZ3H31/test-tmp/rpc-test-2c589add3e1e431fbd2c47800e3c95f7.sock every 8 connection(s)
W20260924 21:11:11.131596  2212 negotiation.cc:266] Injecting 500ms delay in negotiation
I20260924 21:11:11.181795  1924 rpc-test-base.h:595] status: Timed out: connection negotiation to unix:/tmp/dist-test-taskgZ3H31/test-tmp/rpc-test-2c589add3e1e431fbd2c47800e3c95f7.sock for RPC Sleep timed out after 0.050s (ON_OUTBOUND_QUEUE), seconds elapsed: 0.0506463
[       OK ] Parameters/TestRpc.TestCallTimeoutDoesntAffectNegotiation/SSL_UnixSocket (560 ms)
[ RUN      ] Parameters/TestRpc.TestRpcHandlerLatencyMetric/SSL_UnixSocket
I20260924 21:11:11.645411  2241 acceptor_pool.cc:254] collecting diagnostics on the listening RPC socket unix:/tmp/dist-test-taskgZ3H31/test-tmp/rpc-test-845af397c82c49219b02111c3cfc2f24.sock every 8 connection(s)
I20260924 21:11:11.645588  2242 acceptor_pool.cc:254] collecting diagnostics on the listening RPC socket unix:/tmp/dist-test-taskgZ3H31/test-tmp/rpc-test-845af397c82c49219b02111c3cfc2f24.sock every 8 connection(s)
I20260924 21:11:11.696165  1924 rpc-test.cc:1236] Sleep() min lat: 20321
I20260924 21:11:11.696237  1924 rpc-test.cc:1237] Sleep() mean lat: 20321
I20260924 21:11:11.696264  1924 rpc-test.cc:1238] Sleep() max lat: 20321
I20260924 21:11:11.696278  1924 rpc-test.cc:1239] Sleep() #calls: 1
W20260924 21:11:11.696853  2238 connection.cc:196] Error closing socket: Network error: TlsSocket::Close: Broken pipe
[       OK ] Parameters/TestRpc.TestRpcHandlerLatencyMetric/SSL_UnixSocket (61 ms)
[ RUN      ] Parameters/TestRpc.TimedOutOnResponseMetricServiceQueue/SSL_UnixSocket
I20260924 21:11:11.710426  2267 acceptor_pool.cc:254] collecting diagnostics on the listening RPC socket unix:/tmp/dist-test-taskgZ3H31/test-tmp/rpc-test-ee9b8265dde34c3f8ea54bd8c4c7f926.sock every 8 connection(s)
I20260924 21:11:11.710459  2268 acceptor_pool.cc:254] collecting diagnostics on the listening RPC socket unix:/tmp/dist-test-taskgZ3H31/test-tmp/rpc-test-ee9b8265dde34c3f8ea54bd8c4c7f926.sock every 8 connection(s)
W20260924 21:11:11.770340  2269 rpcz_store.cc:267] Call kudu.rpc_test.CalculatorService.Sleep from unix:<unnamed> (request call id 2) took 20 ms (client timeout 20 ms). Trace:
W20260924 21:11:11.770484  2269 rpcz_store.cc:269] 0924 21:11:11.750036 (+     0us) service_pool.cc:170] Inserting onto call queue
0924 21:11:11.770312 (+ 20276us) service_pool.cc:214] Skipping call since client already timed out
0924 21:11:11.770324 (+    12us) inbound_call.cc:173] Queueing failure response
Metrics: {}
W20260924 21:11:11.771185  2264 connection.cc:196] Error closing socket: Network error: TlsSocket::Close: Broken pipe
[       OK ] Parameters/TestRpc.TimedOutOnResponseMetricServiceQueue/SSL_UnixSocket (74 ms)
[ RUN      ] Parameters/TestRpc.RpcPendingConnectionsMetric/SSL_UnixSocket
I20260924 21:11:11.774101  2290 acceptor_pool.cc:254] collecting diagnostics on the listening RPC socket 0.0.0.0:38891 every 8 connection(s)
I20260924 21:11:11.774202  2291 acceptor_pool.cc:254] collecting diagnostics on the listening RPC socket 0.0.0.0:38891 every 8 connection(s)
W20260924 21:11:11.774796  2286 negotiation.cc:337] Failed RPC negotiation. Trace:
0924 21:11:11.774631 (+     0us) reactor.cc:625] Submitting negotiation task for server connection from 127.0.0.1:34588 (local address 127.0.0.1:38891)
0924 21:11:11.774684 (+    53us) server_negotiation.cc:206] Beginning negotiation
0924 21:11:11.774686 (+     2us) server_negotiation.cc:399] Waiting for connection header
0924 21:11:11.774746 (+    60us) negotiation.cc:327] Negotiation complete: Network error: Server connection negotiation failed: server connection from 127.0.0.1:34588: BlockingRecv error: recv got EOF from 127.0.0.1:34588 (error 108)
Metrics: {"server-negotiator.queue_time_us":18}
[       OK ] Parameters/TestRpc.RpcPendingConnectionsMetric/SSL_UnixSocket (13 ms)
[ RUN      ] Parameters/TestRpc.TestRpcContextClientDeadline/SSL_UnixSocket
I20260924 21:11:11.796118  2306 acceptor_pool.cc:254] collecting diagnostics on the listening RPC socket unix:/tmp/dist-test-taskgZ3H31/test-tmp/rpc-test-9c50dbae617a469fac62ddafbde1caa6.sock every 8 connection(s)
I20260924 21:11:11.796159  2307 acceptor_pool.cc:254] collecting diagnostics on the listening RPC socket unix:/tmp/dist-test-taskgZ3H31/test-tmp/rpc-test-9c50dbae617a469fac62ddafbde1caa6.sock every 8 connection(s)
[       OK ] Parameters/TestRpc.TestRpcContextClientDeadline/SSL_UnixSocket (50 ms)
[ RUN      ] Parameters/TestRpc.TestApplicationFeatureFlagUnsupportedServer/SSL_UnixSocket
I20260924 21:11:11.858235  2331 acceptor_pool.cc:254] collecting diagnostics on the listening RPC socket unix:/tmp/dist-test-taskgZ3H31/test-tmp/rpc-test-4111aa343aa24e5d9ea96d33c0fa0bea.sock every 8 connection(s)
I20260924 21:11:11.858264  2332 acceptor_pool.cc:254] collecting diagnostics on the listening RPC socket unix:/tmp/dist-test-taskgZ3H31/test-tmp/rpc-test-4111aa343aa24e5d9ea96d33c0fa0bea.sock every 8 connection(s)
[       OK ] Parameters/TestRpc.TestApplicationFeatureFlagUnsupportedServer/SSL_UnixSocket (52 ms)
[ RUN      ] Parameters/TestRpc.TestCancellationAsync/SSL_UnixSocket
I20260924 21:11:11.908362  2356 acceptor_pool.cc:254] collecting diagnostics on the listening RPC socket unix:/tmp/dist-test-taskgZ3H31/test-tmp/rpc-test-0add29f4ba20406ca366bf8897ef1ca6.sock every 8 connection(s)
I20260924 21:11:11.908380  2357 acceptor_pool.cc:254] collecting diagnostics on the listening RPC socket unix:/tmp/dist-test-taskgZ3H31/test-tmp/rpc-test-0add29f4ba20406ca366bf8897ef1ca6.sock every 8 connection(s)
I20260924 21:11:11.908594  1924 rpc-test.cc:1716] Connecting to unix:/tmp/dist-test-taskgZ3H31/test-tmp/rpc-test-0add29f4ba20406ca366bf8897ef1ca6.sock
I20260924 21:11:11.926074  1924 test_util.cc:268] Using random seed: 169032504
I20260924 21:11:11.943727  2360 rpc-test-base.h:240] got call: sleep_micros: 500 pattern: 4294967295 num_repetitions: 2097152 sidecar_idx: 0
I20260924 21:11:11.957376  2360 rpc-test-base.h:240] got call: sleep_micros: 500 pattern: 4294967295 num_repetitions: 2097152 sidecar_idx: 0
I20260924 21:11:11.968709  2360 rpc-test-base.h:240] got call: sleep_micros: 500 pattern: 4294967295 num_repetitions: 2097152 sidecar_idx: 0
I20260924 21:11:11.979738  2360 rpc-test-base.h:240] got call: sleep_micros: 500 pattern: 4294967295 num_repetitions: 2097152 sidecar_idx: 0
I20260924 21:11:11.990319  2360 rpc-test-base.h:240] got call: sleep_micros: 500 pattern: 4294967295 num_repetitions: 2097152 sidecar_idx: 0
I20260924 21:11:12.000955  2360 rpc-test-base.h:240] got call: sleep_micros: 500 pattern: 4294967295 num_repetitions: 2097152 sidecar_idx: 0
I20260924 21:11:12.011384  2360 rpc-test-base.h:240] got call: sleep_micros: 500 pattern: 4294967295 num_repetitions: 2097152 sidecar_idx: 0
I20260924 21:11:12.021706  2360 rpc-test-base.h:240] got call: sleep_micros: 500 pattern: 4294967295 num_repetitions: 2097152 sidecar_idx: 0
W20260924 21:11:12.023780  2353 connection.cc:196] Error closing socket: Network error: TlsSocket::Close: Broken pipe
W20260924 21:11:12.024933  2353 connection.cc:441] server connection from unix:<unnamed> torn down before Call kudu.rpc.GenericCalculatorService.SleepWithSidecar from unix:<unnamed> (request call id 9) could send its response
[       OK ] Parameters/TestRpc.TestCancellationAsync/SSL_UnixSocket (136 ms)
[ RUN      ] Parameters/TestRpc.TestPerformanceBySocketType/SSL_UnixSocket
I20260924 21:11:12.041814  2381 acceptor_pool.cc:254] collecting diagnostics on the listening RPC socket unix:/tmp/dist-test-taskgZ3H31/test-tmp/rpc-test-3b1f989fed8a46e3924f152e481fd4db.sock every 8 connection(s)
I20260924 21:11:12.041851  2382 acceptor_pool.cc:254] collecting diagnostics on the listening RPC socket unix:/tmp/dist-test-taskgZ3H31/test-tmp/rpc-test-3b1f989fed8a46e3924f152e481fd4db.sock every 8 connection(s)
I20260924 21:11:12.042012  1924 rpc-test.cc:1846] Connecting to unix:/tmp/dist-test-taskgZ3H31/test-tmp/rpc-test-3b1f989fed8a46e3924f152e481fd4db.sock
I20260924 21:11:13.306413  1924 rpc-test.cc:1859] Sending 1024MB via ssl-enabled unix socket: real 1.249s	user 1.410s	sys 0.820s
I20260924 21:11:14.558950  1924 rpc-test.cc:1859] Sending 1024MB via ssl-enabled unix socket: real 1.252s	user 1.439s	sys 0.810s
I20260924 21:11:15.789817  1924 rpc-test.cc:1859] Sending 1024MB via ssl-enabled unix socket: real 1.231s	user 1.348s	sys 0.858s
I20260924 21:11:17.107002  1924 rpc-test.cc:1859] Sending 1024MB via ssl-enabled unix socket: real 1.317s	user 1.358s	sys 1.007s
I20260924 21:11:18.426219  1924 rpc-test.cc:1859] Sending 1024MB via ssl-enabled unix socket: real 1.319s	user 1.568s	sys 0.801s
W20260924 21:11:18.426982  2378 connection.cc:196] Error closing socket: Network error: TlsSocket::Close: Broken pipe
[       OK ] Parameters/TestRpc.TestPerformanceBySocketType/SSL_UnixSocket (6401 ms)
[----------] 20 tests from Parameters/TestRpc (26303 ms total)

[----------] 1 test from Parameters/TestRpcSocketTxRxQueue
[ RUN      ] Parameters/TestRpcSocketTxRxQueue.AcceptorRxQueueSizeMetric/0
I20260924 21:11:18.434185  2406 acceptor_pool.cc:254] collecting diagnostics on the listening RPC socket 0.0.0.0:37761 every 1 connection(s)
I20260924 21:11:18.434288  2407 acceptor_pool.cc:254] collecting diagnostics on the listening RPC socket 0.0.0.0:37761 every 1 connection(s)
W20260924 21:11:18.434759  2402 negotiation.cc:337] Failed RPC negotiation. Trace:
0924 21:11:18.434629 (+     0us) reactor.cc:625] Submitting negotiation task for server connection from 127.0.0.1:45224 (local address 127.0.0.1:37761)
0924 21:11:18.434677 (+    48us) server_negotiation.cc:206] Beginning negotiation
0924 21:11:18.434679 (+     2us) server_negotiation.cc:399] Waiting for connection header
0924 21:11:18.434732 (+    53us) negotiation.cc:327] Negotiation complete: Network error: Server connection negotiation failed: server connection from 127.0.0.1:45224: BlockingRecv error: recv got EOF from 127.0.0.1:45224 (error 108)
Metrics: {"server-negotiator.queue_time_us":23}
[       OK ] Parameters/TestRpcSocketTxRxQueue.AcceptorRxQueueSizeMetric/0 (8 ms)
[----------] 1 test from Parameters/TestRpcSocketTxRxQueue (8 ms total)

[----------] Global test environment tear-down
[==========] 21 tests from 2 test suites ran. (26312 ms total)
[  PASSED  ] 20 tests.
[  FAILED  ] 1 test, listed below:
[  FAILED  ] Parameters/TestRpc.TestCallWithChainCertAndChainCA/SSL_UnixSocket, where GetParam() = (true, true)

 1 FAILED TEST