Diagnosed failure
Parameters/TestRpc.TestCallWithChainCertAndChainCA/SSL_TCP: /data0/somelongdirectorytoavoidrpathissues/src/kudu/src/kudu/rpc/rpc-test.cc:270: Failure
Failed
Bad status: Runtime error: could not verify certificate chain (error with cert: subject=CN = localhost, ST = sadfjas, C = AS, emailAddress = sdflkdsajf, O = lskdfjlsad, OU = sldfkja, issuer=C = AS, ST = ASDfkjdhf, L = lskdjf, O = saldfja, OU = skdjf, CN = localhost, emailAddress = sadjflkadsj): : certificate has expired
Google Test trace:
/data0/somelongdirectorytoavoidrpathissues/src/kudu/src/kudu/rpc/rpc-test.cc:267: Connecting to 0.0.0.0:37409
I20260927 19:45:10.021613 3034 test_util.cc:175] -----------------------------------------------
I20260927 19:45:10.021800 3034 test_util.cc:176] Had fatal failures, leaving test files at /tmp/dist-test-taskCj8vAb/test-tmp/rpc-test.5.Parameters_TestRpc.TestCallWithChainCertAndChainCA_SSL_TCP.1790538308697102-3034-0
Full log
Note: This is test shard 6 of 8.
[==========] Running 21 tests from 2 test suites.
[----------] Global test environment set-up.
[----------] 20 tests from Parameters/TestRpc
[ RUN ] Parameters/TestRpc.TestMessengerCreateDestroy/SSL_TCP
WARNING: Logging before InitGoogleLogging() is written to STDERR
I20260927 19:45:08.782918 3034 rpc-test.cc:169] started messenger TestCreateDestroy
[ OK ] Parameters/TestRpc.TestMessengerCreateDestroy/SSL_TCP (1118 ms)
[ RUN ] Parameters/TestRpc.TestNegotiationDeadlock/SSL_TCP
I20260927 19:45:09.894603 3056 acceptor_pool.cc:254] collecting diagnostics on the listening RPC socket 0.0.0.0:44089 every 8 connection(s)
I20260927 19:45:09.896130 3057 acceptor_pool.cc:254] collecting diagnostics on the listening RPC socket 0.0.0.0:44089 every 8 connection(s)
[ OK ] Parameters/TestRpc.TestNegotiationDeadlock/SSL_TCP (81 ms)
[ RUN ] Parameters/TestRpc.TestCallWithChainCertAndChainCA/SSL_TCP
I20260927 19:45:09.993845 3072 acceptor_pool.cc:254] collecting diagnostics on the listening RPC socket 0.0.0.0:37409 every 8 connection(s)
I20260927 19:45:09.996052 3073 acceptor_pool.cc:254] collecting diagnostics on the listening RPC socket 0.0.0.0:37409 every 8 connection(s)
/data0/somelongdirectorytoavoidrpathissues/src/kudu/src/kudu/rpc/rpc-test.cc:270: Failure
Failed
Bad status: Runtime error: could not verify certificate chain (error with cert: subject=CN = localhost, ST = sadfjas, C = AS, emailAddress = sdflkdsajf, O = lskdfjlsad, OU = sldfkja, issuer=C = AS, ST = ASDfkjdhf, L = lskdjf, O = saldfja, OU = skdjf, CN = localhost, emailAddress = sadjflkadsj): : certificate has expired
Google Test trace:
/data0/somelongdirectorytoavoidrpathissues/src/kudu/src/kudu/rpc/rpc-test.cc:267: Connecting to 0.0.0.0:37409
I20260927 19:45:10.021613 3034 test_util.cc:175] -----------------------------------------------
I20260927 19:45:10.021800 3034 test_util.cc:176] Had fatal failures, leaving test files at /tmp/dist-test-taskCj8vAb/test-tmp/rpc-test.5.Parameters_TestRpc.TestCallWithChainCertAndChainCA_SSL_TCP.1790538308697102-3034-0
[ FAILED ] Parameters/TestRpc.TestCallWithChainCertAndChainCA/SSL_TCP, where GetParam() = (true, false) (76 ms)
[ RUN ] Parameters/TestRpc.TestCallWithPasswordProtectedKey/SSL_TCP
I20260927 19:45:10.048491 3097 acceptor_pool.cc:254] collecting diagnostics on the listening RPC socket 0.0.0.0:36189 every 8 connection(s)
I20260927 19:45:10.049268 3098 acceptor_pool.cc:254] collecting diagnostics on the listening RPC socket 0.0.0.0:36189 every 8 connection(s)
[ OK ] Parameters/TestRpc.TestCallWithPasswordProtectedKey/SSL_TCP (72 ms)
[ RUN ] Parameters/TestRpc.TestCallToBadServer/SSL_TCP
I20260927 19:45:10.115337 3034 rpc-test.cc:394] Status: Network error: Client connection negotiation failed: client connection to 0.0.0.0:0: connect: Connection refused (error 111)
I20260927 19:45:10.116535 3034 rpc-test.cc:394] Status: Network error: Client connection negotiation failed: client connection to 0.0.0.0:0: connect: Connection refused (error 111)
I20260927 19:45:10.117679 3034 rpc-test.cc:394] Status: Network error: Client connection negotiation failed: client connection to 0.0.0.0:0: connect: Connection refused (error 111)
I20260927 19:45:10.118866 3034 rpc-test.cc:394] Status: Network error: Client connection negotiation failed: client connection to 0.0.0.0:0: connect: Connection refused (error 111)
I20260927 19:45:10.119997 3034 rpc-test.cc:394] Status: Network error: Client connection negotiation failed: client connection to 0.0.0.0:0: connect: Connection refused (error 111)
[ OK ] Parameters/TestRpc.TestCallToBadServer/SSL_TCP (27 ms)
[ RUN ] Parameters/TestRpc.TestWrongService/SSL_TCP
I20260927 19:45:10.139554 3132 acceptor_pool.cc:254] collecting diagnostics on the listening RPC socket 0.0.0.0:41563 every 8 connection(s)
I20260927 19:45:10.140352 3133 acceptor_pool.cc:254] collecting diagnostics on the listening RPC socket 0.0.0.0:41563 every 8 connection(s)
I20260927 19:45:10.173497 3131 messenger.cc:345] service WrongServiceName not registered on TestServer
[ OK ] Parameters/TestRpc.TestWrongService/SSL_TCP (58 ms)
[ RUN ] Parameters/TestRpc.TestConnectionKeepalive/SSL_TCP
I20260927 19:45:10.200107 3155 acceptor_pool.cc:254] collecting diagnostics on the listening RPC socket 0.0.0.0:46787 every 8 connection(s)
I20260927 19:45:10.200783 3156 acceptor_pool.cc:254] collecting diagnostics on the listening RPC socket 0.0.0.0:46787 every 8 connection(s)
I20260927 19:45:10.203740 3034 rpc-test.cc:488] Connecting to 0.0.0.0:46787
[ OK ] Parameters/TestRpc.TestConnectionKeepalive/SSL_TCP (1087 ms)
[ RUN ] Parameters/TestRpc.TestClientConnectionMetrics/SSL_TCP
I20260927 19:45:11.286943 3180 acceptor_pool.cc:254] collecting diagnostics on the listening RPC socket 0.0.0.0:37849 every 8 connection(s)
I20260927 19:45:11.287700 3181 acceptor_pool.cc:254] collecting diagnostics on the listening RPC socket 0.0.0.0:37849 every 8 connection(s)
I20260927 19:45:11.290869 3034 rpc-test.cc:569] Connecting to 0.0.0.0:37849
[ OK ] Parameters/TestRpc.TestClientConnectionMetrics/SSL_TCP (112625 ms)
[ RUN ] Parameters/TestRpc.TestCredentialsPolicy/SSL_TCP
I20260927 19:47:03.912602 3214 acceptor_pool.cc:254] collecting diagnostics on the listening RPC socket 0.0.0.0:36399 every 8 connection(s)
I20260927 19:47:03.913379 3215 acceptor_pool.cc:254] collecting diagnostics on the listening RPC socket 0.0.0.0:36399 every 8 connection(s)
I20260927 19:47:03.916329 3034 rpc-test.cc:700] Connecting to 0.0.0.0:36399
[ OK ] Parameters/TestRpc.TestCredentialsPolicy/SSL_TCP (111 ms)
[ RUN ] Parameters/TestRpc.TestCallLongerThanKeepalive/SSL_TCP
I20260927 19:47:04.027565 3239 acceptor_pool.cc:254] collecting diagnostics on the listening RPC socket 0.0.0.0:45007 every 8 connection(s)
I20260927 19:47:04.028267 3240 acceptor_pool.cc:254] collecting diagnostics on the listening RPC socket 0.0.0.0:45007 every 8 connection(s)
I20260927 19:47:04.056039 3243 rpc-test-base.h:222] got call: sleep_micros: 3000000 deferred: true
I20260927 19:47:07.060113 3243 rpcz_store.cc:275] Call kudu.rpc.GenericCalculatorService.Sleep from 127.0.0.1:36644 (request call id 0) took 3004 ms. Trace:
I20260927 19:47:07.060432 3243 rpcz_store.cc:276] 0927 19:47:04.055815 (+ 0us) service_pool.cc:170] Inserting onto call queue
0927 19:47:04.055905 (+ 90us) service_pool.cc:227] Handling call
0927 19:47:07.060060 (+3004155us) inbound_call.cc:173] Queueing success response
Metrics: {}
[ OK ] Parameters/TestRpc.TestCallLongerThanKeepalive/SSL_TCP (3062 ms)
[ RUN ] Parameters/TestRpc.TestRpcSidecar/SSL_TCP
I20260927 19:47:07.096392 3264 acceptor_pool.cc:254] collecting diagnostics on the listening RPC socket 0.0.0.0:42891 every 8 connection(s)
I20260927 19:47:07.097123 3265 acceptor_pool.cc:254] collecting diagnostics on the listening RPC socket 0.0.0.0:42891 every 8 connection(s)
[ OK ] Parameters/TestRpc.TestRpcSidecar/SSL_TCP (503 ms)
[ RUN ] Parameters/TestRpc.TestRpcSidecarLimits/SSL_TCP
I20260927 19:47:23.889848 3291 acceptor_pool.cc:254] collecting diagnostics on the listening RPC socket 0.0.0.0:34523 every 8 connection(s)
I20260927 19:47:23.890658 3292 acceptor_pool.cc:254] collecting diagnostics on the listening RPC socket 0.0.0.0:34523 every 8 connection(s)
W20260927 19:47:23.909396 3034 serialization.cc:72] Serialized kudu.rpc_test.PushStringsRequestPB (2147483654 bytes) is larger than the maximum configured RPC message size (52428800 bytes). Sending anyway, but peer may reject the data.
W20260927 19:47:23.919883 3290 connection.cc:535] server connection from 127.0.0.1:49134 recv error: Network error: RPC frame had a length of 2147483714, but we only support messages up to 52428800 bytes long.
W20260927 19:47:23.920281 3290 connection.cc:158] shutting down server connection from 127.0.0.1:49134 with pending inbound data: 4/2147483714 bytes received; last active 0 ns ago: status Network error: RPC frame had a length of 2147483714, but we only support messages up to 52428800 bytes long.
W20260927 19:47:23.921211 3304 connection.cc:698] client connection to 0.0.0.0:34523 send error: Network error: failed to write to TLS socket: Connection reset by peer
W20260927 19:47:23.921708 3304 connection.cc:196] Error closing socket: Network error: TlsSocket::Close: Success
[ OK ] Parameters/TestRpc.TestRpcSidecarLimits/SSL_TCP (17027 ms)
[ RUN ] Parameters/TestRpc.TestCallTimeoutDoesntAffectNegotiation/SSL_TCP
I20260927 19:47:24.615867 3316 acceptor_pool.cc:254] collecting diagnostics on the listening RPC socket 0.0.0.0:41783 every 8 connection(s)
I20260927 19:47:24.616549 3317 acceptor_pool.cc:254] collecting diagnostics on the listening RPC socket 0.0.0.0:41783 every 8 connection(s)
W20260927 19:47:24.651793 3312 negotiation.cc:266] Injecting 500ms delay in negotiation
I20260927 19:47:24.702188 3034 rpc-test-base.h:595] status: Timed out: connection negotiation to 0.0.0.0:41783 for RPC Sleep timed out after 0.050s (ON_OUTBOUND_QUEUE), seconds elapsed: 0.0513635
[ OK ] Parameters/TestRpc.TestCallTimeoutDoesntAffectNegotiation/SSL_TCP (568 ms)
[ RUN ] Parameters/TestRpc.TestRpcHandlerLatencyMetric/SSL_TCP
I20260927 19:47:25.194547 3341 acceptor_pool.cc:254] collecting diagnostics on the listening RPC socket 0.0.0.0:42277 every 8 connection(s)
I20260927 19:47:25.195281 3342 acceptor_pool.cc:254] collecting diagnostics on the listening RPC socket 0.0.0.0:42277 every 8 connection(s)
I20260927 19:47:25.241477 3034 rpc-test.cc:1236] Sleep() min lat: 21451
I20260927 19:47:25.241665 3034 rpc-test.cc:1237] Sleep() mean lat: 21451
I20260927 19:47:25.241796 3034 rpc-test.cc:1238] Sleep() max lat: 21451
I20260927 19:47:25.241904 3034 rpc-test.cc:1239] Sleep() #calls: 1
[ OK ] Parameters/TestRpc.TestRpcHandlerLatencyMetric/SSL_TCP (81 ms)
[ RUN ] Parameters/TestRpc.TimedOutOnResponseMetricServiceQueue/SSL_TCP
I20260927 19:47:25.279165 3367 acceptor_pool.cc:254] collecting diagnostics on the listening RPC socket 0.0.0.0:40905 every 8 connection(s)
I20260927 19:47:25.279917 3368 acceptor_pool.cc:254] collecting diagnostics on the listening RPC socket 0.0.0.0:40905 every 8 connection(s)
W20260927 19:47:25.352941 3369 rpcz_store.cc:267] Call kudu.rpc_test.CalculatorService.Sleep from 127.0.0.1:39464 (request call id 2) took 20 ms (client timeout 20 ms). Trace:
W20260927 19:47:25.353271 3369 rpcz_store.cc:269] 0927 19:47:25.332546 (+ 0us) service_pool.cc:170] Inserting onto call queue
0927 19:47:25.352792 (+ 20246us) service_pool.cc:214] Skipping call since client already timed out
0927 19:47:25.352863 (+ 71us) inbound_call.cc:173] Queueing failure response
Metrics: {}
[ OK ] Parameters/TestRpc.TimedOutOnResponseMetricServiceQueue/SSL_TCP (110 ms)
[ RUN ] Parameters/TestRpc.RpcPendingConnectionsMetric/SSL_TCP
I20260927 19:47:25.369094 3390 acceptor_pool.cc:254] collecting diagnostics on the listening RPC socket 0.0.0.0:45493 every 8 connection(s)
I20260927 19:47:25.369830 3391 acceptor_pool.cc:254] collecting diagnostics on the listening RPC socket 0.0.0.0:45493 every 8 connection(s)
W20260927 19:47:25.374646 3386 negotiation.cc:337] Failed RPC negotiation. Trace:
0927 19:47:25.373495 (+ 0us) reactor.cc:625] Submitting negotiation task for server connection from 127.0.0.1:50960 (local address 127.0.0.1:45493)
0927 19:47:25.373835 (+ 340us) server_negotiation.cc:206] Beginning negotiation
0927 19:47:25.373851 (+ 16us) server_negotiation.cc:399] Waiting for connection header
0927 19:47:25.374051 (+ 200us) negotiation.cc:327] Negotiation complete: Network error: Server connection negotiation failed: server connection from 127.0.0.1:50960: BlockingRecv error: recv got EOF from 127.0.0.1:50960 (error 108)
Metrics: {"server-negotiator.queue_time_us":78}
[ OK ] Parameters/TestRpc.RpcPendingConnectionsMetric/SSL_TCP (27 ms)
[ RUN ] Parameters/TestRpc.TestRpcContextClientDeadline/SSL_TCP
I20260927 19:47:25.401628 3406 acceptor_pool.cc:254] collecting diagnostics on the listening RPC socket 0.0.0.0:40659 every 8 connection(s)
I20260927 19:47:25.402348 3407 acceptor_pool.cc:254] collecting diagnostics on the listening RPC socket 0.0.0.0:40659 every 8 connection(s)
[ OK ] Parameters/TestRpc.TestRpcContextClientDeadline/SSL_TCP (71 ms)
[ RUN ] Parameters/TestRpc.TestApplicationFeatureFlagUnsupportedServer/SSL_TCP
I20260927 19:47:25.474434 3431 acceptor_pool.cc:254] collecting diagnostics on the listening RPC socket 0.0.0.0:46135 every 8 connection(s)
I20260927 19:47:25.475131 3432 acceptor_pool.cc:254] collecting diagnostics on the listening RPC socket 0.0.0.0:46135 every 8 connection(s)
[ OK ] Parameters/TestRpc.TestApplicationFeatureFlagUnsupportedServer/SSL_TCP (62 ms)
[ RUN ] Parameters/TestRpc.TestCancellationAsync/SSL_TCP
I20260927 19:47:25.550100 3456 acceptor_pool.cc:254] collecting diagnostics on the listening RPC socket 0.0.0.0:44713 every 8 connection(s)
I20260927 19:47:25.550800 3457 acceptor_pool.cc:254] collecting diagnostics on the listening RPC socket 0.0.0.0:44713 every 8 connection(s)
I20260927 19:47:25.553639 3034 rpc-test.cc:1716] Connecting to 0.0.0.0:44713
I20260927 19:47:25.582976 3034 test_util.cc:268] Using random seed: 939618925
I20260927 19:47:25.808561 3460 rpc-test-base.h:240] got call: sleep_micros: 500 pattern: 4294967295 num_repetitions: 2097152 sidecar_idx: 0
I20260927 19:47:25.967391 3459 rpc-test-base.h:240] got call: sleep_micros: 500 pattern: 4294967295 num_repetitions: 2097152 sidecar_idx: 0
I20260927 19:47:26.154618 3460 rpc-test-base.h:240] got call: sleep_micros: 500 pattern: 4294967295 num_repetitions: 2097152 sidecar_idx: 0
I20260927 19:47:26.336256 3459 rpc-test-base.h:240] got call: sleep_micros: 500 pattern: 4294967295 num_repetitions: 2097152 sidecar_idx: 0
I20260927 19:47:26.510251 3460 rpc-test-base.h:240] got call: sleep_micros: 500 pattern: 4294967295 num_repetitions: 2097152 sidecar_idx: 0
W20260927 19:47:26.606518 3469 outbound_call.cc:322] RPC callback for RPC call kudu.rpc.GenericCalculatorService.SleepWithSidecar -> {remote=0.0.0.0:44713 (localhost), user_credentials={real_user=slave}} blocked reactor thread for 44179.4us
I20260927 19:47:26.692090 3459 rpc-test-base.h:240] got call: sleep_micros: 500 pattern: 4294967295 num_repetitions: 2097152 sidecar_idx: 0
I20260927 19:47:26.861639 3460 rpc-test-base.h:240] got call: sleep_micros: 500 pattern: 4294967295 num_repetitions: 2097152 sidecar_idx: 0
I20260927 19:47:27.048506 3459 rpc-test-base.h:240] got call: sleep_micros: 500 pattern: 4294967295 num_repetitions: 2097152 sidecar_idx: 0
W20260927 19:47:27.219676 3453 connection.cc:698] server connection from 127.0.0.1:58508 send error: Network error: failed to write to TLS socket: Broken pipe
W20260927 19:47:27.219907 3453 connection.cc:441] server connection from 127.0.0.1:58508 torn down before Call kudu.rpc.GenericCalculatorService.SleepWithSidecar from 127.0.0.1:58508 (request call id 9) could send its response
W20260927 19:47:27.224865 3453 connection.cc:196] Error closing socket: Network error: TlsSocket::Close: Success
W20260927 19:47:27.251984 3453 connection.cc:441] server connection from 127.0.0.1:58508 torn down before Call kudu.rpc.GenericCalculatorService.SleepWithSidecar from 127.0.0.1:58508 (request call id 8) could send its response
[ OK ] Parameters/TestRpc.TestCancellationAsync/SSL_TCP (1739 ms)
[ RUN ] Parameters/TestRpc.TestPerformanceBySocketType/SSL_TCP
I20260927 19:47:27.342199 3481 acceptor_pool.cc:254] collecting diagnostics on the listening RPC socket 0.0.0.0:35221 every 8 connection(s)
I20260927 19:47:27.342967 3482 acceptor_pool.cc:254] collecting diagnostics on the listening RPC socket 0.0.0.0:35221 every 8 connection(s)
I20260927 19:47:27.347383 3034 rpc-test.cc:1846] Connecting to 0.0.0.0:35221
I20260927 19:47:45.659444 3034 rpc-test.cc:1859] Sending 1024MB via ssl-enabled tcp socket: real 18.284s user 15.644s sys 10.337s
I20260927 19:48:03.923867 3034 rpc-test.cc:1859] Sending 1024MB via ssl-enabled tcp socket: real 18.264s user 15.635s sys 10.287s
I20260927 19:48:22.158479 3034 rpc-test.cc:1859] Sending 1024MB via ssl-enabled tcp socket: real 18.234s user 15.813s sys 10.094s
I20260927 19:48:40.266443 3034 rpc-test.cc:1859] Sending 1024MB via ssl-enabled tcp socket: real 18.108s user 15.680s sys 9.983s
I20260927 19:48:58.252044 3034 rpc-test.cc:1859] Sending 1024MB via ssl-enabled tcp socket: real 17.985s user 15.392s sys 10.057s
[ OK ] Parameters/TestRpc.TestPerformanceBySocketType/SSL_TCP (91007 ms)
[----------] 20 tests from Parameters/TestRpc (229523 ms total)
[----------] 1 test from Parameters/TestRpcSocketTxRxQueue
[ RUN ] Parameters/TestRpcSocketTxRxQueue.OverCapacity/0
W20260927 19:48:58.693549 3525 negotiation.cc:337] Failed RPC negotiation. Trace:
0927 19:48:58.290450 (+ 0us) reactor.cc:625] Submitting negotiation task for client connection to 0.0.0.0:41159 (local address 127.0.0.1:36410)
0927 19:48:58.290950 (+ 500us) negotiation.cc:107] Waiting for socket to connect
0927 19:48:58.290976 (+ 26us) client_negotiation.cc:174] Beginning negotiation
0927 19:48:58.291130 (+ 154us) client_negotiation.cc:252] Sending NEGOTIATE NegotiatePB request
0927 19:48:58.691475 (+400345us) negotiation.cc:327] Negotiation complete: Network error: Client connection negotiation failed: client connection to 0.0.0.0:41159: BlockingRecv error: recv error from unknown peer: Transport endpoint is not connected (error 107)
Metrics: {"client-negotiator.queue_time_us":134}
W20260927 19:48:58.694590 3516 negotiation.cc:337] Failed RPC negotiation. Trace:
0927 19:48:58.283659 (+ 0us) reactor.cc:625] Submitting negotiation task for client connection to 0.0.0.0:41159 (local address 127.0.0.1:36402)
0927 19:48:58.284200 (+ 541us) negotiation.cc:107] Waiting for socket to connect
0927 19:48:58.284227 (+ 27us) client_negotiation.cc:174] Beginning negotiation
0927 19:48:58.284394 (+ 167us) client_negotiation.cc:252] Sending NEGOTIATE NegotiatePB request
0927 19:48:58.691634 (+407240us) negotiation.cc:327] Negotiation complete: Network error: Client connection negotiation failed: client connection to 0.0.0.0:41159: BlockingRecv error: recv error from unknown peer: Transport endpoint is not connected (error 107)
Metrics: {"client-negotiator.queue_time_us":145}
W20260927 19:48:58.694725 3534 negotiation.cc:337] Failed RPC negotiation. Trace:
0927 19:48:58.301850 (+ 0us) reactor.cc:625] Submitting negotiation task for client connection to 0.0.0.0:41159 (local address 127.0.0.1:36414)
0927 19:48:58.302410 (+ 560us) negotiation.cc:107] Waiting for socket to connect
0927 19:48:58.302438 (+ 28us) client_negotiation.cc:174] Beginning negotiation
0927 19:48:58.302603 (+ 165us) client_negotiation.cc:252] Sending NEGOTIATE NegotiatePB request
0927 19:48:58.691684 (+389081us) negotiation.cc:327] Negotiation complete: Network error: Client connection negotiation failed: client connection to 0.0.0.0:41159: BlockingRecv error: recv error from unknown peer: Transport endpoint is not connected (error 107)
Metrics: {"client-negotiator.queue_time_us":127}
W20260927 19:48:58.695025 3552 negotiation.cc:337] Failed RPC negotiation. Trace:
0927 19:48:58.325505 (+ 0us) reactor.cc:625] Submitting negotiation task for client connection to 0.0.0.0:41159 (local address 127.0.0.1:36426)
0927 19:48:58.326030 (+ 525us) negotiation.cc:107] Waiting for socket to connect
0927 19:48:58.326068 (+ 38us) client_negotiation.cc:174] Beginning negotiation
0927 19:48:58.326354 (+ 286us) client_negotiation.cc:252] Sending NEGOTIATE NegotiatePB request
0927 19:48:58.692706 (+366352us) negotiation.cc:327] Negotiation complete: Network error: Client connection negotiation failed: client connection to 0.0.0.0:41159: BlockingRecv error: recv error from unknown peer: Transport endpoint is not connected (error 107)
Metrics: {"client-negotiator.queue_time_us":123}
W20260927 19:48:58.695122 3543 negotiation.cc:337] Failed RPC negotiation. Trace:
0927 19:48:58.313779 (+ 0us) reactor.cc:625] Submitting negotiation task for client connection to 0.0.0.0:41159 (local address 127.0.0.1:36418)
0927 19:48:58.314344 (+ 565us) negotiation.cc:107] Waiting for socket to connect
0927 19:48:58.314373 (+ 29us) client_negotiation.cc:174] Beginning negotiation
0927 19:48:58.314571 (+ 198us) client_negotiation.cc:252] Sending NEGOTIATE NegotiatePB request
0927 19:48:58.693054 (+378483us) negotiation.cc:327] Negotiation complete: Network error: Client connection negotiation failed: client connection to 0.0.0.0:41159: BlockingRecv error: recv error from unknown peer: Transport endpoint is not connected (error 107)
Metrics: {"client-negotiator.queue_time_us":118}
W20260927 19:48:58.695905 3507 negotiation.cc:337] Failed RPC negotiation. Trace:
0927 19:48:58.277336 (+ 0us) reactor.cc:625] Submitting negotiation task for client connection to 0.0.0.0:41159 (local address 127.0.0.1:36394)
0927 19:48:58.277850 (+ 514us) negotiation.cc:107] Waiting for socket to connect
0927 19:48:58.277877 (+ 27us) client_negotiation.cc:174] Beginning negotiation
0927 19:48:58.278172 (+ 295us) client_negotiation.cc:252] Sending NEGOTIATE NegotiatePB request
0927 19:48:58.691464 (+413292us) negotiation.cc:327] Negotiation complete: Network error: Client connection negotiation failed: client connection to 0.0.0.0:41159: BlockingRecv error: recv error from unknown peer: Transport endpoint is not connected (error 107)
Metrics: {"client-negotiator.queue_time_us":85}
[ OK ] Parameters/TestRpcSocketTxRxQueue.OverCapacity/0 (1222 ms)
[----------] 1 test from Parameters/TestRpcSocketTxRxQueue (1223 ms total)
[----------] Global test environment tear-down
[==========] 21 tests from 2 test suites ran. (230747 ms total)
[ PASSED ] 20 tests.
[ FAILED ] 1 test, listed below:
[ FAILED ] Parameters/TestRpc.TestCallWithChainCertAndChainCA/SSL_TCP, where GetParam() = (true, false)
1 FAILED TEST