Diagnosed failure

Parameters/TestRpc.TestCallWithChainCertAndRootCA/SSL_TCP: /data0/somelongdirectorytoavoidrpathissues/src/kudu/src/kudu/rpc/rpc-test.cc:303: Failure
Failed
Bad status: Runtime error: could not verify certificate chain (error with cert: subject=CN = localhost, ST = sadfjas, C = AS, emailAddress = sdflkdsajf, O = lskdfjlsad, OU = sldfkja, issuer=C = AS, ST = ASDfkjdhf, L = lskdjf, O = saldfja, OU = skdjf, CN = localhost, emailAddress = sadjflkadsj): : certificate has expired
Google Test trace:
/data0/somelongdirectorytoavoidrpathissues/src/kudu/src/kudu/rpc/rpc-test.cc:300: Connecting to 0.0.0.0:39015
I20260928 23:50:31.571684 21427 test_util.cc:175] -----------------------------------------------
I20260928 23:50:31.571856 21427 test_util.cc:176] Had fatal failures, leaving test files at /tmp/dist-test-taskJ_v4xr/test-tmp/rpc-test.1.Parameters_TestRpc.TestCallWithChainCertAndRootCA_SSL_TCP.1790639429933327-21427-0

Full log

Note: This is test shard 2 of 8.
[==========] Running 21 tests from 2 test suites.
[----------] Global test environment set-up.
[----------] 1 test from TestRpc
[ RUN      ] TestRpc.TestMethodsByName
[       OK ] TestRpc.TestMethodsByName (7 ms)
[----------] 1 test from TestRpc (7 ms total)

[----------] 20 tests from Parameters/TestRpc
[ RUN      ] Parameters/TestRpc.TestAcceptorPoolStartStop/SSL_TCP
WARNING: Logging before InitGoogleLogging() is written to STDERR
I20260928 23:50:30.050720 21442 acceptor_pool.cc:254] collecting diagnostics on the listening RPC socket 0.0.0.0:43593 every 8 connection(s)
I20260928 23:50:30.052579 21443 acceptor_pool.cc:254] collecting diagnostics on the listening RPC socket 0.0.0.0:43593 every 8 connection(s)
W20260928 23:50:31.053311 21427 thread.cc:536] Waited for 1000ms trying to join with acceptor (tid 21443)
I20260928 23:50:31.223091 21454 acceptor_pool.cc:254] collecting diagnostics on the listening RPC socket 0.0.0.0:44235 every 8 connection(s)
I20260928 23:50:31.224903 21455 acceptor_pool.cc:254] collecting diagnostics on the listening RPC socket 0.0.0.0:44235 every 8 connection(s)
I20260928 23:50:31.253063 21465 acceptor_pool.cc:254] collecting diagnostics on the listening RPC socket 0.0.0.0:40801 every 8 connection(s)
I20260928 23:50:31.254479 21466 acceptor_pool.cc:254] collecting diagnostics on the listening RPC socket 0.0.0.0:40801 every 8 connection(s)
I20260928 23:50:31.306785 21476 acceptor_pool.cc:254] collecting diagnostics on the listening RPC socket 0.0.0.0:34543 every 8 connection(s)
I20260928 23:50:31.307485 21477 acceptor_pool.cc:254] collecting diagnostics on the listening RPC socket 0.0.0.0:34543 every 8 connection(s)
I20260928 23:50:31.344115 21487 acceptor_pool.cc:254] collecting diagnostics on the listening RPC socket 0.0.0.0:37093 every 8 connection(s)
I20260928 23:50:31.344926 21488 acceptor_pool.cc:254] collecting diagnostics on the listening RPC socket 0.0.0.0:37093 every 8 connection(s)
[       OK ] Parameters/TestRpc.TestAcceptorPoolStartStop/SSL_TCP (1349 ms)
[ RUN      ] Parameters/TestRpc.TestCall/SSL_TCP
I20260928 23:50:31.388782 21500 acceptor_pool.cc:254] collecting diagnostics on the listening RPC socket 0.0.0.0:34231 every 8 connection(s)
I20260928 23:50:31.391324 21501 acceptor_pool.cc:254] collecting diagnostics on the listening RPC socket 0.0.0.0:34231 every 8 connection(s)
I20260928 23:50:31.398538 21427 rpc-test.cc:234] Connecting to 0.0.0.0:34231
[       OK ] Parameters/TestRpc.TestCall/SSL_TCP (174 ms)
[ RUN      ] Parameters/TestRpc.TestCallWithChainCertAndRootCA/SSL_TCP
I20260928 23:50:31.549084 21525 acceptor_pool.cc:254] collecting diagnostics on the listening RPC socket 0.0.0.0:39015 every 8 connection(s)
I20260928 23:50:31.549809 21526 acceptor_pool.cc:254] collecting diagnostics on the listening RPC socket 0.0.0.0:39015 every 8 connection(s)
/data0/somelongdirectorytoavoidrpathissues/src/kudu/src/kudu/rpc/rpc-test.cc:303: Failure
Failed
Bad status: Runtime error: could not verify certificate chain (error with cert: subject=CN = localhost, ST = sadfjas, C = AS, emailAddress = sdflkdsajf, O = lskdfjlsad, OU = sldfkja, issuer=C = AS, ST = ASDfkjdhf, L = lskdjf, O = saldfja, OU = skdjf, CN = localhost, emailAddress = sadjflkadsj): : certificate has expired
Google Test trace:
/data0/somelongdirectorytoavoidrpathissues/src/kudu/src/kudu/rpc/rpc-test.cc:300: Connecting to 0.0.0.0:39015
I20260928 23:50:31.571684 21427 test_util.cc:175] -----------------------------------------------
I20260928 23:50:31.571856 21427 test_util.cc:176] Had fatal failures, leaving test files at /tmp/dist-test-taskJ_v4xr/test-tmp/rpc-test.1.Parameters_TestRpc.TestCallWithChainCertAndRootCA_SSL_TCP.1790639429933327-21427-0
[  FAILED  ] Parameters/TestRpc.TestCallWithChainCertAndRootCA/SSL_TCP, where GetParam() = (true, false) (47 ms)
[ RUN      ] Parameters/TestRpc.TestCallWithBadPasswordProtectedKey/SSL_TCP
[       OK ] Parameters/TestRpc.TestCallWithBadPasswordProtectedKey/SSL_TCP (34 ms)
[ RUN      ] Parameters/TestRpc.TestInvalidMethodCall/SSL_TCP
I20260928 23:50:31.652889 21562 acceptor_pool.cc:254] collecting diagnostics on the listening RPC socket 0.0.0.0:41885 every 8 connection(s)
I20260928 23:50:31.653805 21563 acceptor_pool.cc:254] collecting diagnostics on the listening RPC socket 0.0.0.0:41885 every 8 connection(s)
I20260928 23:50:31.657685 21427 rpc-test.cc:406] Connecting to 0.0.0.0:41885
[       OK ] Parameters/TestRpc.TestInvalidMethodCall/SSL_TCP (104 ms)
[ RUN      ] Parameters/TestRpc.TestHighFDs/SSL_TCP
I20260928 23:50:31.922298 21587 acceptor_pool.cc:254] collecting diagnostics on the listening RPC socket 0.0.0.0:33935 every 8 connection(s)
I20260928 23:50:31.923120 21588 acceptor_pool.cc:254] collecting diagnostics on the listening RPC socket 0.0.0.0:33935 every 8 connection(s)
[       OK ] Parameters/TestRpc.TestHighFDs/SSL_TCP (266 ms)
[ RUN      ] Parameters/TestRpc.TestConnectionAlwaysKeepalive/SSL_TCP
I20260928 23:50:31.992712 21610 acceptor_pool.cc:254] collecting diagnostics on the listening RPC socket 0.0.0.0:40729 every 8 connection(s)
I20260928 23:50:31.993510 21611 acceptor_pool.cc:254] collecting diagnostics on the listening RPC socket 0.0.0.0:40729 every 8 connection(s)
I20260928 23:50:31.997412 21427 rpc-test.cc:532] Connecting to 0.0.0.0:40729
[       OK ] Parameters/TestRpc.TestConnectionAlwaysKeepalive/SSL_TCP (3071 ms)
[ RUN      ] Parameters/TestRpc.TestReopenOutboundConnections/SSL_TCP
I20260928 23:50:35.089888 21633 acceptor_pool.cc:254] collecting diagnostics on the listening RPC socket 0.0.0.0:37017 every 8 connection(s)
I20260928 23:50:35.090655 21634 acceptor_pool.cc:254] collecting diagnostics on the listening RPC socket 0.0.0.0:37017 every 8 connection(s)
I20260928 23:50:35.094000 21427 rpc-test.cc:658] Connecting to 0.0.0.0:37017
[       OK ] Parameters/TestRpc.TestReopenOutboundConnections/SSL_TCP (447 ms)
[ RUN      ] Parameters/TestRpc.TestConnectionNetworkPlane/SSL_TCP
I20260928 23:50:35.529573 21656 acceptor_pool.cc:254] collecting diagnostics on the listening RPC socket 0.0.0.0:41909 every 8 connection(s)
I20260928 23:50:35.530200 21657 acceptor_pool.cc:254] collecting diagnostics on the listening RPC socket 0.0.0.0:41909 every 8 connection(s)
I20260928 23:50:35.534257 21427 rpc-test.cc:772] Connecting to 0.0.0.0:41909
[       OK ] Parameters/TestRpc.TestConnectionNetworkPlane/SSL_TCP (86 ms)
[ RUN      ] Parameters/TestRpc.TestTCPKeepalive/SSL_TCP
I20260928 23:50:35.606523 21681 acceptor_pool.cc:254] collecting diagnostics on the listening RPC socket 0.0.0.0:42875 every 8 connection(s)
I20260928 23:50:35.607313 21682 acceptor_pool.cc:254] collecting diagnostics on the listening RPC socket 0.0.0.0:42875 every 8 connection(s)
I20260928 23:50:35.634730 21685 rpc-test-base.h:222] got call: sleep_micros: 8000000 deferred: true
I20260928 23:50:43.639174 21685 rpcz_store.cc:275] Call kudu.rpc.GenericCalculatorService.Sleep from 127.0.0.1:34252 (request call id 0) took 8004 ms. Trace:
I20260928 23:50:43.639859 21685 rpcz_store.cc:276] 0928 23:50:35.634458 (+     0us) service_pool.cc:170] Inserting onto call queue
0928 23:50:35.634573 (+   115us) service_pool.cc:227] Handling call
0928 23:50:43.638967 (+8004394us) inbound_call.cc:173] Queueing success response
Metrics: {}
[       OK ] Parameters/TestRpc.TestTCPKeepalive/SSL_TCP (8076 ms)
[ RUN      ] Parameters/TestRpc.TestMaxSmallSidecars/SSL_TCP
I20260928 23:50:43.688299 21707 acceptor_pool.cc:254] collecting diagnostics on the listening RPC socket 0.0.0.0:35165 every 8 connection(s)
I20260928 23:50:43.689137 21708 acceptor_pool.cc:254] collecting diagnostics on the listening RPC socket 0.0.0.0:35165 every 8 connection(s)
[       OK ] Parameters/TestRpc.TestMaxSmallSidecars/SSL_TCP (209 ms)
[ RUN      ] Parameters/TestRpc.TestCallTimeout/SSL_TCP
I20260928 23:50:43.903113 21732 acceptor_pool.cc:254] collecting diagnostics on the listening RPC socket 0.0.0.0:33735 every 8 connection(s)
I20260928 23:50:43.904028 21733 acceptor_pool.cc:254] collecting diagnostics on the listening RPC socket 0.0.0.0:33735 every 8 connection(s)
I20260928 23:50:43.966713 21427 rpc-test-base.h:595] status: Timed out: connection negotiation to 0.0.0.0:33735 for RPC Sleep timed out after 0.000s (ON_OUTBOUND_QUEUE), seconds elapsed: 0.00287437
I20260928 23:50:43.975099 21736 rpc-test-base.h:222] got call: sleep_micros: 700000
I20260928 23:50:44.168141 21427 rpc-test-base.h:595] status: Timed out: Sleep RPC to 0.0.0.0:33735 timed out after 0.200s (SENT), seconds elapsed: 0.201032
I20260928 23:50:44.169867 21735 rpc-test-base.h:222] got call: sleep_micros: 2000000
W20260928 23:50:44.675869 21736 rpcz_store.cc:267] Call kudu.rpc.GenericCalculatorService.Sleep from 127.0.0.1:46956 (request call id 1) took 700 ms (client timeout 200 ms). Trace:
W20260928 23:50:44.676324 21736 rpcz_store.cc:269] 0928 23:50:43.974915 (+     0us) service_pool.cc:170] Inserting onto call queue
0928 23:50:43.975029 (+   114us) service_pool.cc:227] Handling call
0928 23:50:44.675787 (+700758us) inbound_call.cc:173] Queueing success response
Metrics: {}
I20260928 23:50:45.670441 21427 rpc-test-base.h:595] status: Timed out: Sleep RPC to 0.0.0.0:33735 timed out after 1.500s (SENT), seconds elapsed: 1.50189
W20260928 23:50:46.170481 21735 rpcz_store.cc:267] Call kudu.rpc.GenericCalculatorService.Sleep from 127.0.0.1:46956 (request call id 2) took 2001 ms (client timeout 1500 ms). Trace:
W20260928 23:50:46.170853 21735 rpcz_store.cc:269] 0928 23:50:44.169519 (+     0us) service_pool.cc:170] Inserting onto call queue
0928 23:50:44.169670 (+   151us) service_pool.cc:227] Handling call
0928 23:50:46.170426 (+2000756us) inbound_call.cc:173] Queueing success response
Metrics: {}
W20260928 23:50:46.171613 21729 connection.cc:441] server connection from 127.0.0.1:46956 torn down before Call kudu.rpc.GenericCalculatorService.Sleep from 127.0.0.1:46956 (request call id 2) could send its response
[       OK ] Parameters/TestRpc.TestCallTimeout/SSL_TCP (2306 ms)
[ RUN      ] Parameters/TestRpc.TestServerShutsDown/SSL_TCP
I20260928 23:50:46.179562 21427 rpc-test.cc:1125] Connecting to 0.0.0.0:42235
W20260928 23:50:46.190124 21749 negotiation.cc:337] Failed RPC negotiation. Trace:
0928 23:50:46.188493 (+     0us) reactor.cc:625] Submitting negotiation task for client connection to 0.0.0.0:42235 (local address 127.0.0.1:40464)
0928 23:50:46.188985 (+   492us) negotiation.cc:107] Waiting for socket to connect
0928 23:50:46.189021 (+    36us) client_negotiation.cc:174] Beginning negotiation
0928 23:50:46.189273 (+   252us) client_negotiation.cc:252] Sending NEGOTIATE NegotiatePB request
0928 23:50:46.189508 (+   235us) negotiation.cc:327] Negotiation complete: Network error: Client connection negotiation failed: client connection to 0.0.0.0:42235: BlockingWrite error: write error: Broken pipe (error 32)
Metrics: {"client-negotiator.queue_time_us":129}
[       OK ] Parameters/TestRpc.TestServerShutsDown/SSL_TCP (15 ms)
[ RUN      ] Parameters/TestRpc.TimedOutOnResponseMetric/SSL_TCP
I20260928 23:50:46.207852 21766 acceptor_pool.cc:254] collecting diagnostics on the listening RPC socket 0.0.0.0:36369 every 8 connection(s)
I20260928 23:50:46.208573 21767 acceptor_pool.cc:254] collecting diagnostics on the listening RPC socket 0.0.0.0:36369 every 8 connection(s)
W20260928 23:50:46.449035 21770 rpcz_store.cc:267] Call kudu.rpc_test.CalculatorService.Sleep from 127.0.0.1:52052 (request call id 3) took 50 ms (client timeout 25 ms). Trace:
W20260928 23:50:46.449443 21770 rpcz_store.cc:269] 0928 23:50:46.398271 (+     0us) service_pool.cc:170] Inserting onto call queue
0928 23:50:46.398403 (+   132us) service_pool.cc:227] Handling call
0928 23:50:46.448932 (+ 50529us) inbound_call.cc:173] Queueing success response
Related trace 'test_child':
Metrics: {"test_sleep_us":50000,"child_traces":[["test_child",{"related_trace_metric":1}]]}
W20260928 23:50:46.508392 21770 rpcz_store.cc:267] Call kudu.rpc_test.CalculatorService.Sleep from 127.0.0.1:52052 (request call id 4) took 50 ms (client timeout 50 ms). Trace:
W20260928 23:50:46.508761 21770 rpcz_store.cc:269] 0928 23:50:46.457764 (+     0us) service_pool.cc:170] Inserting onto call queue
0928 23:50:46.457896 (+   132us) service_pool.cc:227] Handling call
0928 23:50:46.508312 (+ 50416us) inbound_call.cc:173] Queueing success response
Related trace 'test_child':
Metrics: {"test_sleep_us":50000,"child_traces":[["test_child",{"related_trace_metric":1}]]}
[       OK ] Parameters/TestRpc.TimedOutOnResponseMetric/SSL_TCP (324 ms)
[ RUN      ] Parameters/TestRpc.AcceptorDispatchingTimesMetric/SSL_TCP
I20260928 23:50:46.530239 21791 acceptor_pool.cc:254] collecting diagnostics on the listening RPC socket 0.0.0.0:38693 every 8 connection(s)
I20260928 23:50:46.531081 21792 acceptor_pool.cc:254] collecting diagnostics on the listening RPC socket 0.0.0.0:38693 every 8 connection(s)
W20260928 23:50:46.536509 21787 negotiation.cc:337] Failed RPC negotiation. Trace:
0928 23:50:46.535105 (+     0us) reactor.cc:625] Submitting negotiation task for server connection from 127.0.0.1:42566 (local address 127.0.0.1:38693)
0928 23:50:46.535603 (+   498us) server_negotiation.cc:206] Beginning negotiation
0928 23:50:46.535629 (+    26us) server_negotiation.cc:399] Waiting for connection header
0928 23:50:46.535896 (+   267us) negotiation.cc:327] Negotiation complete: Network error: Server connection negotiation failed: server connection from 127.0.0.1:42566: BlockingRecv error: recv got EOF from 127.0.0.1:42566 (error 108)
Metrics: {"server-negotiator.queue_time_us":119}
[       OK ] Parameters/TestRpc.AcceptorDispatchingTimesMetric/SSL_TCP (24 ms)
[ RUN      ] Parameters/TestRpc.TestRpcCallbackDestroysMessenger/SSL_TCP
[       OK ] Parameters/TestRpc.TestRpcCallbackDestroysMessenger/SSL_TCP (45 ms)
[ RUN      ] Parameters/TestRpc.TestApplicationFeatureFlag/SSL_TCP
I20260928 23:50:46.614185 21816 acceptor_pool.cc:254] collecting diagnostics on the listening RPC socket 0.0.0.0:46833 every 8 connection(s)
I20260928 23:50:46.614892 21817 acceptor_pool.cc:254] collecting diagnostics on the listening RPC socket 0.0.0.0:46833 every 8 connection(s)
W20260928 23:50:46.652204 21815 messenger.cc:357] Unable to handle RPC call: Not implemented: call requires unsupported application feature flags: 99
[       OK ] Parameters/TestRpc.TestApplicationFeatureFlag/SSL_TCP (73 ms)
[ RUN      ] Parameters/TestRpc.TestCancellation/SSL_TCP
I20260928 23:50:46.681893 21841 acceptor_pool.cc:254] collecting diagnostics on the listening RPC socket 0.0.0.0:39765 every 8 connection(s)
I20260928 23:50:46.682581 21842 acceptor_pool.cc:254] collecting diagnostics on the listening RPC socket 0.0.0.0:39765 every 8 connection(s)
I20260928 23:50:46.685789 21427 rpc-test.cc:1648] Connecting to 0.0.0.0:39765
I20260928 23:50:46.798341 21427 rpc-test-base.h:595] status: Aborted: Sleep RPC to 0.0.0.0:39765 is cancelled in state READY, seconds elapsed: 0.000890677
I20260928 23:50:46.956241 21427 rpc-test-base.h:595] status: Aborted: Sleep RPC to 0.0.0.0:39765 is cancelled in state SENT, seconds elapsed: 0.00106581
I20260928 23:50:47.006095 21844 rpc-test-base.h:222] got call: sleep_micros: 510000
I20260928 23:50:47.135412 21427 rpc-test-base.h:595] status: Aborted: Sleep RPC to 0.0.0.0:39765 is cancelled in state SENT, seconds elapsed: 0.000947392
I20260928 23:50:47.189728 21843 rpc-test-base.h:222] got call: sleep_micros: 510000
I20260928 23:50:47.320564 21427 rpc-test-base.h:595] status: Aborted: Sleep RPC to 0.0.0.0:39765 is cancelled in state SENT, seconds elapsed: 0.00118714
W20260928 23:50:47.363912 21845 rpcz_store.cc:267] Call kudu.rpc.GenericCalculatorService.Sleep from 127.0.0.1:40768 (request call id 11) took 15 ms (client timeout 10 ms). Trace:
W20260928 23:50:47.364287 21845 rpcz_store.cc:269] 0928 23:50:47.348740 (+     0us) service_pool.cc:170] Inserting onto call queue
0928 23:50:47.363603 (+ 14863us) service_pool.cc:214] Skipping call since client already timed out
0928 23:50:47.363726 (+   123us) inbound_call.cc:173] Queueing failure response
Metrics: {}
I20260928 23:50:47.364818 21845 rpc-test-base.h:222] got call: sleep_micros: 1500000
W20260928 23:50:47.516893 21844 rpcz_store.cc:267] Call kudu.rpc.GenericCalculatorService.Sleep from 127.0.0.1:40768 (request call id 3) took 512 ms (client timeout 10 ms). Trace:
W20260928 23:50:47.517300 21844 rpcz_store.cc:269] 0928 23:50:47.004435 (+     0us) service_pool.cc:170] Inserting onto call queue
0928 23:50:47.006018 (+  1583us) service_pool.cc:227] Handling call
0928 23:50:47.516821 (+510803us) inbound_call.cc:173] Queueing success response
Metrics: {}
W20260928 23:50:47.700605 21843 rpcz_store.cc:267] Call kudu.rpc.GenericCalculatorService.Sleep from 127.0.0.1:40768 (request call id 7) took 511 ms (client timeout 10 ms). Trace:
W20260928 23:50:47.701063 21843 rpcz_store.cc:269] 0928 23:50:47.189390 (+     0us) service_pool.cc:170] Inserting onto call queue
0928 23:50:47.189619 (+   229us) service_pool.cc:227] Handling call
0928 23:50:47.700534 (+510915us) inbound_call.cc:173] Queueing success response
Metrics: {}
I20260928 23:50:48.322189 21427 rpc-test-base.h:595] status: Timed out: Sleep RPC to 0.0.0.0:39765 timed out after 1.000s (SENT), seconds elapsed: 1.00113
I20260928 23:50:48.323407 21843 rpc-test-base.h:222] got call: sleep_micros: 1500000
W20260928 23:50:48.865386 21845 rpcz_store.cc:267] Call kudu.rpc.GenericCalculatorService.Sleep from 127.0.0.1:40768 (request call id 12) took 1516 ms (client timeout 1000 ms). Trace:
W20260928 23:50:48.865868 21845 rpcz_store.cc:269] 0928 23:50:47.349074 (+     0us) service_pool.cc:170] Inserting onto call queue
0928 23:50:47.364781 (+ 15707us) service_pool.cc:227] Handling call
0928 23:50:48.865321 (+1500540us) inbound_call.cc:173] Queueing success response
Metrics: {}
I20260928 23:50:49.324556 21427 rpc-test-base.h:595] status: Timed out: Sleep RPC to 0.0.0.0:39765 timed out after 1.000s (SENT), seconds elapsed: 1.00207
W20260928 23:50:49.326129 21839 messenger.cc:357] Unable to handle RPC call: Not implemented: call requires unsupported application feature flags: 99, 1
W20260928 23:50:49.327739 21839 messenger.cc:357] Unable to handle RPC call: Not implemented: call requires unsupported application feature flags: 99, 1
W20260928 23:50:49.823946 21843 rpcz_store.cc:267] Call kudu.rpc.GenericCalculatorService.Sleep from 127.0.0.1:40768 (request call id 13) took 1500 ms (client timeout 1000 ms). Trace:
W20260928 23:50:49.824275 21843 rpcz_store.cc:269] 0928 23:50:48.323231 (+     0us) service_pool.cc:170] Inserting onto call queue
0928 23:50:48.323366 (+   135us) service_pool.cc:227] Handling call
0928 23:50:49.823889 (+1500523us) inbound_call.cc:173] Queueing success response
Metrics: {}
W20260928 23:50:49.824797 21839 connection.cc:441] server connection from 127.0.0.1:40768 torn down before Call kudu.rpc.GenericCalculatorService.Sleep from 127.0.0.1:40768 (request call id 13) could send its response
[       OK ] Parameters/TestRpc.TestCancellation/SSL_TCP (3170 ms)
[ RUN      ] Parameters/TestRpc.TestCancellationMultiThreads/SSL_TCP
I20260928 23:50:49.858747 21866 acceptor_pool.cc:254] collecting diagnostics on the listening RPC socket 0.0.0.0:33895 every 8 connection(s)
I20260928 23:50:49.859624 21867 acceptor_pool.cc:254] collecting diagnostics on the listening RPC socket 0.0.0.0:33895 every 8 connection(s)
I20260928 23:50:49.863250 21427 rpc-test.cc:1808] Connecting to 0.0.0.0:33895
I20260928 23:50:50.019433 21880 test_util.cc:268] Using random seed: -1135159742
I20260928 23:50:50.021318 21881 test_util.cc:268] Using random seed: -1135157855
I20260928 23:50:50.023578 21882 test_util.cc:268] Using random seed: -1135155589
I20260928 23:50:50.040793 21884 test_util.cc:268] Using random seed: -1135138600
I20260928 23:50:50.042989 21885 test_util.cc:268] Using random seed: -1135136354
I20260928 23:50:50.048311 21886 test_util.cc:268] Using random seed: -1135131088
I20260928 23:50:50.054029 21887 test_util.cc:268] Using random seed: -1135125314
I20260928 23:50:50.056566 21888 test_util.cc:268] Using random seed: -1135122761
I20260928 23:50:50.063244 21889 test_util.cc:268] Using random seed: -1135116285
I20260928 23:50:50.065323 21890 test_util.cc:268] Using random seed: -1135113999
I20260928 23:50:50.067836 21891 test_util.cc:268] Using random seed: -1135111524
I20260928 23:50:50.071475 21892 test_util.cc:268] Using random seed: -1135107903
I20260928 23:50:50.073638 21893 test_util.cc:268] Using random seed: -1135105700
I20260928 23:50:50.075696 21894 test_util.cc:268] Using random seed: -1135103699
I20260928 23:50:50.080891 21895 test_util.cc:268] Using random seed: -1135098487
I20260928 23:50:50.084371 21896 test_util.cc:268] Using random seed: -1135094945
I20260928 23:50:50.086552 21897 test_util.cc:268] Using random seed: -1135092818
I20260928 23:50:50.088860 21898 test_util.cc:268] Using random seed: -1135090592
I20260928 23:50:50.091635 21899 test_util.cc:268] Using random seed: -1135087768
I20260928 23:50:50.094173 21900 test_util.cc:268] Using random seed: -1135085257
I20260928 23:50:50.098277 21901 test_util.cc:268] Using random seed: -1135081076
I20260928 23:50:50.100826 21902 test_util.cc:268] Using random seed: -1135078544
I20260928 23:50:50.102782 21903 test_util.cc:268] Using random seed: -1135076586
I20260928 23:50:50.105278 21904 test_util.cc:268] Using random seed: -1135074147
I20260928 23:50:50.107450 21905 test_util.cc:268] Using random seed: -1135071894
I20260928 23:50:50.109174 21906 test_util.cc:268] Using random seed: -1135070137
I20260928 23:50:50.111392 21907 test_util.cc:268] Using random seed: -1135067967
I20260928 23:50:50.114671 21908 test_util.cc:268] Using random seed: -1135064754
I20260928 23:50:50.117074 21909 test_util.cc:268] Using random seed: -1135062376
I20260928 23:50:50.119776 21910 test_util.cc:268] Using random seed: -1135059571
[       OK ] Parameters/TestRpc.TestCancellationMultiThreads/SSL_TCP (18698 ms)
[ RUN      ] Parameters/TestRpc.TestCallId/SSL_TCP
I20260928 23:51:08.568351 21923 acceptor_pool.cc:254] collecting diagnostics on the listening RPC socket 0.0.0.0:41451 every 8 connection(s)
I20260928 23:51:08.569226 21924 acceptor_pool.cc:254] collecting diagnostics on the listening RPC socket 0.0.0.0:41451 every 8 connection(s)
[       OK ] Parameters/TestRpc.TestCallId/SSL_TCP (101 ms)
[----------] 20 tests from Parameters/TestRpc (38632 ms total)

[----------] Global test environment tear-down
[==========] 21 tests from 2 test suites ran. (38641 ms total)
[  PASSED  ] 20 tests.
[  FAILED  ] 1 test, listed below:
[  FAILED  ] Parameters/TestRpc.TestCallWithChainCertAndRootCA/SSL_TCP, where GetParam() = (true, false)

 1 FAILED TEST