Diagnosed failure

Parameters/TestRpc.TestCallWithChainCertAndChainCA/SSL_TCP: /data0/somelongdirectorytoavoidrpathissues/src/kudu/src/kudu/rpc/rpc-test.cc:270: Failure
Failed
Bad status: Runtime error: could not verify certificate chain (error with cert: subject=CN = localhost, ST = sadfjas, C = AS, emailAddress = sdflkdsajf, O = lskdfjlsad, OU = sldfkja, issuer=C = AS, ST = ASDfkjdhf, L = lskdjf, O = saldfja, OU = skdjf, CN = localhost, emailAddress = sadjflkadsj): : certificate has expired
Google Test trace:
/data0/somelongdirectorytoavoidrpathissues/src/kudu/src/kudu/rpc/rpc-test.cc:267: Connecting to 0.0.0.0:42697
I20260926 03:35:47.628041  2302 test_util.cc:175] -----------------------------------------------
I20260926 03:35:47.628142  2302 test_util.cc:176] Had fatal failures, leaving test files at /tmp/dist-test-taskcCzYog/test-tmp/rpc-test.5.Parameters_TestRpc.TestCallWithChainCertAndChainCA_SSL_TCP.1790393747507835-2302-0

Full log

Note: This is test shard 6 of 8.
[==========] Running 21 tests from 2 test suites.
[----------] Global test environment set-up.
[----------] 20 tests from Parameters/TestRpc
[ RUN      ] Parameters/TestRpc.TestMessengerCreateDestroy/SSL_TCP
WARNING: Logging before InitGoogleLogging() is written to STDERR
I20260926 03:35:47.556945  2302 rpc-test.cc:169] started messenger TestCreateDestroy
[       OK ] Parameters/TestRpc.TestMessengerCreateDestroy/SSL_TCP (31 ms)
[ RUN      ] Parameters/TestRpc.TestNegotiationDeadlock/SSL_TCP
I20260926 03:35:47.575320  2322 acceptor_pool.cc:254] collecting diagnostics on the listening RPC socket 0.0.0.0:38865 every 8 connection(s)
I20260926 03:35:47.575623  2323 acceptor_pool.cc:254] collecting diagnostics on the listening RPC socket 0.0.0.0:38865 every 8 connection(s)
[       OK ] Parameters/TestRpc.TestNegotiationDeadlock/SSL_TCP (35 ms)
[ RUN      ] Parameters/TestRpc.TestCallWithChainCertAndChainCA/SSL_TCP
I20260926 03:35:47.610136  2338 acceptor_pool.cc:254] collecting diagnostics on the listening RPC socket 0.0.0.0:42697 every 8 connection(s)
I20260926 03:35:47.610493  2339 acceptor_pool.cc:254] collecting diagnostics on the listening RPC socket 0.0.0.0:42697 every 8 connection(s)
/data0/somelongdirectorytoavoidrpathissues/src/kudu/src/kudu/rpc/rpc-test.cc:270: Failure
Failed
Bad status: Runtime error: could not verify certificate chain (error with cert: subject=CN = localhost, ST = sadfjas, C = AS, emailAddress = sdflkdsajf, O = lskdfjlsad, OU = sldfkja, issuer=C = AS, ST = ASDfkjdhf, L = lskdjf, O = saldfja, OU = skdjf, CN = localhost, emailAddress = sadjflkadsj): : certificate has expired
Google Test trace:
/data0/somelongdirectorytoavoidrpathissues/src/kudu/src/kudu/rpc/rpc-test.cc:267: Connecting to 0.0.0.0:42697
I20260926 03:35:47.628041  2302 test_util.cc:175] -----------------------------------------------
I20260926 03:35:47.628142  2302 test_util.cc:176] Had fatal failures, leaving test files at /tmp/dist-test-taskcCzYog/test-tmp/rpc-test.5.Parameters_TestRpc.TestCallWithChainCertAndChainCA_SSL_TCP.1790393747507835-2302-0
[  FAILED  ] Parameters/TestRpc.TestCallWithChainCertAndChainCA/SSL_TCP, where GetParam() = (true, false) (32 ms)
[ RUN      ] Parameters/TestRpc.TestCallWithPasswordProtectedKey/SSL_TCP
I20260926 03:35:47.638724  2363 acceptor_pool.cc:254] collecting diagnostics on the listening RPC socket 0.0.0.0:39501 every 8 connection(s)
I20260926 03:35:47.638947  2364 acceptor_pool.cc:254] collecting diagnostics on the listening RPC socket 0.0.0.0:39501 every 8 connection(s)
[       OK ] Parameters/TestRpc.TestCallWithPasswordProtectedKey/SSL_TCP (44 ms)
[ RUN      ] Parameters/TestRpc.TestCallToBadServer/SSL_TCP
I20260926 03:35:47.691370  2302 rpc-test.cc:394] Status: Network error: Client connection negotiation failed: client connection to 0.0.0.0:0: connect: Connection refused (error 111)
I20260926 03:35:47.692057  2302 rpc-test.cc:394] Status: Network error: Client connection negotiation failed: client connection to 0.0.0.0:0: connect: Connection refused (error 111)
I20260926 03:35:47.692662  2302 rpc-test.cc:394] Status: Network error: Client connection negotiation failed: client connection to 0.0.0.0:0: connect: Connection refused (error 111)
I20260926 03:35:47.693249  2302 rpc-test.cc:394] Status: Network error: Client connection negotiation failed: client connection to 0.0.0.0:0: connect: Connection refused (error 111)
I20260926 03:35:47.693842  2302 rpc-test.cc:394] Status: Network error: Client connection negotiation failed: client connection to 0.0.0.0:0: connect: Connection refused (error 111)
[       OK ] Parameters/TestRpc.TestCallToBadServer/SSL_TCP (23 ms)
[ RUN      ] Parameters/TestRpc.TestWrongService/SSL_TCP
I20260926 03:35:47.713685  2398 acceptor_pool.cc:254] collecting diagnostics on the listening RPC socket 0.0.0.0:46813 every 8 connection(s)
I20260926 03:35:47.713981  2399 acceptor_pool.cc:254] collecting diagnostics on the listening RPC socket 0.0.0.0:46813 every 8 connection(s)
I20260926 03:35:47.730723  2395 messenger.cc:345] service WrongServiceName not registered on TestServer
[       OK ] Parameters/TestRpc.TestWrongService/SSL_TCP (39 ms)
[ RUN      ] Parameters/TestRpc.TestConnectionKeepalive/SSL_TCP
I20260926 03:35:47.750227  2421 acceptor_pool.cc:254] collecting diagnostics on the listening RPC socket 0.0.0.0:42829 every 8 connection(s)
I20260926 03:35:47.750478  2422 acceptor_pool.cc:254] collecting diagnostics on the listening RPC socket 0.0.0.0:42829 every 8 connection(s)
I20260926 03:35:47.751535  2302 rpc-test.cc:488] Connecting to 0.0.0.0:42829
[       OK ] Parameters/TestRpc.TestConnectionKeepalive/SSL_TCP (1040 ms)
[ RUN      ] Parameters/TestRpc.TestClientConnectionMetrics/SSL_TCP
I20260926 03:35:48.825491  2446 acceptor_pool.cc:254] collecting diagnostics on the listening RPC socket 0.0.0.0:44423 every 8 connection(s)
I20260926 03:35:48.825937  2447 acceptor_pool.cc:254] collecting diagnostics on the listening RPC socket 0.0.0.0:44423 every 8 connection(s)
I20260926 03:35:48.827095  2302 rpc-test.cc:569] Connecting to 0.0.0.0:44423
[       OK ] Parameters/TestRpc.TestClientConnectionMetrics/SSL_TCP (20070 ms)
[ RUN      ] Parameters/TestRpc.TestCredentialsPolicy/SSL_TCP
I20260926 03:36:08.878039  2469 acceptor_pool.cc:254] collecting diagnostics on the listening RPC socket 0.0.0.0:38145 every 8 connection(s)
I20260926 03:36:08.878285  2470 acceptor_pool.cc:254] collecting diagnostics on the listening RPC socket 0.0.0.0:38145 every 8 connection(s)
I20260926 03:36:08.879213  2302 rpc-test.cc:700] Connecting to 0.0.0.0:38145
[       OK ] Parameters/TestRpc.TestCredentialsPolicy/SSL_TCP (67 ms)
[ RUN      ] Parameters/TestRpc.TestCallLongerThanKeepalive/SSL_TCP
I20260926 03:36:08.931212  2494 acceptor_pool.cc:254] collecting diagnostics on the listening RPC socket 0.0.0.0:45641 every 8 connection(s)
I20260926 03:36:08.931497  2495 acceptor_pool.cc:254] collecting diagnostics on the listening RPC socket 0.0.0.0:45641 every 8 connection(s)
I20260926 03:36:08.950982  2498 rpc-test-base.h:222] got call: sleep_micros: 3000000 deferred: true
I20260926 03:36:11.952661  2498 rpcz_store.cc:275] Call kudu.rpc.GenericCalculatorService.Sleep from 127.0.0.1:50626 (request call id 0) took 3001 ms. Trace:
I20260926 03:36:11.952828  2498 rpcz_store.cc:276] 0926 03:36:08.950875 (+     0us) service_pool.cc:170] Inserting onto call queue
0926 03:36:08.950936 (+    61us) service_pool.cc:227] Handling call
0926 03:36:11.952612 (+3001676us) inbound_call.cc:173] Queueing success response
Metrics: {}
[       OK ] Parameters/TestRpc.TestCallLongerThanKeepalive/SSL_TCP (3044 ms)
[ RUN      ] Parameters/TestRpc.TestRpcSidecar/SSL_TCP
I20260926 03:36:11.977990  2519 acceptor_pool.cc:254] collecting diagnostics on the listening RPC socket 0.0.0.0:41971 every 8 connection(s)
I20260926 03:36:11.978259  2520 acceptor_pool.cc:254] collecting diagnostics on the listening RPC socket 0.0.0.0:41971 every 8 connection(s)
[       OK ] Parameters/TestRpc.TestRpcSidecar/SSL_TCP (149 ms)
[ RUN      ] Parameters/TestRpc.TestRpcSidecarLimits/SSL_TCP
I20260926 03:36:14.188380  2544 acceptor_pool.cc:254] collecting diagnostics on the listening RPC socket 0.0.0.0:40245 every 8 connection(s)
I20260926 03:36:14.188680  2545 acceptor_pool.cc:254] collecting diagnostics on the listening RPC socket 0.0.0.0:40245 every 8 connection(s)
W20260926 03:36:14.221195  2302 serialization.cc:72] Serialized kudu.rpc_test.PushStringsRequestPB (2147483654 bytes) is larger than the maximum configured RPC message size (52428800 bytes). Sending anyway, but peer may reject the data.
W20260926 03:36:14.227852  2541 connection.cc:535] server connection from 127.0.0.1:41886 recv error: Network error: RPC frame had a length of 2147483714, but we only support messages up to 52428800 bytes long.
W20260926 03:36:14.227968  2541 connection.cc:158] shutting down server connection from 127.0.0.1:41886 with pending inbound data: 4/2147483714 bytes received; last active 0 ns ago: status Network error: RPC frame had a length of 2147483714, but we only support messages up to 52428800 bytes long.
W20260926 03:36:14.228473  2557 connection.cc:196] Error closing socket: Network error: TlsSocket::Close: Connection reset by peer
I20260926 03:36:14.243440  2569 acceptor_pool.cc:254] collecting diagnostics on the listening RPC socket 0.0.0.0:45485 every 8 connection(s)
I20260926 03:36:14.243799  2570 acceptor_pool.cc:254] collecting diagnostics on the listening RPC socket 0.0.0.0:45485 every 8 connection(s)
W20260926 03:36:19.604415  2568 connection.cc:577] server connection from 127.0.0.1:37720: received bad data: 'Corruption: Invalid packet: message had a length of 2147483710, but we only support messages up to 2147483647 bytes
'
[       OK ] Parameters/TestRpc.TestRpcSidecarLimits/SSL_TCP (7967 ms)
[ RUN      ] Parameters/TestRpc.TestCallTimeoutDoesntAffectNegotiation/SSL_TCP
I20260926 03:36:20.103212  2594 acceptor_pool.cc:254] collecting diagnostics on the listening RPC socket 0.0.0.0:41937 every 8 connection(s)
I20260926 03:36:20.103574  2595 acceptor_pool.cc:254] collecting diagnostics on the listening RPC socket 0.0.0.0:41937 every 8 connection(s)
W20260926 03:36:20.114642  2590 negotiation.cc:266] Injecting 500ms delay in negotiation
I20260926 03:36:20.165259  2302 rpc-test-base.h:595] status: Timed out: connection negotiation to 0.0.0.0:41937 for RPC Sleep timed out after 0.050s (ON_OUTBOUND_QUEUE), seconds elapsed: 0.0512582
[       OK ] Parameters/TestRpc.TestCallTimeoutDoesntAffectNegotiation/SSL_TCP (548 ms)
[ RUN      ] Parameters/TestRpc.TestRpcHandlerLatencyMetric/SSL_TCP
I20260926 03:36:20.633585  2619 acceptor_pool.cc:254] collecting diagnostics on the listening RPC socket 0.0.0.0:34673 every 8 connection(s)
I20260926 03:36:20.633896  2620 acceptor_pool.cc:254] collecting diagnostics on the listening RPC socket 0.0.0.0:34673 every 8 connection(s)
I20260926 03:36:20.672158  2302 rpc-test.cc:1236] Sleep() min lat: 20598
I20260926 03:36:20.672242  2302 rpc-test.cc:1237] Sleep() mean lat: 20598
I20260926 03:36:20.672282  2302 rpc-test.cc:1238] Sleep() max lat: 20598
I20260926 03:36:20.672302  2302 rpc-test.cc:1239] Sleep() #calls: 1
[       OK ] Parameters/TestRpc.TestRpcHandlerLatencyMetric/SSL_TCP (52 ms)
[ RUN      ] Parameters/TestRpc.TimedOutOnResponseMetricServiceQueue/SSL_TCP
I20260926 03:36:20.691790  2645 acceptor_pool.cc:254] collecting diagnostics on the listening RPC socket 0.0.0.0:44345 every 8 connection(s)
I20260926 03:36:20.692008  2646 acceptor_pool.cc:254] collecting diagnostics on the listening RPC socket 0.0.0.0:44345 every 8 connection(s)
W20260926 03:36:20.757081  2647 rpcz_store.cc:267] Call kudu.rpc_test.CalculatorService.Sleep from 127.0.0.1:43614 (request call id 2) took 20 ms (client timeout 20 ms). Trace:
W20260926 03:36:20.757265  2647 rpcz_store.cc:269] 0926 03:36:20.736614 (+     0us) service_pool.cc:170] Inserting onto call queue
0926 03:36:20.757000 (+ 20386us) service_pool.cc:214] Skipping call since client already timed out
0926 03:36:20.757055 (+    55us) inbound_call.cc:173] Queueing failure response
Metrics: {}
[       OK ] Parameters/TestRpc.TimedOutOnResponseMetricServiceQueue/SSL_TCP (84 ms)
[ RUN      ] Parameters/TestRpc.RpcPendingConnectionsMetric/SSL_TCP
I20260926 03:36:20.766705  2668 acceptor_pool.cc:254] collecting diagnostics on the listening RPC socket 0.0.0.0:34371 every 8 connection(s)
I20260926 03:36:20.766916  2669 acceptor_pool.cc:254] collecting diagnostics on the listening RPC socket 0.0.0.0:34371 every 8 connection(s)
W20260926 03:36:20.768905  2664 negotiation.cc:337] Failed RPC negotiation. Trace:
0926 03:36:20.768296 (+     0us) reactor.cc:625] Submitting negotiation task for server connection from 127.0.0.1:43434 (local address 127.0.0.1:34371)
0926 03:36:20.768445 (+   149us) server_negotiation.cc:206] Beginning negotiation
0926 03:36:20.768451 (+     6us) server_negotiation.cc:399] Waiting for connection header
0926 03:36:20.768598 (+   147us) negotiation.cc:327] Negotiation complete: Network error: Server connection negotiation failed: server connection from 127.0.0.1:43434: BlockingRecv error: recv got EOF from 127.0.0.1:43434 (error 108)
Metrics: {"server-negotiator.queue_time_us":46}
[       OK ] Parameters/TestRpc.RpcPendingConnectionsMetric/SSL_TCP (19 ms)
[ RUN      ] Parameters/TestRpc.TestRpcContextClientDeadline/SSL_TCP
I20260926 03:36:20.800933  2684 acceptor_pool.cc:254] collecting diagnostics on the listening RPC socket 0.0.0.0:37799 every 8 connection(s)
I20260926 03:36:20.801123  2685 acceptor_pool.cc:254] collecting diagnostics on the listening RPC socket 0.0.0.0:37799 every 8 connection(s)
[       OK ] Parameters/TestRpc.TestRpcContextClientDeadline/SSL_TCP (66 ms)
[ RUN      ] Parameters/TestRpc.TestApplicationFeatureFlagUnsupportedServer/SSL_TCP
I20260926 03:36:20.865888  2709 acceptor_pool.cc:254] collecting diagnostics on the listening RPC socket 0.0.0.0:43855 every 8 connection(s)
I20260926 03:36:20.866139  2710 acceptor_pool.cc:254] collecting diagnostics on the listening RPC socket 0.0.0.0:43855 every 8 connection(s)
[       OK ] Parameters/TestRpc.TestApplicationFeatureFlagUnsupportedServer/SSL_TCP (56 ms)
[ RUN      ] Parameters/TestRpc.TestCancellationAsync/SSL_TCP
I20260926 03:36:20.924324  2734 acceptor_pool.cc:254] collecting diagnostics on the listening RPC socket 0.0.0.0:38555 every 8 connection(s)
I20260926 03:36:20.924546  2735 acceptor_pool.cc:254] collecting diagnostics on the listening RPC socket 0.0.0.0:38555 every 8 connection(s)
I20260926 03:36:20.925472  2302 rpc-test.cc:1716] Connecting to 0.0.0.0:38555
I20260926 03:36:20.933284  2302 test_util.cc:268] Using random seed: -1991110007
I20260926 03:36:20.983073  2738 rpc-test-base.h:240] got call: sleep_micros: 500 pattern: 4294967295 num_repetitions: 2097152 sidecar_idx: 0
I20260926 03:36:21.018424  2738 rpc-test-base.h:240] got call: sleep_micros: 500 pattern: 4294967295 num_repetitions: 2097152 sidecar_idx: 0
I20260926 03:36:21.056995  2737 rpc-test-base.h:240] got call: sleep_micros: 500 pattern: 4294967295 num_repetitions: 2097152 sidecar_idx: 0
I20260926 03:36:21.087519  2738 rpc-test-base.h:240] got call: sleep_micros: 500 pattern: 4294967295 num_repetitions: 2097152 sidecar_idx: 0
I20260926 03:36:21.114496  2736 rpc-test-base.h:240] got call: sleep_micros: 500 pattern: 4294967295 num_repetitions: 2097152 sidecar_idx: 0
I20260926 03:36:21.143882  2737 rpc-test-base.h:240] got call: sleep_micros: 500 pattern: 4294967295 num_repetitions: 2097152 sidecar_idx: 0
W20260926 03:36:21.169606  2731 connection.cc:196] Error closing socket: Network error: TlsSocket::Close: Broken pipe
W20260926 03:36:21.184209  2731 connection.cc:441] server connection from 127.0.0.1:50858 torn down before Call kudu.rpc.GenericCalculatorService.SleepWithSidecar from 127.0.0.1:50858 (request call id 7) could send its response
W20260926 03:36:21.196609  2731 connection.cc:441] server connection from 127.0.0.1:50858 torn down before Call kudu.rpc.GenericCalculatorService.SleepWithSidecar from 127.0.0.1:50858 (request call id 8) could send its response
[       OK ] Parameters/TestRpc.TestCancellationAsync/SSL_TCP (294 ms)
[ RUN      ] Parameters/TestRpc.TestPerformanceBySocketType/SSL_TCP
I20260926 03:36:21.220358  2759 acceptor_pool.cc:254] collecting diagnostics on the listening RPC socket 0.0.0.0:44337 every 8 connection(s)
I20260926 03:36:21.220590  2760 acceptor_pool.cc:254] collecting diagnostics on the listening RPC socket 0.0.0.0:44337 every 8 connection(s)
I20260926 03:36:21.221493  2302 rpc-test.cc:1846] Connecting to 0.0.0.0:44337
I20260926 03:36:24.186673  2302 rpc-test.cc:1859] Sending 1024MB via ssl-enabled tcp socket: real 2.944s	user 2.815s	sys 2.122s
I20260926 03:36:27.043838  2302 rpc-test.cc:1859] Sending 1024MB via ssl-enabled tcp socket: real 2.857s	user 2.622s	sys 2.122s
I20260926 03:36:29.948684  2302 rpc-test.cc:1859] Sending 1024MB via ssl-enabled tcp socket: real 2.905s	user 2.748s	sys 2.079s
I20260926 03:36:32.852665  2302 rpc-test.cc:1859] Sending 1024MB via ssl-enabled tcp socket: real 2.904s	user 2.617s	sys 2.167s
I20260926 03:36:35.799292  2302 rpc-test.cc:1859] Sending 1024MB via ssl-enabled tcp socket: real 2.946s	user 2.665s	sys 2.254s
[       OK ] Parameters/TestRpc.TestPerformanceBySocketType/SSL_TCP (14607 ms)
[----------] 20 tests from Parameters/TestRpc (48278 ms total)

[----------] 1 test from Parameters/TestRpcSocketTxRxQueue
[ RUN      ] Parameters/TestRpcSocketTxRxQueue.OverCapacity/0
W20260926 03:36:36.101996  2785 negotiation.cc:337] Failed RPC negotiation. Trace:
0926 03:36:35.813454 (+     0us) reactor.cc:625] Submitting negotiation task for client connection to 0.0.0.0:44429 (local address 127.0.0.1:54962)
0926 03:36:35.813619 (+   165us) negotiation.cc:107] Waiting for socket to connect
0926 03:36:35.813635 (+    16us) client_negotiation.cc:174] Beginning negotiation
0926 03:36:35.813784 (+   149us) client_negotiation.cc:252] Sending NEGOTIATE NegotiatePB request
0926 03:36:36.101546 (+287762us) negotiation.cc:327] Negotiation complete: Network error: Client connection negotiation failed: client connection to 0.0.0.0:44429: BlockingRecv error: recv error from unknown peer: Transport endpoint is not connected (error 107)
Metrics: {"client-negotiator.queue_time_us":56}
W20260926 03:36:36.102028  2803 negotiation.cc:337] Failed RPC negotiation. Trace:
0926 03:36:35.818427 (+     0us) reactor.cc:625] Submitting negotiation task for client connection to 0.0.0.0:44429 (local address 127.0.0.1:54978)
0926 03:36:35.818632 (+   205us) negotiation.cc:107] Waiting for socket to connect
0926 03:36:35.818649 (+    17us) client_negotiation.cc:174] Beginning negotiation
0926 03:36:35.818755 (+   106us) client_negotiation.cc:252] Sending NEGOTIATE NegotiatePB request
0926 03:36:36.101756 (+283001us) negotiation.cc:327] Negotiation complete: Network error: Client connection negotiation failed: client connection to 0.0.0.0:44429: BlockingRecv error: recv error from unknown peer: Transport endpoint is not connected (error 107)
Metrics: {"client-negotiator.queue_time_us":68}
W20260926 03:36:36.102466  2794 negotiation.cc:337] Failed RPC negotiation. Trace:
0926 03:36:35.815834 (+     0us) reactor.cc:625] Submitting negotiation task for client connection to 0.0.0.0:44429 (local address 127.0.0.1:54968)
0926 03:36:35.815997 (+   163us) negotiation.cc:107] Waiting for socket to connect
0926 03:36:35.816013 (+    16us) client_negotiation.cc:174] Beginning negotiation
0926 03:36:35.816122 (+   109us) client_negotiation.cc:252] Sending NEGOTIATE NegotiatePB request
0926 03:36:36.101600 (+285478us) negotiation.cc:327] Negotiation complete: Network error: Client connection negotiation failed: client connection to 0.0.0.0:44429: BlockingRecv error: recv error from unknown peer: Transport endpoint is not connected (error 107)
Metrics: {"client-negotiator.queue_time_us":32}
W20260926 03:36:36.102283  2821 negotiation.cc:337] Failed RPC negotiation. Trace:
0926 03:36:35.823626 (+     0us) reactor.cc:625] Submitting negotiation task for client connection to 0.0.0.0:44429 (local address 127.0.0.1:55000)
0926 03:36:35.823851 (+   225us) negotiation.cc:107] Waiting for socket to connect
0926 03:36:35.823868 (+    17us) client_negotiation.cc:174] Beginning negotiation
0926 03:36:35.823977 (+   109us) client_negotiation.cc:252] Sending NEGOTIATE NegotiatePB request
0926 03:36:36.101974 (+277997us) negotiation.cc:327] Negotiation complete: Network error: Client connection negotiation failed: client connection to 0.0.0.0:44429: BlockingRecv error: recv error from unknown peer: Transport endpoint is not connected (error 107)
Metrics: {"client-negotiator.queue_time_us":91}
W20260926 03:36:36.102978  2812 negotiation.cc:337] Failed RPC negotiation. Trace:
0926 03:36:35.820999 (+     0us) reactor.cc:625] Submitting negotiation task for client connection to 0.0.0.0:44429 (local address 127.0.0.1:54990)
0926 03:36:35.821202 (+   203us) negotiation.cc:107] Waiting for socket to connect
0926 03:36:35.821219 (+    17us) client_negotiation.cc:174] Beginning negotiation
0926 03:36:35.821316 (+    97us) client_negotiation.cc:252] Sending NEGOTIATE NegotiatePB request
0926 03:36:36.101493 (+280177us) negotiation.cc:327] Negotiation complete: Network error: Client connection negotiation failed: client connection to 0.0.0.0:44429: BlockingRecv error: recv error from unknown peer: Transport endpoint is not connected (error 107)
Metrics: {"client-negotiator.queue_time_us":50}
W20260926 03:36:36.103269  2776 negotiation.cc:337] Failed RPC negotiation. Trace:
0926 03:36:35.811216 (+     0us) reactor.cc:625] Submitting negotiation task for client connection to 0.0.0.0:44429 (local address 127.0.0.1:54954)
0926 03:36:35.811372 (+   156us) negotiation.cc:107] Waiting for socket to connect
0926 03:36:35.811389 (+    17us) client_negotiation.cc:174] Beginning negotiation
0926 03:36:35.811498 (+   109us) client_negotiation.cc:252] Sending NEGOTIATE NegotiatePB request
0926 03:36:36.101493 (+289995us) negotiation.cc:327] Negotiation complete: Network error: Client connection negotiation failed: client connection to 0.0.0.0:44429: BlockingRecv error: recv error from unknown peer: Transport endpoint is not connected (error 107)
Metrics: {"client-negotiator.queue_time_us":52}
[       OK ] Parameters/TestRpcSocketTxRxQueue.OverCapacity/0 (1061 ms)
[----------] 1 test from Parameters/TestRpcSocketTxRxQueue (1061 ms total)

[----------] Global test environment tear-down
[==========] 21 tests from 2 test suites ran. (49339 ms total)
[  PASSED  ] 20 tests.
[  FAILED  ] 1 test, listed below:
[  FAILED  ] Parameters/TestRpc.TestCallWithChainCertAndChainCA/SSL_TCP, where GetParam() = (true, false)

 1 FAILED TEST