Diagnosed failure
Parameters/TestRpc.TestCallWithChainCertAndChainCA/SSL_UnixSocket: /data0/somelongdirectorytoavoidrpathissues/src/kudu/src/kudu/rpc/rpc-test.cc:270: Failure
Failed
Bad status: Runtime error: could not verify certificate chain (error with cert: subject=CN = localhost, ST = sadfjas, C = AS, emailAddress = sdflkdsajf, O = lskdfjlsad, OU = sldfkja, issuer=C = AS, ST = ASDfkjdhf, L = lskdjf, O = saldfja, OU = skdjf, CN = localhost, emailAddress = sadjflkadsj): : certificate has expired
Google Test trace:
/data0/somelongdirectorytoavoidrpathissues/src/kudu/src/kudu/rpc/rpc-test.cc:267: Connecting to unix:/tmp/dist-test-task7WhVb2/test-tmp/rpc-test-b57335571b2e409e9ffb22c8c1a8f406.sock
I20260928 02:36:32.331544 1289 test_util.cc:175] -----------------------------------------------
I20260928 02:36:32.331589 1289 test_util.cc:176] Had fatal failures, leaving test files at /tmp/dist-test-task7WhVb2/test-tmp/rpc-test.6.Parameters_TestRpc.TestCallWithChainCertAndChainCA_SSL_UnixSocket.1790562992244559-1289-0
Full log
Note: This is test shard 7 of 8.
[==========] Running 21 tests from 2 test suites.
[----------] Global test environment set-up.
[----------] 20 tests from Parameters/TestRpc
[ RUN ] Parameters/TestRpc.TestMessengerCreateDestroy/SSL_UnixSocket
WARNING: Logging before InitGoogleLogging() is written to STDERR
I20260928 02:36:32.260265 1289 rpc-test.cc:169] started messenger TestCreateDestroy
[ OK ] Parameters/TestRpc.TestMessengerCreateDestroy/SSL_UnixSocket (14 ms)
[ RUN ] Parameters/TestRpc.TestNegotiationDeadlock/SSL_UnixSocket
I20260928 02:36:32.295607 1310 acceptor_pool.cc:254] collecting diagnostics on the listening RPC socket unix:/tmp/dist-test-task7WhVb2/test-tmp/rpc-test-92e0f22b80a6453c8e5be903abdacdfd.sock every 8 connection(s)
I20260928 02:36:32.295599 1309 acceptor_pool.cc:254] collecting diagnostics on the listening RPC socket unix:/tmp/dist-test-task7WhVb2/test-tmp/rpc-test-92e0f22b80a6453c8e5be903abdacdfd.sock every 8 connection(s)
[ OK ] Parameters/TestRpc.TestNegotiationDeadlock/SSL_UnixSocket (40 ms)
[ RUN ] Parameters/TestRpc.TestCallWithChainCertAndChainCA/SSL_UnixSocket
I20260928 02:36:32.327800 1325 acceptor_pool.cc:254] collecting diagnostics on the listening RPC socket unix:/tmp/dist-test-task7WhVb2/test-tmp/rpc-test-b57335571b2e409e9ffb22c8c1a8f406.sock every 8 connection(s)
I20260928 02:36:32.327893 1326 acceptor_pool.cc:254] collecting diagnostics on the listening RPC socket unix:/tmp/dist-test-task7WhVb2/test-tmp/rpc-test-b57335571b2e409e9ffb22c8c1a8f406.sock every 8 connection(s)
/data0/somelongdirectorytoavoidrpathissues/src/kudu/src/kudu/rpc/rpc-test.cc:270: Failure
Failed
Bad status: Runtime error: could not verify certificate chain (error with cert: subject=CN = localhost, ST = sadfjas, C = AS, emailAddress = sdflkdsajf, O = lskdfjlsad, OU = sldfkja, issuer=C = AS, ST = ASDfkjdhf, L = lskdjf, O = saldfja, OU = skdjf, CN = localhost, emailAddress = sadjflkadsj): : certificate has expired
Google Test trace:
/data0/somelongdirectorytoavoidrpathissues/src/kudu/src/kudu/rpc/rpc-test.cc:267: Connecting to unix:/tmp/dist-test-task7WhVb2/test-tmp/rpc-test-b57335571b2e409e9ffb22c8c1a8f406.sock
I20260928 02:36:32.331544 1289 test_util.cc:175] -----------------------------------------------
I20260928 02:36:32.331589 1289 test_util.cc:176] Had fatal failures, leaving test files at /tmp/dist-test-task7WhVb2/test-tmp/rpc-test.6.Parameters_TestRpc.TestCallWithChainCertAndChainCA_SSL_UnixSocket.1790562992244559-1289-0
[ FAILED ] Parameters/TestRpc.TestCallWithChainCertAndChainCA/SSL_UnixSocket, where GetParam() = (true, true) (29 ms)
[ RUN ] Parameters/TestRpc.TestCallWithPasswordProtectedKey/SSL_UnixSocket
I20260928 02:36:32.345641 1351 acceptor_pool.cc:254] collecting diagnostics on the listening RPC socket unix:/tmp/dist-test-task7WhVb2/test-tmp/rpc-test-b61cff2e4d7344499deed0ea8d50f97d.sock every 8 connection(s)
I20260928 02:36:32.345733 1350 acceptor_pool.cc:254] collecting diagnostics on the listening RPC socket unix:/tmp/dist-test-task7WhVb2/test-tmp/rpc-test-b61cff2e4d7344499deed0ea8d50f97d.sock every 8 connection(s)
W20260928 02:36:32.356166 1347 connection.cc:196] Error closing socket: Network error: TlsSocket::Close: Broken pipe
[ OK ] Parameters/TestRpc.TestCallWithPasswordProtectedKey/SSL_UnixSocket (25 ms)
[ RUN ] Parameters/TestRpc.TestCallToBadServer/SSL_UnixSocket
I20260928 02:36:32.379246 1289 rpc-test.cc:394] Status: Network error: Client connection negotiation failed: client connection to 0.0.0.0:0: connect: Connection refused (error 111)
I20260928 02:36:32.379565 1289 rpc-test.cc:394] Status: Network error: Client connection negotiation failed: client connection to 0.0.0.0:0: connect: Connection refused (error 111)
I20260928 02:36:32.379803 1289 rpc-test.cc:394] Status: Network error: Client connection negotiation failed: client connection to 0.0.0.0:0: connect: Connection refused (error 111)
I20260928 02:36:32.379992 1289 rpc-test.cc:394] Status: Network error: Client connection negotiation failed: client connection to 0.0.0.0:0: connect: Connection refused (error 111)
I20260928 02:36:32.380169 1289 rpc-test.cc:394] Status: Network error: Client connection negotiation failed: client connection to 0.0.0.0:0: connect: Connection refused (error 111)
[ OK ] Parameters/TestRpc.TestCallToBadServer/SSL_UnixSocket (23 ms)
[ RUN ] Parameters/TestRpc.TestWrongService/SSL_UnixSocket
I20260928 02:36:32.388123 1385 acceptor_pool.cc:254] collecting diagnostics on the listening RPC socket unix:/tmp/dist-test-task7WhVb2/test-tmp/rpc-test-5d4cbe593a0444f4aeea97c5d50541f4.sock every 8 connection(s)
I20260928 02:36:32.388175 1386 acceptor_pool.cc:254] collecting diagnostics on the listening RPC socket unix:/tmp/dist-test-task7WhVb2/test-tmp/rpc-test-5d4cbe593a0444f4aeea97c5d50541f4.sock every 8 connection(s)
I20260928 02:36:32.407238 1382 messenger.cc:345] service WrongServiceName not registered on TestServer
[ OK ] Parameters/TestRpc.TestWrongService/SSL_UnixSocket (27 ms)
[ RUN ] Parameters/TestRpc.TestConnectionKeepalive/SSL_UnixSocket
I20260928 02:36:32.418429 1408 acceptor_pool.cc:254] collecting diagnostics on the listening RPC socket unix:/tmp/dist-test-task7WhVb2/test-tmp/rpc-test-c503fd9715744e8f889d8a0fdd46ff22.sock every 8 connection(s)
I20260928 02:36:32.418543 1409 acceptor_pool.cc:254] collecting diagnostics on the listening RPC socket unix:/tmp/dist-test-task7WhVb2/test-tmp/rpc-test-c503fd9715744e8f889d8a0fdd46ff22.sock every 8 connection(s)
I20260928 02:36:32.418645 1289 rpc-test.cc:488] Connecting to unix:/tmp/dist-test-task7WhVb2/test-tmp/rpc-test-c503fd9715744e8f889d8a0fdd46ff22.sock
W20260928 02:36:32.909865 1421 connection.cc:196] Error closing socket: Network error: TlsSocket::Close: Broken pipe
[ OK ] Parameters/TestRpc.TestConnectionKeepalive/SSL_UnixSocket (1039 ms)
[ RUN ] Parameters/TestRpc.TestClientConnectionMetrics/SSL_UnixSocket
I20260928 02:36:33.455348 1433 acceptor_pool.cc:254] collecting diagnostics on the listening RPC socket unix:/tmp/dist-test-task7WhVb2/test-tmp/rpc-test-46b553188bc2420ba361dcfe8fe27af5.sock every 8 connection(s)
I20260928 02:36:33.455440 1434 acceptor_pool.cc:254] collecting diagnostics on the listening RPC socket unix:/tmp/dist-test-task7WhVb2/test-tmp/rpc-test-46b553188bc2420ba361dcfe8fe27af5.sock every 8 connection(s)
I20260928 02:36:33.455564 1289 rpc-test.cc:569] Connecting to unix:/tmp/dist-test-task7WhVb2/test-tmp/rpc-test-46b553188bc2420ba361dcfe8fe27af5.sock
W20260928 02:36:41.577041 1430 connection.cc:196] Error closing socket: Network error: TlsSocket::Close: Broken pipe
[ OK ] Parameters/TestRpc.TestClientConnectionMetrics/SSL_UnixSocket (8129 ms)
[ RUN ] Parameters/TestRpc.TestCredentialsPolicy/SSL_UnixSocket
I20260928 02:36:41.599925 1456 acceptor_pool.cc:254] collecting diagnostics on the listening RPC socket unix:/tmp/dist-test-task7WhVb2/test-tmp/rpc-test-ab397bef3b594b06b2d1475f0c60db83.sock every 8 connection(s)
I20260928 02:36:41.599988 1457 acceptor_pool.cc:254] collecting diagnostics on the listening RPC socket unix:/tmp/dist-test-task7WhVb2/test-tmp/rpc-test-ab397bef3b594b06b2d1475f0c60db83.sock every 8 connection(s)
I20260928 02:36:41.600155 1289 rpc-test.cc:700] Connecting to unix:/tmp/dist-test-task7WhVb2/test-tmp/rpc-test-ab397bef3b594b06b2d1475f0c60db83.sock
W20260928 02:36:41.623602 1455 connection.cc:196] Error closing socket: Network error: TlsSocket::Close: Broken pipe
[ OK ] Parameters/TestRpc.TestCredentialsPolicy/SSL_UnixSocket (49 ms)
[ RUN ] Parameters/TestRpc.TestCallLongerThanKeepalive/SSL_UnixSocket
I20260928 02:36:41.636657 1481 acceptor_pool.cc:254] collecting diagnostics on the listening RPC socket unix:/tmp/dist-test-task7WhVb2/test-tmp/rpc-test-f7f8cffc1ad546f280c5a7f92fb6a775.sock every 8 connection(s)
I20260928 02:36:41.636708 1482 acceptor_pool.cc:254] collecting diagnostics on the listening RPC socket unix:/tmp/dist-test-task7WhVb2/test-tmp/rpc-test-f7f8cffc1ad546f280c5a7f92fb6a775.sock every 8 connection(s)
I20260928 02:36:41.649659 1485 rpc-test-base.h:222] got call: sleep_micros: 3000000 deferred: true
I20260928 02:36:44.650390 1485 rpcz_store.cc:275] Call kudu.rpc.GenericCalculatorService.Sleep from unix:<unnamed> (request call id 0) took 3000 ms. Trace:
I20260928 02:36:44.650484 1485 rpcz_store.cc:276] 0928 02:36:41.649611 (+ 0us) service_pool.cc:170] Inserting onto call queue
0928 02:36:41.649643 (+ 32us) service_pool.cc:227] Handling call
0928 02:36:44.650376 (+3000733us) inbound_call.cc:173] Queueing success response
Metrics: {}
[ OK ] Parameters/TestRpc.TestCallLongerThanKeepalive/SSL_UnixSocket (3024 ms)
[ RUN ] Parameters/TestRpc.TestRpcSidecar/SSL_UnixSocket
I20260928 02:36:44.664904 1506 acceptor_pool.cc:254] collecting diagnostics on the listening RPC socket unix:/tmp/dist-test-task7WhVb2/test-tmp/rpc-test-6cf99da2b4344f5fb35b4b7ab5615f8e.sock every 8 connection(s)
I20260928 02:36:44.664955 1507 acceptor_pool.cc:254] collecting diagnostics on the listening RPC socket unix:/tmp/dist-test-task7WhVb2/test-tmp/rpc-test-6cf99da2b4344f5fb35b4b7ab5615f8e.sock every 8 connection(s)
W20260928 02:36:44.704319 1503 connection.cc:196] Error closing socket: Network error: TlsSocket::Close: Broken pipe
[ OK ] Parameters/TestRpc.TestRpcSidecar/SSL_UnixSocket (53 ms)
[ RUN ] Parameters/TestRpc.TestRpcSidecarLimits/SSL_UnixSocket
I20260928 02:36:46.344223 1531 acceptor_pool.cc:254] collecting diagnostics on the listening RPC socket unix:/tmp/dist-test-task7WhVb2/test-tmp/rpc-test-c2128d38833642cca376a80e1d87e617.sock every 8 connection(s)
I20260928 02:36:46.344297 1532 acceptor_pool.cc:254] collecting diagnostics on the listening RPC socket unix:/tmp/dist-test-task7WhVb2/test-tmp/rpc-test-c2128d38833642cca376a80e1d87e617.sock every 8 connection(s)
W20260928 02:36:46.367863 1289 serialization.cc:72] Serialized kudu.rpc_test.PushStringsRequestPB (2147483654 bytes) is larger than the maximum configured RPC message size (52428800 bytes). Sending anyway, but peer may reject the data.
W20260928 02:36:46.370606 1528 connection.cc:535] server connection from unix:<unnamed> recv error: Network error: RPC frame had a length of 2147483714, but we only support messages up to 52428800 bytes long.
W20260928 02:36:46.370669 1528 connection.cc:158] shutting down server connection from unix:<unnamed> with pending inbound data: 4/2147483714 bytes received; last active 0 ns ago: status Network error: RPC frame had a length of 2147483714, but we only support messages up to 52428800 bytes long.
W20260928 02:36:46.370834 1544 connection.cc:196] Error closing socket: Network error: TlsSocket::Close: Broken pipe
I20260928 02:36:46.382023 1556 acceptor_pool.cc:254] collecting diagnostics on the listening RPC socket unix:/tmp/dist-test-task7WhVb2/test-tmp/rpc-test-c2128d38833642cca376a80e1d87e617.sock every 8 connection(s)
I20260928 02:36:46.382038 1557 acceptor_pool.cc:254] collecting diagnostics on the listening RPC socket unix:/tmp/dist-test-task7WhVb2/test-tmp/rpc-test-c2128d38833642cca376a80e1d87e617.sock every 8 connection(s)
W20260928 02:36:50.790836 1553 connection.cc:577] server connection from unix:<unnamed>: received bad data: 'Corruption: Invalid packet: message had a length of 2147483710, but we only support messages up to 2147483647 bytes
'
W20260928 02:36:50.791118 1569 connection.cc:196] Error closing socket: Network error: TlsSocket::Close: Broken pipe
[ OK ] Parameters/TestRpc.TestRpcSidecarLimits/SSL_UnixSocket (6087 ms)
[ RUN ] Parameters/TestRpc.TestCallTimeoutDoesntAffectNegotiation/SSL_UnixSocket
I20260928 02:36:50.813113 1581 acceptor_pool.cc:254] collecting diagnostics on the listening RPC socket unix:/tmp/dist-test-task7WhVb2/test-tmp/rpc-test-7218c243a70c490d859015513b1a34ee.sock every 8 connection(s)
I20260928 02:36:50.813169 1582 acceptor_pool.cc:254] collecting diagnostics on the listening RPC socket unix:/tmp/dist-test-task7WhVb2/test-tmp/rpc-test-7218c243a70c490d859015513b1a34ee.sock every 8 connection(s)
W20260928 02:36:50.824626 1577 negotiation.cc:266] Injecting 500ms delay in negotiation
I20260928 02:36:50.874886 1289 rpc-test-base.h:595] status: Timed out: connection negotiation to unix:/tmp/dist-test-task7WhVb2/test-tmp/rpc-test-7218c243a70c490d859015513b1a34ee.sock for RPC Sleep timed out after 0.050s (ON_OUTBOUND_QUEUE), seconds elapsed: 0.0504681
[ OK ] Parameters/TestRpc.TestCallTimeoutDoesntAffectNegotiation/SSL_UnixSocket (536 ms)
[ RUN ] Parameters/TestRpc.TestRpcHandlerLatencyMetric/SSL_UnixSocket
I20260928 02:36:51.346145 1606 acceptor_pool.cc:254] collecting diagnostics on the listening RPC socket unix:/tmp/dist-test-task7WhVb2/test-tmp/rpc-test-14a044613dbc463793f8e17e57bbd87f.sock every 8 connection(s)
I20260928 02:36:51.346189 1607 acceptor_pool.cc:254] collecting diagnostics on the listening RPC socket unix:/tmp/dist-test-task7WhVb2/test-tmp/rpc-test-14a044613dbc463793f8e17e57bbd87f.sock every 8 connection(s)
I20260928 02:36:51.389441 1289 rpc-test.cc:1236] Sleep() min lat: 20254
I20260928 02:36:51.389503 1289 rpc-test.cc:1237] Sleep() mean lat: 20254
I20260928 02:36:51.389526 1289 rpc-test.cc:1238] Sleep() max lat: 20254
I20260928 02:36:51.389540 1289 rpc-test.cc:1239] Sleep() #calls: 1
W20260928 02:36:51.390043 1603 connection.cc:196] Error closing socket: Network error: TlsSocket::Close: Broken pipe
[ OK ] Parameters/TestRpc.TestRpcHandlerLatencyMetric/SSL_UnixSocket (62 ms)
[ RUN ] Parameters/TestRpc.TimedOutOnResponseMetricServiceQueue/SSL_UnixSocket
I20260928 02:36:51.406400 1632 acceptor_pool.cc:254] collecting diagnostics on the listening RPC socket unix:/tmp/dist-test-task7WhVb2/test-tmp/rpc-test-aede4af931124f839913edcdc09de0a7.sock every 8 connection(s)
I20260928 02:36:51.406433 1633 acceptor_pool.cc:254] collecting diagnostics on the listening RPC socket unix:/tmp/dist-test-task7WhVb2/test-tmp/rpc-test-aede4af931124f839913edcdc09de0a7.sock every 8 connection(s)
W20260928 02:36:51.459384 1634 rpcz_store.cc:267] Call kudu.rpc_test.CalculatorService.Sleep from unix:<unnamed> (request call id 2) took 20 ms (client timeout 20 ms). Trace:
W20260928 02:36:51.459488 1634 rpcz_store.cc:269] 0928 02:36:51.439200 (+ 0us) service_pool.cc:170] Inserting onto call queue
0928 02:36:51.459367 (+ 20167us) service_pool.cc:214] Skipping call since client already timed out
0928 02:36:51.459375 (+ 8us) inbound_call.cc:173] Queueing failure response
Metrics: {}
[ OK ] Parameters/TestRpc.TimedOutOnResponseMetricServiceQueue/SSL_UnixSocket (68 ms)
[ RUN ] Parameters/TestRpc.RpcPendingConnectionsMetric/SSL_UnixSocket
I20260928 02:36:51.462523 1655 acceptor_pool.cc:254] collecting diagnostics on the listening RPC socket 0.0.0.0:43357 every 8 connection(s)
I20260928 02:36:51.462590 1656 acceptor_pool.cc:254] collecting diagnostics on the listening RPC socket 0.0.0.0:43357 every 8 connection(s)
W20260928 02:36:51.472124 1651 negotiation.cc:337] Failed RPC negotiation. Trace:
0928 02:36:51.471869 (+ 0us) reactor.cc:625] Submitting negotiation task for server connection from 127.0.0.1:58424 (local address 127.0.0.1:43357)
0928 02:36:51.471930 (+ 61us) server_negotiation.cc:206] Beginning negotiation
0928 02:36:51.471932 (+ 2us) server_negotiation.cc:399] Waiting for connection header
0928 02:36:51.472037 (+ 105us) negotiation.cc:327] Negotiation complete: Network error: Server connection negotiation failed: server connection from 127.0.0.1:58424: BlockingRecv error: recv got EOF from 127.0.0.1:58424 (error 108)
Metrics: {"server-negotiator.queue_time_us":33}
[ OK ] Parameters/TestRpc.RpcPendingConnectionsMetric/SSL_UnixSocket (22 ms)
[ RUN ] Parameters/TestRpc.TestRpcContextClientDeadline/SSL_UnixSocket
I20260928 02:36:51.514133 1671 acceptor_pool.cc:254] collecting diagnostics on the listening RPC socket unix:/tmp/dist-test-task7WhVb2/test-tmp/rpc-test-9383b890db5143c99e51671b1b44facf.sock every 8 connection(s)
I20260928 02:36:51.514159 1672 acceptor_pool.cc:254] collecting diagnostics on the listening RPC socket unix:/tmp/dist-test-task7WhVb2/test-tmp/rpc-test-9383b890db5143c99e51671b1b44facf.sock every 8 connection(s)
W20260928 02:36:51.552743 1668 connection.cc:196] Error closing socket: Network error: TlsSocket::Close: Broken pipe
[ OK ] Parameters/TestRpc.TestRpcContextClientDeadline/SSL_UnixSocket (70 ms)
[ RUN ] Parameters/TestRpc.TestApplicationFeatureFlagUnsupportedServer/SSL_UnixSocket
I20260928 02:36:51.571116 1696 acceptor_pool.cc:254] collecting diagnostics on the listening RPC socket unix:/tmp/dist-test-task7WhVb2/test-tmp/rpc-test-22f3657ed8774d59b06cabae9502ca07.sock every 8 connection(s)
I20260928 02:36:51.571166 1697 acceptor_pool.cc:254] collecting diagnostics on the listening RPC socket unix:/tmp/dist-test-task7WhVb2/test-tmp/rpc-test-22f3657ed8774d59b06cabae9502ca07.sock every 8 connection(s)
W20260928 02:36:51.592358 1693 connection.cc:196] Error closing socket: Network error: TlsSocket::Close: Broken pipe
[ OK ] Parameters/TestRpc.TestApplicationFeatureFlagUnsupportedServer/SSL_UnixSocket (39 ms)
[ RUN ] Parameters/TestRpc.TestCancellationAsync/SSL_UnixSocket
I20260928 02:36:51.599927 1721 acceptor_pool.cc:254] collecting diagnostics on the listening RPC socket unix:/tmp/dist-test-task7WhVb2/test-tmp/rpc-test-c8a3457608d842feb5f40ad9a82b3d49.sock every 8 connection(s)
I20260928 02:36:51.599975 1722 acceptor_pool.cc:254] collecting diagnostics on the listening RPC socket unix:/tmp/dist-test-task7WhVb2/test-tmp/rpc-test-c8a3457608d842feb5f40ad9a82b3d49.sock every 8 connection(s)
I20260928 02:36:51.600121 1289 rpc-test.cc:1716] Connecting to unix:/tmp/dist-test-task7WhVb2/test-tmp/rpc-test-c8a3457608d842feb5f40ad9a82b3d49.sock
I20260928 02:36:51.618057 1289 test_util.cc:268] Using random seed: -264149754
I20260928 02:36:51.634126 1725 rpc-test-base.h:240] got call: sleep_micros: 500 pattern: 4294967295 num_repetitions: 2097152 sidecar_idx: 0
I20260928 02:36:51.644570 1725 rpc-test-base.h:240] got call: sleep_micros: 500 pattern: 4294967295 num_repetitions: 2097152 sidecar_idx: 0
I20260928 02:36:51.654505 1725 rpc-test-base.h:240] got call: sleep_micros: 500 pattern: 4294967295 num_repetitions: 2097152 sidecar_idx: 0
I20260928 02:36:51.664570 1725 rpc-test-base.h:240] got call: sleep_micros: 500 pattern: 4294967295 num_repetitions: 2097152 sidecar_idx: 0
I20260928 02:36:51.674263 1725 rpc-test-base.h:240] got call: sleep_micros: 500 pattern: 4294967295 num_repetitions: 2097152 sidecar_idx: 0
I20260928 02:36:51.684018 1725 rpc-test-base.h:240] got call: sleep_micros: 500 pattern: 4294967295 num_repetitions: 2097152 sidecar_idx: 0
I20260928 02:36:51.693929 1725 rpc-test-base.h:240] got call: sleep_micros: 500 pattern: 4294967295 num_repetitions: 2097152 sidecar_idx: 0
I20260928 02:36:51.703428 1725 rpc-test-base.h:240] got call: sleep_micros: 500 pattern: 4294967295 num_repetitions: 2097152 sidecar_idx: 0
W20260928 02:36:51.704589 1718 connection.cc:196] Error closing socket: Network error: TlsSocket::Close: Broken pipe
W20260928 02:36:51.706367 1718 connection.cc:441] server connection from unix:<unnamed> torn down before Call kudu.rpc.GenericCalculatorService.SleepWithSidecar from unix:<unnamed> (request call id 9) could send its response
[ OK ] Parameters/TestRpc.TestCancellationAsync/SSL_UnixSocket (114 ms)
[ RUN ] Parameters/TestRpc.TestPerformanceBySocketType/SSL_UnixSocket
I20260928 02:36:51.733507 1746 acceptor_pool.cc:254] collecting diagnostics on the listening RPC socket unix:/tmp/dist-test-task7WhVb2/test-tmp/rpc-test-362f3f93c0b845c2a3b3d1ec53a21f71.sock every 8 connection(s)
I20260928 02:36:51.733553 1747 acceptor_pool.cc:254] collecting diagnostics on the listening RPC socket unix:/tmp/dist-test-task7WhVb2/test-tmp/rpc-test-362f3f93c0b845c2a3b3d1ec53a21f71.sock every 8 connection(s)
I20260928 02:36:51.733713 1289 rpc-test.cc:1846] Connecting to unix:/tmp/dist-test-task7WhVb2/test-tmp/rpc-test-362f3f93c0b845c2a3b3d1ec53a21f71.sock
I20260928 02:36:52.935254 1289 rpc-test.cc:1859] Sending 1024MB via ssl-enabled unix socket: real 1.169s user 1.288s sys 0.836s
I20260928 02:36:54.081339 1289 rpc-test.cc:1859] Sending 1024MB via ssl-enabled unix socket: real 1.146s user 1.284s sys 0.802s
I20260928 02:36:55.207630 1289 rpc-test.cc:1859] Sending 1024MB via ssl-enabled unix socket: real 1.126s user 1.196s sys 0.855s
I20260928 02:36:56.376083 1289 rpc-test.cc:1859] Sending 1024MB via ssl-enabled unix socket: real 1.168s user 1.256s sys 0.871s
I20260928 02:36:57.536055 1289 rpc-test.cc:1859] Sending 1024MB via ssl-enabled unix socket: real 1.160s user 1.236s sys 0.878s
W20260928 02:36:57.536793 1743 connection.cc:196] Error closing socket: Network error: TlsSocket::Close: Broken pipe
[ OK ] Parameters/TestRpc.TestPerformanceBySocketType/SSL_UnixSocket (5830 ms)
[----------] 20 tests from Parameters/TestRpc (25291 ms total)
[----------] 1 test from Parameters/TestRpcSocketTxRxQueue
[ RUN ] Parameters/TestRpcSocketTxRxQueue.AcceptorRxQueueSizeMetric/0
I20260928 02:36:57.543982 1771 acceptor_pool.cc:254] collecting diagnostics on the listening RPC socket 0.0.0.0:43525 every 1 connection(s)
I20260928 02:36:57.544040 1772 acceptor_pool.cc:254] collecting diagnostics on the listening RPC socket 0.0.0.0:43525 every 1 connection(s)
W20260928 02:36:57.544550 1767 negotiation.cc:337] Failed RPC negotiation. Trace:
0928 02:36:57.544413 (+ 0us) reactor.cc:625] Submitting negotiation task for server connection from 127.0.0.1:40770 (local address 127.0.0.1:43525)
0928 02:36:57.544463 (+ 50us) server_negotiation.cc:206] Beginning negotiation
0928 02:36:57.544465 (+ 2us) server_negotiation.cc:399] Waiting for connection header
0928 02:36:57.544521 (+ 56us) negotiation.cc:327] Negotiation complete: Network error: Server connection negotiation failed: server connection from 127.0.0.1:40770: BlockingRecv error: recv got EOF from 127.0.0.1:40770 (error 108)
Metrics: {"server-negotiator.queue_time_us":16}
[ OK ] Parameters/TestRpcSocketTxRxQueue.AcceptorRxQueueSizeMetric/0 (7 ms)
[----------] 1 test from Parameters/TestRpcSocketTxRxQueue (7 ms total)
[----------] Global test environment tear-down
[==========] 21 tests from 2 test suites ran. (25299 ms total)
[ PASSED ] 20 tests.
[ FAILED ] 1 test, listed below:
[ FAILED ] Parameters/TestRpc.TestCallWithChainCertAndChainCA/SSL_UnixSocket, where GetParam() = (true, true)
1 FAILED TEST