Diagnosed failure

Parameters/TestRpc.TestCallWithChainCertAndChainCA/SSL_TCP: /data0/somelongdirectorytoavoidrpathissues/src/kudu/src/kudu/rpc/rpc-test.cc:270: Failure
Failed
Bad status: Runtime error: could not verify certificate chain (error with cert: subject=CN = localhost, ST = sadfjas, C = AS, emailAddress = sdflkdsajf, O = lskdfjlsad, OU = sldfkja, issuer=C = AS, ST = ASDfkjdhf, L = lskdjf, O = saldfja, OU = skdjf, CN = localhost, emailAddress = sadjflkadsj): : certificate has expired
Google Test trace:
/data0/somelongdirectorytoavoidrpathissues/src/kudu/src/kudu/rpc/rpc-test.cc:267: Connecting to 0.0.0.0:41163
I20260923 19:31:18.397387   379 test_util.cc:175] -----------------------------------------------
I20260923 19:31:18.397491   379 test_util.cc:176] Had fatal failures, leaving test files at /tmp/dist-test-taskaEhW13/test-tmp/rpc-test.5.Parameters_TestRpc.TestCallWithChainCertAndChainCA_SSL_TCP.1790191878264881-379-0

Full log

Note: This is test shard 6 of 8.
[==========] Running 21 tests from 2 test suites.
[----------] Global test environment set-up.
[----------] 20 tests from Parameters/TestRpc
[ RUN      ] Parameters/TestRpc.TestMessengerCreateDestroy/SSL_TCP
WARNING: Logging before InitGoogleLogging() is written to STDERR
I20260923 19:31:18.312474   379 rpc-test.cc:169] started messenger TestCreateDestroy
[       OK ] Parameters/TestRpc.TestMessengerCreateDestroy/SSL_TCP (29 ms)
[ RUN      ] Parameters/TestRpc.TestNegotiationDeadlock/SSL_TCP
I20260923 19:31:18.344085   399 acceptor_pool.cc:254] collecting diagnostics on the listening RPC socket 0.0.0.0:40347 every 8 connection(s)
I20260923 19:31:18.344303   400 acceptor_pool.cc:254] collecting diagnostics on the listening RPC socket 0.0.0.0:40347 every 8 connection(s)
[       OK ] Parameters/TestRpc.TestNegotiationDeadlock/SSL_TCP (49 ms)
[ RUN      ] Parameters/TestRpc.TestCallWithChainCertAndChainCA/SSL_TCP
I20260923 19:31:18.385085   415 acceptor_pool.cc:254] collecting diagnostics on the listening RPC socket 0.0.0.0:41163 every 8 connection(s)
I20260923 19:31:18.385380   416 acceptor_pool.cc:254] collecting diagnostics on the listening RPC socket 0.0.0.0:41163 every 8 connection(s)
/data0/somelongdirectorytoavoidrpathissues/src/kudu/src/kudu/rpc/rpc-test.cc:270: Failure
Failed
Bad status: Runtime error: could not verify certificate chain (error with cert: subject=CN = localhost, ST = sadfjas, C = AS, emailAddress = sdflkdsajf, O = lskdfjlsad, OU = sldfkja, issuer=C = AS, ST = ASDfkjdhf, L = lskdjf, O = saldfja, OU = skdjf, CN = localhost, emailAddress = sadjflkadsj): : certificate has expired
Google Test trace:
/data0/somelongdirectorytoavoidrpathissues/src/kudu/src/kudu/rpc/rpc-test.cc:267: Connecting to 0.0.0.0:41163
I20260923 19:31:18.397387   379 test_util.cc:175] -----------------------------------------------
I20260923 19:31:18.397491   379 test_util.cc:176] Had fatal failures, leaving test files at /tmp/dist-test-taskaEhW13/test-tmp/rpc-test.5.Parameters_TestRpc.TestCallWithChainCertAndChainCA_SSL_TCP.1790191878264881-379-0
[  FAILED  ] Parameters/TestRpc.TestCallWithChainCertAndChainCA/SSL_TCP, where GetParam() = (true, false) (32 ms)
[ RUN      ] Parameters/TestRpc.TestCallWithPasswordProtectedKey/SSL_TCP
I20260923 19:31:18.423209   440 acceptor_pool.cc:254] collecting diagnostics on the listening RPC socket 0.0.0.0:34559 every 8 connection(s)
I20260923 19:31:18.423451   441 acceptor_pool.cc:254] collecting diagnostics on the listening RPC socket 0.0.0.0:34559 every 8 connection(s)
[       OK ] Parameters/TestRpc.TestCallWithPasswordProtectedKey/SSL_TCP (61 ms)
[ RUN      ] Parameters/TestRpc.TestCallToBadServer/SSL_TCP
I20260923 19:31:18.469923   379 rpc-test.cc:394] Status: Network error: Client connection negotiation failed: client connection to 0.0.0.0:0: connect: Connection refused (error 111)
I20260923 19:31:18.470830   379 rpc-test.cc:394] Status: Network error: Client connection negotiation failed: client connection to 0.0.0.0:0: connect: Connection refused (error 111)
I20260923 19:31:18.471670   379 rpc-test.cc:394] Status: Network error: Client connection negotiation failed: client connection to 0.0.0.0:0: connect: Connection refused (error 111)
I20260923 19:31:18.472477   379 rpc-test.cc:394] Status: Network error: Client connection negotiation failed: client connection to 0.0.0.0:0: connect: Connection refused (error 111)
I20260923 19:31:18.473097   379 rpc-test.cc:394] Status: Network error: Client connection negotiation failed: client connection to 0.0.0.0:0: connect: Connection refused (error 111)
[       OK ] Parameters/TestRpc.TestCallToBadServer/SSL_TCP (15 ms)
[ RUN      ] Parameters/TestRpc.TestWrongService/SSL_TCP
I20260923 19:31:18.491858   475 acceptor_pool.cc:254] collecting diagnostics on the listening RPC socket 0.0.0.0:40065 every 8 connection(s)
I20260923 19:31:18.492169   476 acceptor_pool.cc:254] collecting diagnostics on the listening RPC socket 0.0.0.0:40065 every 8 connection(s)
I20260923 19:31:18.512125   472 messenger.cc:345] service WrongServiceName not registered on TestServer
[       OK ] Parameters/TestRpc.TestWrongService/SSL_TCP (42 ms)
[ RUN      ] Parameters/TestRpc.TestConnectionKeepalive/SSL_TCP
I20260923 19:31:18.534948   498 acceptor_pool.cc:254] collecting diagnostics on the listening RPC socket 0.0.0.0:35647 every 8 connection(s)
I20260923 19:31:18.535213   499 acceptor_pool.cc:254] collecting diagnostics on the listening RPC socket 0.0.0.0:35647 every 8 connection(s)
I20260923 19:31:18.536257   379 rpc-test.cc:488] Connecting to 0.0.0.0:35647
[       OK ] Parameters/TestRpc.TestConnectionKeepalive/SSL_TCP (1063 ms)
[ RUN      ] Parameters/TestRpc.TestClientConnectionMetrics/SSL_TCP
I20260923 19:31:19.606280   523 acceptor_pool.cc:254] collecting diagnostics on the listening RPC socket 0.0.0.0:41193 every 8 connection(s)
I20260923 19:31:19.606639   524 acceptor_pool.cc:254] collecting diagnostics on the listening RPC socket 0.0.0.0:41193 every 8 connection(s)
I20260923 19:31:19.607771   379 rpc-test.cc:569] Connecting to 0.0.0.0:41193
[       OK ] Parameters/TestRpc.TestClientConnectionMetrics/SSL_TCP (20463 ms)
[ RUN      ] Parameters/TestRpc.TestCredentialsPolicy/SSL_TCP
I20260923 19:31:40.070564   546 acceptor_pool.cc:254] collecting diagnostics on the listening RPC socket 0.0.0.0:43547 every 8 connection(s)
I20260923 19:31:40.070827   547 acceptor_pool.cc:254] collecting diagnostics on the listening RPC socket 0.0.0.0:43547 every 8 connection(s)
I20260923 19:31:40.071893   379 rpc-test.cc:700] Connecting to 0.0.0.0:43547
[       OK ] Parameters/TestRpc.TestCredentialsPolicy/SSL_TCP (84 ms)
[ RUN      ] Parameters/TestRpc.TestCallLongerThanKeepalive/SSL_TCP
I20260923 19:31:40.146072   571 acceptor_pool.cc:254] collecting diagnostics on the listening RPC socket 0.0.0.0:34895 every 8 connection(s)
I20260923 19:31:40.146276   572 acceptor_pool.cc:254] collecting diagnostics on the listening RPC socket 0.0.0.0:34895 every 8 connection(s)
I20260923 19:31:40.164299   575 rpc-test-base.h:222] got call: sleep_micros: 3000000 deferred: true
I20260923 19:31:43.166123   575 rpcz_store.cc:275] Call kudu.rpc.GenericCalculatorService.Sleep from 127.0.0.1:48808 (request call id 0) took 3001 ms. Trace:
I20260923 19:31:43.166308   575 rpcz_store.cc:276] 0923 19:31:40.164179 (+     0us) service_pool.cc:170] Inserting onto call queue
0923 19:31:40.164248 (+    69us) service_pool.cc:227] Handling call
0923 19:31:43.166072 (+3001824us) inbound_call.cc:173] Queueing success response
Metrics: {}
[       OK ] Parameters/TestRpc.TestCallLongerThanKeepalive/SSL_TCP (3043 ms)
[ RUN      ] Parameters/TestRpc.TestRpcSidecar/SSL_TCP
I20260923 19:31:43.205160   596 acceptor_pool.cc:254] collecting diagnostics on the listening RPC socket 0.0.0.0:33631 every 8 connection(s)
I20260923 19:31:43.205518   597 acceptor_pool.cc:254] collecting diagnostics on the listening RPC socket 0.0.0.0:33631 every 8 connection(s)
[       OK ] Parameters/TestRpc.TestRpcSidecar/SSL_TCP (139 ms)
[ RUN      ] Parameters/TestRpc.TestRpcSidecarLimits/SSL_TCP
I20260923 19:31:45.549978   621 acceptor_pool.cc:254] collecting diagnostics on the listening RPC socket 0.0.0.0:42903 every 8 connection(s)
I20260923 19:31:45.550382   622 acceptor_pool.cc:254] collecting diagnostics on the listening RPC socket 0.0.0.0:42903 every 8 connection(s)
W20260923 19:31:45.569849   379 serialization.cc:72] Serialized kudu.rpc_test.PushStringsRequestPB (2147483654 bytes) is larger than the maximum configured RPC message size (52428800 bytes). Sending anyway, but peer may reject the data.
W20260923 19:31:45.576582   620 connection.cc:535] server connection from 127.0.0.1:41928 recv error: Network error: RPC frame had a length of 2147483714, but we only support messages up to 52428800 bytes long.
W20260923 19:31:45.576769   620 connection.cc:158] shutting down server connection from 127.0.0.1:41928 with pending inbound data: 4/2147483714 bytes received; last active 0 ns ago: status Network error: RPC frame had a length of 2147483714, but we only support messages up to 52428800 bytes long.
W20260923 19:31:45.577303   634 connection.cc:196] Error closing socket: Network error: TlsSocket::Close: Connection reset by peer
I20260923 19:31:45.604652   646 acceptor_pool.cc:254] collecting diagnostics on the listening RPC socket 0.0.0.0:38881 every 8 connection(s)
I20260923 19:31:45.604928   647 acceptor_pool.cc:254] collecting diagnostics on the listening RPC socket 0.0.0.0:38881 every 8 connection(s)
W20260923 19:31:51.243088   645 connection.cc:577] server connection from 127.0.0.1:37136: received bad data: 'Corruption: Invalid packet: message had a length of 2147483710, but we only support messages up to 2147483647 bytes
'
[       OK ] Parameters/TestRpc.TestRpcSidecarLimits/SSL_TCP (8422 ms)
[ RUN      ] Parameters/TestRpc.TestCallTimeoutDoesntAffectNegotiation/SSL_TCP
I20260923 19:31:51.749817   671 acceptor_pool.cc:254] collecting diagnostics on the listening RPC socket 0.0.0.0:38457 every 8 connection(s)
I20260923 19:31:51.750025   672 acceptor_pool.cc:254] collecting diagnostics on the listening RPC socket 0.0.0.0:38457 every 8 connection(s)
W20260923 19:31:51.766566   667 negotiation.cc:266] Injecting 500ms delay in negotiation
I20260923 19:31:51.817204   379 rpc-test-base.h:595] status: Timed out: connection negotiation to 0.0.0.0:38457 for RPC Sleep timed out after 0.050s (ON_OUTBOUND_QUEUE), seconds elapsed: 0.0513531
[       OK ] Parameters/TestRpc.TestCallTimeoutDoesntAffectNegotiation/SSL_TCP (542 ms)
[ RUN      ] Parameters/TestRpc.TestRpcHandlerLatencyMetric/SSL_TCP
I20260923 19:31:52.299629   696 acceptor_pool.cc:254] collecting diagnostics on the listening RPC socket 0.0.0.0:44071 every 8 connection(s)
I20260923 19:31:52.299906   697 acceptor_pool.cc:254] collecting diagnostics on the listening RPC socket 0.0.0.0:44071 every 8 connection(s)
I20260923 19:31:52.344648   379 rpc-test.cc:1236] Sleep() min lat: 20654
I20260923 19:31:52.344738   379 rpc-test.cc:1237] Sleep() mean lat: 20654
I20260923 19:31:52.344813   379 rpc-test.cc:1238] Sleep() max lat: 20654
I20260923 19:31:52.344863   379 rpc-test.cc:1239] Sleep() #calls: 1
[       OK ] Parameters/TestRpc.TestRpcHandlerLatencyMetric/SSL_TCP (71 ms)
[ RUN      ] Parameters/TestRpc.TimedOutOnResponseMetricServiceQueue/SSL_TCP
I20260923 19:31:52.363955   722 acceptor_pool.cc:254] collecting diagnostics on the listening RPC socket 0.0.0.0:33571 every 8 connection(s)
I20260923 19:31:52.364214   723 acceptor_pool.cc:254] collecting diagnostics on the listening RPC socket 0.0.0.0:33571 every 8 connection(s)
W20260923 19:31:52.426599   724 rpcz_store.cc:267] Call kudu.rpc_test.CalculatorService.Sleep from 127.0.0.1:54608 (request call id 2) took 20 ms (client timeout 20 ms). Trace:
W20260923 19:31:52.426844   724 rpcz_store.cc:269] 0923 19:31:52.406199 (+     0us) service_pool.cc:170] Inserting onto call queue
0923 19:31:52.426513 (+ 20314us) service_pool.cc:214] Skipping call since client already timed out
0923 19:31:52.426579 (+    66us) inbound_call.cc:173] Queueing failure response
Metrics: {}
[       OK ] Parameters/TestRpc.TimedOutOnResponseMetricServiceQueue/SSL_TCP (81 ms)
[ RUN      ] Parameters/TestRpc.RpcPendingConnectionsMetric/SSL_TCP
I20260923 19:31:52.436461   745 acceptor_pool.cc:254] collecting diagnostics on the listening RPC socket 0.0.0.0:33515 every 8 connection(s)
I20260923 19:31:52.436673   746 acceptor_pool.cc:254] collecting diagnostics on the listening RPC socket 0.0.0.0:33515 every 8 connection(s)
W20260923 19:31:52.447420   741 negotiation.cc:337] Failed RPC negotiation. Trace:
0923 19:31:52.446733 (+     0us) reactor.cc:625] Submitting negotiation task for server connection from 127.0.0.1:43840 (local address 127.0.0.1:33515)
0923 19:31:52.446923 (+   190us) server_negotiation.cc:206] Beginning negotiation
0923 19:31:52.446928 (+     5us) server_negotiation.cc:399] Waiting for connection header
0923 19:31:52.447084 (+   156us) negotiation.cc:327] Negotiation complete: Network error: Server connection negotiation failed: server connection from 127.0.0.1:43840: BlockingRecv error: recv got EOF from 127.0.0.1:43840 (error 108)
Metrics: {"server-negotiator.queue_time_us":62}
[       OK ] Parameters/TestRpc.RpcPendingConnectionsMetric/SSL_TCP (28 ms)
[ RUN      ] Parameters/TestRpc.TestRpcContextClientDeadline/SSL_TCP
I20260923 19:31:52.491523   761 acceptor_pool.cc:254] collecting diagnostics on the listening RPC socket 0.0.0.0:38805 every 8 connection(s)
I20260923 19:31:52.491755   762 acceptor_pool.cc:254] collecting diagnostics on the listening RPC socket 0.0.0.0:38805 every 8 connection(s)
[       OK ] Parameters/TestRpc.TestRpcContextClientDeadline/SSL_TCP (73 ms)
[ RUN      ] Parameters/TestRpc.TestApplicationFeatureFlagUnsupportedServer/SSL_TCP
I20260923 19:31:52.558418   786 acceptor_pool.cc:254] collecting diagnostics on the listening RPC socket 0.0.0.0:46731 every 8 connection(s)
I20260923 19:31:52.558677   787 acceptor_pool.cc:254] collecting diagnostics on the listening RPC socket 0.0.0.0:46731 every 8 connection(s)
[       OK ] Parameters/TestRpc.TestApplicationFeatureFlagUnsupportedServer/SSL_TCP (53 ms)
[ RUN      ] Parameters/TestRpc.TestCancellationAsync/SSL_TCP
I20260923 19:31:52.621207   811 acceptor_pool.cc:254] collecting diagnostics on the listening RPC socket 0.0.0.0:42841 every 8 connection(s)
I20260923 19:31:52.621491   812 acceptor_pool.cc:254] collecting diagnostics on the listening RPC socket 0.0.0.0:42841 every 8 connection(s)
I20260923 19:31:52.622393   379 rpc-test.cc:1716] Connecting to 0.0.0.0:42841
I20260923 19:31:52.632454   379 test_util.cc:268] Using random seed: -1995947934
I20260923 19:31:52.671104   815 rpc-test-base.h:240] got call: sleep_micros: 500 pattern: 4294967295 num_repetitions: 2097152 sidecar_idx: 0
I20260923 19:31:52.692929   814 rpc-test-base.h:240] got call: sleep_micros: 500 pattern: 4294967295 num_repetitions: 2097152 sidecar_idx: 0
I20260923 19:31:52.718629   813 rpc-test-base.h:240] got call: sleep_micros: 500 pattern: 4294967295 num_repetitions: 2097152 sidecar_idx: 0
I20260923 19:31:52.758996   814 rpc-test-base.h:240] got call: sleep_micros: 500 pattern: 4294967295 num_repetitions: 2097152 sidecar_idx: 0
I20260923 19:31:52.792215   813 rpc-test-base.h:240] got call: sleep_micros: 500 pattern: 4294967295 num_repetitions: 2097152 sidecar_idx: 0
I20260923 19:31:52.828366   814 rpc-test-base.h:240] got call: sleep_micros: 500 pattern: 4294967295 num_repetitions: 2097152 sidecar_idx: 0
W20260923 19:31:52.856223   810 connection.cc:196] Error closing socket: Network error: TlsSocket::Close: Broken pipe
W20260923 19:31:52.857561   810 connection.cc:441] server connection from 127.0.0.1:41026 torn down before Call kudu.rpc.GenericCalculatorService.SleepWithSidecar from 127.0.0.1:41026 (request call id 7) could send its response
W20260923 19:31:52.867589   810 connection.cc:441] server connection from 127.0.0.1:41026 torn down before Call kudu.rpc.GenericCalculatorService.SleepWithSidecar from 127.0.0.1:41026 (request call id 8) could send its response
[       OK ] Parameters/TestRpc.TestCancellationAsync/SSL_TCP (283 ms)
[ RUN      ] Parameters/TestRpc.TestPerformanceBySocketType/SSL_TCP
I20260923 19:31:52.910598   836 acceptor_pool.cc:254] collecting diagnostics on the listening RPC socket 0.0.0.0:41487 every 8 connection(s)
I20260923 19:31:52.910840   837 acceptor_pool.cc:254] collecting diagnostics on the listening RPC socket 0.0.0.0:41487 every 8 connection(s)
I20260923 19:31:52.911806   379 rpc-test.cc:1846] Connecting to 0.0.0.0:41487
I20260923 19:31:56.050945   379 rpc-test.cc:1859] Sending 1024MB via ssl-enabled tcp socket: real 3.126s	user 2.929s	sys 2.294s
I20260923 19:31:59.214541   379 rpc-test.cc:1859] Sending 1024MB via ssl-enabled tcp socket: real 3.163s	user 2.965s	sys 2.275s
I20260923 19:32:02.437129   379 rpc-test.cc:1859] Sending 1024MB via ssl-enabled tcp socket: real 3.222s	user 3.040s	sys 2.374s
I20260923 19:32:05.526908   379 rpc-test.cc:1859] Sending 1024MB via ssl-enabled tcp socket: real 3.090s	user 2.860s	sys 2.256s
I20260923 19:32:08.716564   379 rpc-test.cc:1859] Sending 1024MB via ssl-enabled tcp socket: real 3.189s	user 2.871s	sys 2.449s
[       OK ] Parameters/TestRpc.TestPerformanceBySocketType/SSL_TCP (15853 ms)
[----------] 20 tests from Parameters/TestRpc (50438 ms total)

[----------] 1 test from Parameters/TestRpcSocketTxRxQueue
[ RUN      ] Parameters/TestRpcSocketTxRxQueue.OverCapacity/0
W20260923 19:32:09.035794   880 negotiation.cc:337] Failed RPC negotiation. Trace:
0923 19:32:08.745262 (+     0us) reactor.cc:625] Submitting negotiation task for client connection to 0.0.0.0:36311 (local address 127.0.0.1:58088)
0923 19:32:08.745484 (+   222us) negotiation.cc:107] Waiting for socket to connect
0923 19:32:08.745502 (+    18us) client_negotiation.cc:174] Beginning negotiation
0923 19:32:08.745620 (+   118us) client_negotiation.cc:252] Sending NEGOTIATE NegotiatePB request
0923 19:32:09.035350 (+289730us) negotiation.cc:327] Negotiation complete: Network error: Client connection negotiation failed: client connection to 0.0.0.0:36311: BlockingRecv error: recv error from unknown peer: Transport endpoint is not connected (error 107)
Metrics: {"client-negotiator.queue_time_us":99}
W20260923 19:32:09.035871   862 negotiation.cc:337] Failed RPC negotiation. Trace:
0923 19:32:08.738136 (+     0us) reactor.cc:625] Submitting negotiation task for client connection to 0.0.0.0:36311 (local address 127.0.0.1:58064)
0923 19:32:08.738584 (+   448us) negotiation.cc:107] Waiting for socket to connect
0923 19:32:08.738608 (+    24us) client_negotiation.cc:174] Beginning negotiation
0923 19:32:08.738751 (+   143us) client_negotiation.cc:252] Sending NEGOTIATE NegotiatePB request
0923 19:32:09.035349 (+296598us) negotiation.cc:327] Negotiation complete: Network error: Client connection negotiation failed: client connection to 0.0.0.0:36311: BlockingRecv error: recv error from unknown peer: Transport endpoint is not connected (error 107)
Metrics: {"client-negotiator.queue_time_us":274}
W20260923 19:32:09.035959   871 negotiation.cc:337] Failed RPC negotiation. Trace:
0923 19:32:08.741825 (+     0us) reactor.cc:625] Submitting negotiation task for client connection to 0.0.0.0:36311 (local address 127.0.0.1:58074)
0923 19:32:08.742090 (+   265us) negotiation.cc:107] Waiting for socket to connect
0923 19:32:08.742112 (+    22us) client_negotiation.cc:174] Beginning negotiation
0923 19:32:08.742243 (+   131us) client_negotiation.cc:252] Sending NEGOTIATE NegotiatePB request
0923 19:32:09.035658 (+293415us) negotiation.cc:327] Negotiation complete: Network error: Client connection negotiation failed: client connection to 0.0.0.0:36311: BlockingRecv error: recv error from unknown peer: Transport endpoint is not connected (error 107)
Metrics: {"client-negotiator.queue_time_us":89}
W20260923 19:32:09.036442   853 negotiation.cc:337] Failed RPC negotiation. Trace:
0923 19:32:08.734851 (+     0us) reactor.cc:625] Submitting negotiation task for client connection to 0.0.0.0:36311 (local address 127.0.0.1:58048)
0923 19:32:08.735121 (+   270us) negotiation.cc:107] Waiting for socket to connect
0923 19:32:08.735252 (+   131us) client_negotiation.cc:174] Beginning negotiation
0923 19:32:08.735393 (+   141us) client_negotiation.cc:252] Sending NEGOTIATE NegotiatePB request
0923 19:32:09.035347 (+299954us) negotiation.cc:327] Negotiation complete: Network error: Client connection negotiation failed: client connection to 0.0.0.0:36311: BlockingRecv error: recv error from unknown peer: Transport endpoint is not connected (error 107)
Metrics: {"client-negotiator.queue_time_us":116}
W20260923 19:32:09.037089   898 negotiation.cc:337] Failed RPC negotiation. Trace:
0923 19:32:08.752325 (+     0us) reactor.cc:625] Submitting negotiation task for client connection to 0.0.0.0:36311 (local address 127.0.0.1:58106)
0923 19:32:08.752517 (+   192us) negotiation.cc:107] Waiting for socket to connect
0923 19:32:08.752540 (+    23us) client_negotiation.cc:174] Beginning negotiation
0923 19:32:08.752663 (+   123us) client_negotiation.cc:252] Sending NEGOTIATE NegotiatePB request
0923 19:32:09.036484 (+283821us) negotiation.cc:327] Negotiation complete: Network error: Client connection negotiation failed: client connection to 0.0.0.0:36311: BlockingRecv error: recv error from unknown peer: Transport endpoint is not connected (error 107)
Metrics: {"client-negotiator.queue_time_us":55}
W20260923 19:32:09.044778   889 negotiation.cc:337] Failed RPC negotiation. Trace:
0923 19:32:08.748754 (+     0us) reactor.cc:625] Submitting negotiation task for client connection to 0.0.0.0:36311 (local address 127.0.0.1:58098)
0923 19:32:08.748949 (+   195us) negotiation.cc:107] Waiting for socket to connect
0923 19:32:08.748975 (+    26us) client_negotiation.cc:174] Beginning negotiation
0923 19:32:08.749078 (+   103us) client_negotiation.cc:252] Sending NEGOTIATE NegotiatePB request
0923 19:32:09.036623 (+287545us) negotiation.cc:327] Negotiation complete: Network error: Client connection negotiation failed: client connection to 0.0.0.0:36311: BlockingRecv error: recv error from unknown peer: Transport endpoint is not connected (error 107)
Metrics: {"client-negotiator.queue_time_us":60}
[       OK ] Parameters/TestRpcSocketTxRxQueue.OverCapacity/0 (1079 ms)
[----------] 1 test from Parameters/TestRpcSocketTxRxQueue (1080 ms total)

[----------] Global test environment tear-down
[==========] 21 tests from 2 test suites ran. (51519 ms total)
[  PASSED  ] 20 tests.
[  FAILED  ] 1 test, listed below:
[  FAILED  ] Parameters/TestRpc.TestCallWithChainCertAndChainCA/SSL_TCP, where GetParam() = (true, false)

 1 FAILED TEST