Diagnosed failure

Parameters/TestRpc.TestCallWithChainCertAndChainCA/SSL_TCP: /data0/somelongdirectorytoavoidrpathissues/src/kudu/src/kudu/rpc/rpc-test.cc:270: Failure
Failed
Bad status: Runtime error: could not verify certificate chain (error with cert: subject=CN = localhost, ST = sadfjas, C = AS, emailAddress = sdflkdsajf, O = lskdfjlsad, OU = sldfkja, issuer=C = AS, ST = ASDfkjdhf, L = lskdjf, O = saldfja, OU = skdjf, CN = localhost, emailAddress = sadjflkadsj): : certificate has expired
Google Test trace:
/data0/somelongdirectorytoavoidrpathissues/src/kudu/src/kudu/rpc/rpc-test.cc:267: Connecting to 0.0.0.0:34369
I20260929 16:25:26.806574   383 test_util.cc:175] -----------------------------------------------
I20260929 16:25:26.806632   383 test_util.cc:176] Had fatal failures, leaving test files at /tmp/dist-test-taskV_tGGE/test-tmp/rpc-test.5.Parameters_TestRpc.TestCallWithChainCertAndChainCA_SSL_TCP.1790699126703054-383-0

Full log

Note: This is test shard 6 of 8.
[==========] Running 21 tests from 2 test suites.
[----------] Global test environment set-up.
[----------] 20 tests from Parameters/TestRpc
[ RUN      ] Parameters/TestRpc.TestMessengerCreateDestroy/SSL_TCP
WARNING: Logging before InitGoogleLogging() is written to STDERR
I20260929 16:25:26.734122   383 rpc-test.cc:169] started messenger TestCreateDestroy
[       OK ] Parameters/TestRpc.TestMessengerCreateDestroy/SSL_TCP (25 ms)
[ RUN      ] Parameters/TestRpc.TestNegotiationDeadlock/SSL_TCP
I20260929 16:25:26.766583   404 acceptor_pool.cc:254] collecting diagnostics on the listening RPC socket 0.0.0.0:36221 every 8 connection(s)
I20260929 16:25:26.766583   403 acceptor_pool.cc:254] collecting diagnostics on the listening RPC socket 0.0.0.0:36221 every 8 connection(s)
[       OK ] Parameters/TestRpc.TestNegotiationDeadlock/SSL_TCP (42 ms)
[ RUN      ] Parameters/TestRpc.TestCallWithChainCertAndChainCA/SSL_TCP
I20260929 16:25:26.801283   419 acceptor_pool.cc:254] collecting diagnostics on the listening RPC socket 0.0.0.0:34369 every 8 connection(s)
I20260929 16:25:26.801299   420 acceptor_pool.cc:254] collecting diagnostics on the listening RPC socket 0.0.0.0:34369 every 8 connection(s)
/data0/somelongdirectorytoavoidrpathissues/src/kudu/src/kudu/rpc/rpc-test.cc:270: Failure
Failed
Bad status: Runtime error: could not verify certificate chain (error with cert: subject=CN = localhost, ST = sadfjas, C = AS, emailAddress = sdflkdsajf, O = lskdfjlsad, OU = sldfkja, issuer=C = AS, ST = ASDfkjdhf, L = lskdjf, O = saldfja, OU = skdjf, CN = localhost, emailAddress = sadjflkadsj): : certificate has expired
Google Test trace:
/data0/somelongdirectorytoavoidrpathissues/src/kudu/src/kudu/rpc/rpc-test.cc:267: Connecting to 0.0.0.0:34369
I20260929 16:25:26.806574   383 test_util.cc:175] -----------------------------------------------
I20260929 16:25:26.806632   383 test_util.cc:176] Had fatal failures, leaving test files at /tmp/dist-test-taskV_tGGE/test-tmp/rpc-test.5.Parameters_TestRpc.TestCallWithChainCertAndChainCA_SSL_TCP.1790699126703054-383-0
[  FAILED  ] Parameters/TestRpc.TestCallWithChainCertAndChainCA/SSL_TCP, where GetParam() = (true, false) (28 ms)
[ RUN      ] Parameters/TestRpc.TestCallWithPasswordProtectedKey/SSL_TCP
I20260929 16:25:26.816330   444 acceptor_pool.cc:254] collecting diagnostics on the listening RPC socket 0.0.0.0:34215 every 8 connection(s)
I20260929 16:25:26.816340   445 acceptor_pool.cc:254] collecting diagnostics on the listening RPC socket 0.0.0.0:34215 every 8 connection(s)
[       OK ] Parameters/TestRpc.TestCallWithPasswordProtectedKey/SSL_TCP (25 ms)
[ RUN      ] Parameters/TestRpc.TestCallToBadServer/SSL_TCP
I20260929 16:25:26.846740   383 rpc-test.cc:394] Status: Network error: Client connection negotiation failed: client connection to 0.0.0.0:0: connect: Connection refused (error 111)
I20260929 16:25:26.847230   383 rpc-test.cc:394] Status: Network error: Client connection negotiation failed: client connection to 0.0.0.0:0: connect: Connection refused (error 111)
I20260929 16:25:26.847635   383 rpc-test.cc:394] Status: Network error: Client connection negotiation failed: client connection to 0.0.0.0:0: connect: Connection refused (error 111)
I20260929 16:25:26.848026   383 rpc-test.cc:394] Status: Network error: Client connection negotiation failed: client connection to 0.0.0.0:0: connect: Connection refused (error 111)
I20260929 16:25:26.848431   383 rpc-test.cc:394] Status: Network error: Client connection negotiation failed: client connection to 0.0.0.0:0: connect: Connection refused (error 111)
[       OK ] Parameters/TestRpc.TestCallToBadServer/SSL_TCP (17 ms)
[ RUN      ] Parameters/TestRpc.TestWrongService/SSL_TCP
I20260929 16:25:26.864313   479 acceptor_pool.cc:254] collecting diagnostics on the listening RPC socket 0.0.0.0:42559 every 8 connection(s)
I20260929 16:25:26.864348   480 acceptor_pool.cc:254] collecting diagnostics on the listening RPC socket 0.0.0.0:42559 every 8 connection(s)
I20260929 16:25:26.883241   477 messenger.cc:345] service WrongServiceName not registered on TestServer
[       OK ] Parameters/TestRpc.TestWrongService/SSL_TCP (36 ms)
[ RUN      ] Parameters/TestRpc.TestConnectionKeepalive/SSL_TCP
I20260929 16:25:26.904572   502 acceptor_pool.cc:254] collecting diagnostics on the listening RPC socket 0.0.0.0:37743 every 8 connection(s)
I20260929 16:25:26.904594   503 acceptor_pool.cc:254] collecting diagnostics on the listening RPC socket 0.0.0.0:37743 every 8 connection(s)
I20260929 16:25:26.904911   383 rpc-test.cc:488] Connecting to 0.0.0.0:37743
[       OK ] Parameters/TestRpc.TestConnectionKeepalive/SSL_TCP (1053 ms)
[ RUN      ] Parameters/TestRpc.TestClientConnectionMetrics/SSL_TCP
I20260929 16:25:27.945406   527 acceptor_pool.cc:254] collecting diagnostics on the listening RPC socket 0.0.0.0:38633 every 8 connection(s)
I20260929 16:25:27.945432   528 acceptor_pool.cc:254] collecting diagnostics on the listening RPC socket 0.0.0.0:38633 every 8 connection(s)
I20260929 16:25:27.945698   383 rpc-test.cc:569] Connecting to 0.0.0.0:38633
[       OK ] Parameters/TestRpc.TestClientConnectionMetrics/SSL_TCP (14727 ms)
[ RUN      ] Parameters/TestRpc.TestCredentialsPolicy/SSL_TCP
I20260929 16:25:42.693032   550 acceptor_pool.cc:254] collecting diagnostics on the listening RPC socket 0.0.0.0:38935 every 8 connection(s)
I20260929 16:25:42.693105   551 acceptor_pool.cc:254] collecting diagnostics on the listening RPC socket 0.0.0.0:38935 every 8 connection(s)
I20260929 16:25:42.693426   383 rpc-test.cc:700] Connecting to 0.0.0.0:38935
[       OK ] Parameters/TestRpc.TestCredentialsPolicy/SSL_TCP (57 ms)
[ RUN      ] Parameters/TestRpc.TestCallLongerThanKeepalive/SSL_TCP
I20260929 16:25:42.737061   575 acceptor_pool.cc:254] collecting diagnostics on the listening RPC socket 0.0.0.0:33933 every 8 connection(s)
I20260929 16:25:42.737125   576 acceptor_pool.cc:254] collecting diagnostics on the listening RPC socket 0.0.0.0:33933 every 8 connection(s)
I20260929 16:25:42.760768   579 rpc-test-base.h:222] got call: sleep_micros: 3000000 deferred: true
I20260929 16:25:45.761682   579 rpcz_store.cc:275] Call kudu.rpc.GenericCalculatorService.Sleep from 127.0.0.1:42252 (request call id 0) took 3001 ms. Trace:
I20260929 16:25:45.761807   579 rpcz_store.cc:276] 0929 16:25:42.760685 (+     0us) service_pool.cc:170] Inserting onto call queue
0929 16:25:42.760736 (+    51us) service_pool.cc:227] Handling call
0929 16:25:45.761663 (+3000927us) inbound_call.cc:173] Queueing success response
Metrics: {}
[       OK ] Parameters/TestRpc.TestCallLongerThanKeepalive/SSL_TCP (3040 ms)
[ RUN      ] Parameters/TestRpc.TestRpcSidecar/SSL_TCP
I20260929 16:25:45.785665   600 acceptor_pool.cc:254] collecting diagnostics on the listening RPC socket 0.0.0.0:44559 every 8 connection(s)
I20260929 16:25:45.785682   601 acceptor_pool.cc:254] collecting diagnostics on the listening RPC socket 0.0.0.0:44559 every 8 connection(s)
[       OK ] Parameters/TestRpc.TestRpcSidecar/SSL_TCP (79 ms)
[ RUN      ] Parameters/TestRpc.TestRpcSidecarLimits/SSL_TCP
I20260929 16:25:47.612258   625 acceptor_pool.cc:254] collecting diagnostics on the listening RPC socket 0.0.0.0:46247 every 8 connection(s)
I20260929 16:25:47.612286   626 acceptor_pool.cc:254] collecting diagnostics on the listening RPC socket 0.0.0.0:46247 every 8 connection(s)
W20260929 16:25:47.633134   383 serialization.cc:72] Serialized kudu.rpc_test.PushStringsRequestPB (2147483654 bytes) is larger than the maximum configured RPC message size (52428800 bytes). Sending anyway, but peer may reject the data.
W20260929 16:25:47.637542   622 connection.cc:535] server connection from 127.0.0.1:37308 recv error: Network error: RPC frame had a length of 2147483714, but we only support messages up to 52428800 bytes long.
W20260929 16:25:47.637632   622 connection.cc:158] shutting down server connection from 127.0.0.1:37308 with pending inbound data: 4/2147483714 bytes received; last active 0 ns ago: status Network error: RPC frame had a length of 2147483714, but we only support messages up to 52428800 bytes long.
W20260929 16:25:47.637935   638 connection.cc:196] Error closing socket: Network error: TlsSocket::Close: Connection reset by peer
I20260929 16:25:47.647504   651 acceptor_pool.cc:254] collecting diagnostics on the listening RPC socket 0.0.0.0:33921 every 8 connection(s)
I20260929 16:25:47.647408   650 acceptor_pool.cc:254] collecting diagnostics on the listening RPC socket 0.0.0.0:33921 every 8 connection(s)
W20260929 16:25:51.875360   647 connection.cc:577] server connection from 127.0.0.1:42920: received bad data: 'Corruption: Invalid packet: message had a length of 2147483710, but we only support messages up to 2147483647 bytes
'
[       OK ] Parameters/TestRpc.TestRpcSidecarLimits/SSL_TCP (6033 ms)
[ RUN      ] Parameters/TestRpc.TestCallTimeoutDoesntAffectNegotiation/SSL_TCP
I20260929 16:25:51.893476   675 acceptor_pool.cc:254] collecting diagnostics on the listening RPC socket 0.0.0.0:41367 every 8 connection(s)
I20260929 16:25:51.893635   676 acceptor_pool.cc:254] collecting diagnostics on the listening RPC socket 0.0.0.0:41367 every 8 connection(s)
W20260929 16:25:51.902248   671 negotiation.cc:266] Injecting 500ms delay in negotiation
I20260929 16:25:51.952636   383 rpc-test-base.h:595] status: Timed out: connection negotiation to 0.0.0.0:41367 for RPC Sleep timed out after 0.050s (ON_OUTBOUND_QUEUE), seconds elapsed: 0.05082
[       OK ] Parameters/TestRpc.TestCallTimeoutDoesntAffectNegotiation/SSL_TCP (531 ms)
[ RUN      ] Parameters/TestRpc.TestRpcHandlerLatencyMetric/SSL_TCP
I20260929 16:25:52.431708   700 acceptor_pool.cc:254] collecting diagnostics on the listening RPC socket 0.0.0.0:44867 every 8 connection(s)
I20260929 16:25:52.431739   701 acceptor_pool.cc:254] collecting diagnostics on the listening RPC socket 0.0.0.0:44867 every 8 connection(s)
I20260929 16:25:52.469436   383 rpc-test.cc:1236] Sleep() min lat: 20366
I20260929 16:25:52.469503   383 rpc-test.cc:1237] Sleep() mean lat: 20366
I20260929 16:25:52.469530   383 rpc-test.cc:1238] Sleep() max lat: 20366
I20260929 16:25:52.469544   383 rpc-test.cc:1239] Sleep() #calls: 1
[       OK ] Parameters/TestRpc.TestRpcHandlerLatencyMetric/SSL_TCP (62 ms)
[ RUN      ] Parameters/TestRpc.TimedOutOnResponseMetricServiceQueue/SSL_TCP
I20260929 16:25:52.500316   726 acceptor_pool.cc:254] collecting diagnostics on the listening RPC socket 0.0.0.0:40849 every 8 connection(s)
I20260929 16:25:52.500346   727 acceptor_pool.cc:254] collecting diagnostics on the listening RPC socket 0.0.0.0:40849 every 8 connection(s)
W20260929 16:25:52.562930   728 rpcz_store.cc:267] Call kudu.rpc_test.CalculatorService.Sleep from 127.0.0.1:53500 (request call id 2) took 20 ms (client timeout 20 ms). Trace:
W20260929 16:25:52.563060   728 rpcz_store.cc:269] 0929 16:25:52.542574 (+     0us) service_pool.cc:170] Inserting onto call queue
0929 16:25:52.562877 (+ 20303us) service_pool.cc:214] Skipping call since client already timed out
0929 16:25:52.562912 (+    35us) inbound_call.cc:173] Queueing failure response
Metrics: {}
[       OK ] Parameters/TestRpc.TimedOutOnResponseMetricServiceQueue/SSL_TCP (93 ms)
[ RUN      ] Parameters/TestRpc.RpcPendingConnectionsMetric/SSL_TCP
I20260929 16:25:52.567760   749 acceptor_pool.cc:254] collecting diagnostics on the listening RPC socket 0.0.0.0:42745 every 8 connection(s)
I20260929 16:25:52.567831   750 acceptor_pool.cc:254] collecting diagnostics on the listening RPC socket 0.0.0.0:42745 every 8 connection(s)
W20260929 16:25:52.577206   745 negotiation.cc:337] Failed RPC negotiation. Trace:
0929 16:25:52.576541 (+     0us) reactor.cc:625] Submitting negotiation task for server connection from 127.0.0.1:36344 (local address 127.0.0.1:42745)
0929 16:25:52.576722 (+   181us) server_negotiation.cc:206] Beginning negotiation
0929 16:25:52.576727 (+     5us) server_negotiation.cc:399] Waiting for connection header
0929 16:25:52.576895 (+   168us) negotiation.cc:327] Negotiation complete: Network error: Server connection negotiation failed: server connection from 127.0.0.1:36344: BlockingRecv error: recv got EOF from 127.0.0.1:36344 (error 108)
Metrics: {"server-negotiator.queue_time_us":59}
[       OK ] Parameters/TestRpc.RpcPendingConnectionsMetric/SSL_TCP (22 ms)
[ RUN      ] Parameters/TestRpc.TestRpcContextClientDeadline/SSL_TCP
I20260929 16:25:52.597698   765 acceptor_pool.cc:254] collecting diagnostics on the listening RPC socket 0.0.0.0:46397 every 8 connection(s)
I20260929 16:25:52.597707   766 acceptor_pool.cc:254] collecting diagnostics on the listening RPC socket 0.0.0.0:46397 every 8 connection(s)
[       OK ] Parameters/TestRpc.TestRpcContextClientDeadline/SSL_TCP (44 ms)
[ RUN      ] Parameters/TestRpc.TestApplicationFeatureFlagUnsupportedServer/SSL_TCP
I20260929 16:25:52.658428   790 acceptor_pool.cc:254] collecting diagnostics on the listening RPC socket 0.0.0.0:39721 every 8 connection(s)
I20260929 16:25:52.658470   791 acceptor_pool.cc:254] collecting diagnostics on the listening RPC socket 0.0.0.0:39721 every 8 connection(s)
[       OK ] Parameters/TestRpc.TestApplicationFeatureFlagUnsupportedServer/SSL_TCP (42 ms)
[ RUN      ] Parameters/TestRpc.TestCancellationAsync/SSL_TCP
I20260929 16:25:52.684608   815 acceptor_pool.cc:254] collecting diagnostics on the listening RPC socket 0.0.0.0:35609 every 8 connection(s)
I20260929 16:25:52.684643   816 acceptor_pool.cc:254] collecting diagnostics on the listening RPC socket 0.0.0.0:35609 every 8 connection(s)
I20260929 16:25:52.684985   383 rpc-test.cc:1716] Connecting to 0.0.0.0:35609
I20260929 16:25:52.700616   383 test_util.cc:268] Using random seed: -1562020666
I20260929 16:25:52.729084   819 rpc-test-base.h:240] got call: sleep_micros: 500 pattern: 4294967295 num_repetitions: 2097152 sidecar_idx: 0
I20260929 16:25:52.750756   819 rpc-test-base.h:240] got call: sleep_micros: 500 pattern: 4294967295 num_repetitions: 2097152 sidecar_idx: 0
I20260929 16:25:52.773834   819 rpc-test-base.h:240] got call: sleep_micros: 500 pattern: 4294967295 num_repetitions: 2097152 sidecar_idx: 0
I20260929 16:25:52.798641   819 rpc-test-base.h:240] got call: sleep_micros: 500 pattern: 4294967295 num_repetitions: 2097152 sidecar_idx: 0
I20260929 16:25:52.823894   819 rpc-test-base.h:240] got call: sleep_micros: 500 pattern: 4294967295 num_repetitions: 2097152 sidecar_idx: 0
I20260929 16:25:52.840571   818 rpc-test-base.h:240] got call: sleep_micros: 500 pattern: 4294967295 num_repetitions: 2097152 sidecar_idx: 0
I20260929 16:25:52.861934   819 rpc-test-base.h:240] got call: sleep_micros: 500 pattern: 4294967295 num_repetitions: 2097152 sidecar_idx: 0
W20260929 16:25:52.867422   813 connection.cc:441] server connection from 127.0.0.1:47132 torn down before Call kudu.rpc.GenericCalculatorService.SleepWithSidecar from 127.0.0.1:47132 (request call id 8) could send its response
W20260929 16:25:52.880259   813 connection.cc:441] server connection from 127.0.0.1:47132 torn down before Call kudu.rpc.GenericCalculatorService.SleepWithSidecar from 127.0.0.1:47132 (request call id 9) could send its response
[       OK ] Parameters/TestRpc.TestCancellationAsync/SSL_TCP (207 ms)
[ RUN      ] Parameters/TestRpc.TestPerformanceBySocketType/SSL_TCP
I20260929 16:25:52.901273   840 acceptor_pool.cc:254] collecting diagnostics on the listening RPC socket 0.0.0.0:45649 every 8 connection(s)
I20260929 16:25:52.901309   841 acceptor_pool.cc:254] collecting diagnostics on the listening RPC socket 0.0.0.0:45649 every 8 connection(s)
I20260929 16:25:52.901659   383 rpc-test.cc:1846] Connecting to 0.0.0.0:45649
I20260929 16:25:55.086069   383 rpc-test.cc:1859] Sending 1024MB via ssl-enabled tcp socket: real 2.175s	user 2.124s	sys 1.722s
I20260929 16:25:57.443465   383 rpc-test.cc:1859] Sending 1024MB via ssl-enabled tcp socket: real 2.357s	user 2.370s	sys 1.769s
I20260929 16:25:59.651974   383 rpc-test.cc:1859] Sending 1024MB via ssl-enabled tcp socket: real 2.208s	user 2.208s	sys 1.685s
I20260929 16:26:01.889225   383 rpc-test.cc:1859] Sending 1024MB via ssl-enabled tcp socket: real 2.237s	user 2.391s	sys 1.555s
I20260929 16:26:04.093359   383 rpc-test.cc:1859] Sending 1024MB via ssl-enabled tcp socket: real 2.204s	user 2.293s	sys 1.588s
[       OK ] Parameters/TestRpc.TestPerformanceBySocketType/SSL_TCP (11213 ms)
[----------] 20 tests from Parameters/TestRpc (37385 ms total)

[----------] 1 test from Parameters/TestRpcSocketTxRxQueue
[ RUN      ] Parameters/TestRpcSocketTxRxQueue.OverCapacity/0
W20260929 16:26:04.365473   857 negotiation.cc:337] Failed RPC negotiation. Trace:
0929 16:26:04.097682 (+     0us) reactor.cc:625] Submitting negotiation task for client connection to 0.0.0.0:37423 (local address 127.0.0.1:33150)
0929 16:26:04.097786 (+   104us) negotiation.cc:107] Waiting for socket to connect
0929 16:26:04.097801 (+    15us) client_negotiation.cc:174] Beginning negotiation
0929 16:26:04.097885 (+    84us) client_negotiation.cc:252] Sending NEGOTIATE NegotiatePB request
0929 16:26:04.365322 (+267437us) negotiation.cc:327] Negotiation complete: Network error: Client connection negotiation failed: client connection to 0.0.0.0:37423: BlockingRecv error: recv error from unknown peer: Transport endpoint is not connected (error 107)
Metrics: {"client-negotiator.queue_time_us":25}
W20260929 16:26:04.365547   875 negotiation.cc:337] Failed RPC negotiation. Trace:
0929 16:26:04.100009 (+     0us) reactor.cc:625] Submitting negotiation task for client connection to 0.0.0.0:37423 (local address 127.0.0.1:33172)
0929 16:26:04.100115 (+   106us) negotiation.cc:107] Waiting for socket to connect
0929 16:26:04.100128 (+    13us) client_negotiation.cc:174] Beginning negotiation
0929 16:26:04.100205 (+    77us) client_negotiation.cc:252] Sending NEGOTIATE NegotiatePB request
0929 16:26:04.365385 (+265180us) negotiation.cc:327] Negotiation complete: Network error: Client connection negotiation failed: client connection to 0.0.0.0:37423: BlockingRecv error: recv error from unknown peer: Transport endpoint is not connected (error 107)
Metrics: {"client-negotiator.queue_time_us":24}
W20260929 16:26:04.365696   893 negotiation.cc:337] Failed RPC negotiation. Trace:
0929 16:26:04.102342 (+     0us) reactor.cc:625] Submitting negotiation task for client connection to 0.0.0.0:37423 (local address 127.0.0.1:33190)
0929 16:26:04.102474 (+   132us) negotiation.cc:107] Waiting for socket to connect
0929 16:26:04.102485 (+    11us) client_negotiation.cc:174] Beginning negotiation
0929 16:26:04.102577 (+    92us) client_negotiation.cc:252] Sending NEGOTIATE NegotiatePB request
0929 16:26:04.365634 (+263057us) negotiation.cc:327] Negotiation complete: Network error: Client connection negotiation failed: client connection to 0.0.0.0:37423: BlockingRecv error: recv error from unknown peer: Transport endpoint is not connected (error 107)
Metrics: {"client-negotiator.queue_time_us":44}
W20260929 16:26:04.365481   902 negotiation.cc:337] Failed RPC negotiation. Trace:
0929 16:26:04.103460 (+     0us) reactor.cc:625] Submitting negotiation task for client connection to 0.0.0.0:37423 (local address 127.0.0.1:33202)
0929 16:26:04.103568 (+   108us) negotiation.cc:107] Waiting for socket to connect
0929 16:26:04.103581 (+    13us) client_negotiation.cc:174] Beginning negotiation
0929 16:26:04.103655 (+    74us) client_negotiation.cc:252] Sending NEGOTIATE NegotiatePB request
0929 16:26:04.365430 (+261775us) negotiation.cc:327] Negotiation complete: Network error: Client connection negotiation failed: client connection to 0.0.0.0:37423: BlockingRecv error: recv error from unknown peer: Transport endpoint is not connected (error 107)
Metrics: {"client-negotiator.queue_time_us":24}
W20260929 16:26:04.365526   866 negotiation.cc:337] Failed RPC negotiation. Trace:
0929 16:26:04.098857 (+     0us) reactor.cc:625] Submitting negotiation task for client connection to 0.0.0.0:37423 (local address 127.0.0.1:33162)
0929 16:26:04.098996 (+   139us) negotiation.cc:107] Waiting for socket to connect
0929 16:26:04.099008 (+    12us) client_negotiation.cc:174] Beginning negotiation
0929 16:26:04.099098 (+    90us) client_negotiation.cc:252] Sending NEGOTIATE NegotiatePB request
0929 16:26:04.365385 (+266287us) negotiation.cc:327] Negotiation complete: Network error: Client connection negotiation failed: client connection to 0.0.0.0:37423: BlockingRecv error: recv error from unknown peer: Transport endpoint is not connected (error 107)
Metrics: {"client-negotiator.queue_time_us":49}
W20260929 16:26:04.365999   884 negotiation.cc:337] Failed RPC negotiation. Trace:
0929 16:26:04.101221 (+     0us) reactor.cc:625] Submitting negotiation task for client connection to 0.0.0.0:37423 (local address 127.0.0.1:33186)
0929 16:26:04.101325 (+   104us) negotiation.cc:107] Waiting for socket to connect
0929 16:26:04.101338 (+    13us) client_negotiation.cc:174] Beginning negotiation
0929 16:26:04.101412 (+    74us) client_negotiation.cc:252] Sending NEGOTIATE NegotiatePB request
0929 16:26:04.365322 (+263910us) negotiation.cc:327] Negotiation complete: Network error: Client connection negotiation failed: client connection to 0.0.0.0:37423: BlockingRecv error: recv error from unknown peer: Transport endpoint is not connected (error 107)
Metrics: {"client-negotiator.queue_time_us":24}
[       OK ] Parameters/TestRpcSocketTxRxQueue.OverCapacity/0 (1048 ms)
[----------] 1 test from Parameters/TestRpcSocketTxRxQueue (1048 ms total)

[----------] Global test environment tear-down
[==========] 21 tests from 2 test suites ran. (38434 ms total)
[  PASSED  ] 20 tests.
[  FAILED  ] 1 test, listed below:
[  FAILED  ] Parameters/TestRpc.TestCallWithChainCertAndChainCA/SSL_TCP, where GetParam() = (true, false)

 1 FAILED TEST