Parameters/TestRpc.TestCallWithChainCertAndRootCA/SSL_UnixSocket: /data0/somelongdirectorytoavoidrpathissues/src/kudu/src/kudu/rpc/rpc-test.cc:303: Failure
Failed
Bad status: Runtime error: could not verify certificate chain (error with cert: subject=CN = localhost, ST = sadfjas, C = AS, emailAddress = sdflkdsajf, O = lskdfjlsad, OU = sldfkja, issuer=C = AS, ST = ASDfkjdhf, L = lskdjf, O = saldfja, OU = skdjf, CN = localhost, emailAddress = sadjflkadsj): : certificate has expired
Google Test trace:
/data0/somelongdirectorytoavoidrpathissues/src/kudu/src/kudu/rpc/rpc-test.cc:300: Connecting to unix:/tmp/dist-test-taskdqtXn4/test-tmp/rpc-test-483c5e13d2bd4ca0a7652614738b65c1.sock
I20260926 12:11:17.965164 1724 test_util.cc:175] -----------------------------------------------
I20260926 12:11:17.965314 1724 test_util.cc:176] Had fatal failures, leaving test files at /tmp/dist-test-taskdqtXn4/test-tmp/rpc-test.2.Parameters_TestRpc.TestCallWithChainCertAndRootCA_SSL_UnixSocket.1790424674518604-1724-0
Note: This is test shard 3 of 8.
[==========] Running 21 tests from 2 test suites.
[----------] Global test environment set-up.
[----------] 1 test from TestRpc
[ RUN ] TestRpc.TestNegotiationTimeout
WARNING: Logging before InitGoogleLogging() is written to STDERR
I20260926 12:11:14.707002 1724 rpc-test-base.h:595] status: Timed out: connection negotiation to 0.0.0.0:33863 for RPC Sleep timed out after 0.100s (ON_OUTBOUND_QUEUE), seconds elapsed: 0.10164
W20260926 12:11:17.668078 1734 negotiation.cc:337] Failed RPC negotiation. Trace:
0926 12:11:14.606153 (+ 0us) reactor.cc:625] Submitting negotiation task for client connection to 0.0.0.0:33863 (local address 127.0.0.1:60976)
0926 12:11:14.606812 (+ 659us) negotiation.cc:107] Waiting for socket to connect
0926 12:11:14.606856 (+ 44us) client_negotiation.cc:174] Beginning negotiation
0926 12:11:14.618656 (+ 11800us) client_negotiation.cc:252] Sending NEGOTIATE NegotiatePB request
0926 12:11:17.666954 (+3048298us) negotiation.cc:327] Negotiation complete: Timed out: Client connection negotiation failed: client connection to 0.0.0.0:33863: received 0 of 4 requested bytes
Metrics: {"client-negotiator.queue_time_us":221}
[ OK ] TestRpc.TestNegotiationTimeout (3101 ms)
[----------] 1 test from TestRpc (3101 ms total)
[----------] 20 tests from Parameters/TestRpc
[ RUN ] Parameters/TestRpc.TestAcceptorPoolStartStop/SSL_UnixSocket
I20260926 12:11:17.706096 1750 acceptor_pool.cc:254] collecting diagnostics on the listening RPC socket unix:/tmp/dist-test-taskdqtXn4/test-tmp/rpc-test-e06ac0b3519b419a9c47b5a06612c68e.sock every 8 connection(s)
I20260926 12:11:17.707209 1751 acceptor_pool.cc:254] collecting diagnostics on the listening RPC socket unix:/tmp/dist-test-taskdqtXn4/test-tmp/rpc-test-e06ac0b3519b419a9c47b5a06612c68e.sock every 8 connection(s)
I20260926 12:11:17.741418 1761 acceptor_pool.cc:254] collecting diagnostics on the listening RPC socket unix:/tmp/dist-test-taskdqtXn4/test-tmp/rpc-test-e06ac0b3519b419a9c47b5a06612c68e.sock every 8 connection(s)
I20260926 12:11:17.742460 1762 acceptor_pool.cc:254] collecting diagnostics on the listening RPC socket unix:/tmp/dist-test-taskdqtXn4/test-tmp/rpc-test-e06ac0b3519b419a9c47b5a06612c68e.sock every 8 connection(s)
I20260926 12:11:17.757766 1772 acceptor_pool.cc:254] collecting diagnostics on the listening RPC socket unix:/tmp/dist-test-taskdqtXn4/test-tmp/rpc-test-e06ac0b3519b419a9c47b5a06612c68e.sock every 8 connection(s)
I20260926 12:11:17.758476 1773 acceptor_pool.cc:254] collecting diagnostics on the listening RPC socket unix:/tmp/dist-test-taskdqtXn4/test-tmp/rpc-test-e06ac0b3519b419a9c47b5a06612c68e.sock every 8 connection(s)
I20260926 12:11:17.793581 1783 acceptor_pool.cc:254] collecting diagnostics on the listening RPC socket unix:/tmp/dist-test-taskdqtXn4/test-tmp/rpc-test-e06ac0b3519b419a9c47b5a06612c68e.sock every 8 connection(s)
I20260926 12:11:17.794344 1784 acceptor_pool.cc:254] collecting diagnostics on the listening RPC socket unix:/tmp/dist-test-taskdqtXn4/test-tmp/rpc-test-e06ac0b3519b419a9c47b5a06612c68e.sock every 8 connection(s)
I20260926 12:11:17.818140 1794 acceptor_pool.cc:254] collecting diagnostics on the listening RPC socket unix:/tmp/dist-test-taskdqtXn4/test-tmp/rpc-test-e06ac0b3519b419a9c47b5a06612c68e.sock every 8 connection(s)
I20260926 12:11:17.818805 1795 acceptor_pool.cc:254] collecting diagnostics on the listening RPC socket unix:/tmp/dist-test-taskdqtXn4/test-tmp/rpc-test-e06ac0b3519b419a9c47b5a06612c68e.sock every 8 connection(s)
[ OK ] Parameters/TestRpc.TestAcceptorPoolStartStop/SSL_UnixSocket (150 ms)
[ RUN ] Parameters/TestRpc.TestCall/SSL_UnixSocket
I20260926 12:11:17.860144 1807 acceptor_pool.cc:254] collecting diagnostics on the listening RPC socket unix:/tmp/dist-test-taskdqtXn4/test-tmp/rpc-test-f83ac8ab10c2462e8847863d0ac6ba63.sock every 8 connection(s)
I20260926 12:11:17.862061 1808 acceptor_pool.cc:254] collecting diagnostics on the listening RPC socket unix:/tmp/dist-test-taskdqtXn4/test-tmp/rpc-test-f83ac8ab10c2462e8847863d0ac6ba63.sock every 8 connection(s)
I20260926 12:11:17.866640 1724 rpc-test.cc:234] Connecting to unix:/tmp/dist-test-taskdqtXn4/test-tmp/rpc-test-f83ac8ab10c2462e8847863d0ac6ba63.sock
W20260926 12:11:17.914196 1804 connection.cc:196] Error closing socket: Network error: TlsSocket::Close: Broken pipe
[ OK ] Parameters/TestRpc.TestCall/SSL_UnixSocket (96 ms)
[ RUN ] Parameters/TestRpc.TestCallWithChainCertAndRootCA/SSL_UnixSocket
I20260926 12:11:17.946511 1832 acceptor_pool.cc:254] collecting diagnostics on the listening RPC socket unix:/tmp/dist-test-taskdqtXn4/test-tmp/rpc-test-483c5e13d2bd4ca0a7652614738b65c1.sock every 8 connection(s)
I20260926 12:11:17.947186 1833 acceptor_pool.cc:254] collecting diagnostics on the listening RPC socket unix:/tmp/dist-test-taskdqtXn4/test-tmp/rpc-test-483c5e13d2bd4ca0a7652614738b65c1.sock every 8 connection(s)
/data0/somelongdirectorytoavoidrpathissues/src/kudu/src/kudu/rpc/rpc-test.cc:303: Failure
Failed
Bad status: Runtime error: could not verify certificate chain (error with cert: subject=CN = localhost, ST = sadfjas, C = AS, emailAddress = sdflkdsajf, O = lskdfjlsad, OU = sldfkja, issuer=C = AS, ST = ASDfkjdhf, L = lskdjf, O = saldfja, OU = skdjf, CN = localhost, emailAddress = sadjflkadsj): : certificate has expired
Google Test trace:
/data0/somelongdirectorytoavoidrpathissues/src/kudu/src/kudu/rpc/rpc-test.cc:300: Connecting to unix:/tmp/dist-test-taskdqtXn4/test-tmp/rpc-test-483c5e13d2bd4ca0a7652614738b65c1.sock
I20260926 12:11:17.965164 1724 test_util.cc:175] -----------------------------------------------
I20260926 12:11:17.965314 1724 test_util.cc:176] Had fatal failures, leaving test files at /tmp/dist-test-taskdqtXn4/test-tmp/rpc-test.2.Parameters_TestRpc.TestCallWithChainCertAndRootCA_SSL_UnixSocket.1790424674518604-1724-0
[ FAILED ] Parameters/TestRpc.TestCallWithChainCertAndRootCA/SSL_UnixSocket, where GetParam() = (true, true) (46 ms)
[ RUN ] Parameters/TestRpc.TestCallWithBadPasswordProtectedKey/SSL_UnixSocket
[ OK ] Parameters/TestRpc.TestCallWithBadPasswordProtectedKey/SSL_UnixSocket (28 ms)
[ RUN ] Parameters/TestRpc.TestInvalidMethodCall/SSL_UnixSocket
I20260926 12:11:18.017719 1869 acceptor_pool.cc:254] collecting diagnostics on the listening RPC socket unix:/tmp/dist-test-taskdqtXn4/test-tmp/rpc-test-c75834479d974fba81401fc1ca547cfd.sock every 8 connection(s)
I20260926 12:11:18.018558 1870 acceptor_pool.cc:254] collecting diagnostics on the listening RPC socket unix:/tmp/dist-test-taskdqtXn4/test-tmp/rpc-test-c75834479d974fba81401fc1ca547cfd.sock every 8 connection(s)
I20260926 12:11:18.021740 1724 rpc-test.cc:406] Connecting to unix:/tmp/dist-test-taskdqtXn4/test-tmp/rpc-test-c75834479d974fba81401fc1ca547cfd.sock
W20260926 12:11:18.047459 1866 connection.cc:196] Error closing socket: Network error: TlsSocket::Close: Broken pipe
[ OK ] Parameters/TestRpc.TestInvalidMethodCall/SSL_UnixSocket (58 ms)
[ RUN ] Parameters/TestRpc.TestHighFDs/SSL_UnixSocket
I20260926 12:11:18.260464 1894 acceptor_pool.cc:254] collecting diagnostics on the listening RPC socket unix:/tmp/dist-test-taskdqtXn4/test-tmp/rpc-test-c40e0b3fbcfd40319c16273e1e2fdcab.sock every 8 connection(s)
I20260926 12:11:18.261265 1895 acceptor_pool.cc:254] collecting diagnostics on the listening RPC socket unix:/tmp/dist-test-taskdqtXn4/test-tmp/rpc-test-c40e0b3fbcfd40319c16273e1e2fdcab.sock every 8 connection(s)
W20260926 12:11:18.309114 1891 connection.cc:196] Error closing socket: Network error: TlsSocket::Close: Broken pipe
[ OK ] Parameters/TestRpc.TestHighFDs/SSL_UnixSocket (268 ms)
[ RUN ] Parameters/TestRpc.TestConnectionAlwaysKeepalive/SSL_UnixSocket
I20260926 12:11:18.339198 1917 acceptor_pool.cc:254] collecting diagnostics on the listening RPC socket unix:/tmp/dist-test-taskdqtXn4/test-tmp/rpc-test-f89eecdb9e0542ccad3a98d8efb553f2.sock every 8 connection(s)
I20260926 12:11:18.339896 1918 acceptor_pool.cc:254] collecting diagnostics on the listening RPC socket unix:/tmp/dist-test-taskdqtXn4/test-tmp/rpc-test-f89eecdb9e0542ccad3a98d8efb553f2.sock every 8 connection(s)
I20260926 12:11:18.342654 1724 rpc-test.cc:532] Connecting to unix:/tmp/dist-test-taskdqtXn4/test-tmp/rpc-test-f89eecdb9e0542ccad3a98d8efb553f2.sock
W20260926 12:11:21.370354 1916 connection.cc:196] Error closing socket: Network error: TlsSocket::Close: Broken pipe
[ OK ] Parameters/TestRpc.TestConnectionAlwaysKeepalive/SSL_UnixSocket (3054 ms)
[ RUN ] Parameters/TestRpc.TestReopenOutboundConnections/SSL_UnixSocket
I20260926 12:11:21.396943 1940 acceptor_pool.cc:254] collecting diagnostics on the listening RPC socket unix:/tmp/dist-test-taskdqtXn4/test-tmp/rpc-test-b4fb92d1e9a24de29f0d359c70880f28.sock every 8 connection(s)
I20260926 12:11:21.397647 1941 acceptor_pool.cc:254] collecting diagnostics on the listening RPC socket unix:/tmp/dist-test-taskdqtXn4/test-tmp/rpc-test-b4fb92d1e9a24de29f0d359c70880f28.sock every 8 connection(s)
I20260926 12:11:21.400571 1724 rpc-test.cc:658] Connecting to unix:/tmp/dist-test-taskdqtXn4/test-tmp/rpc-test-b4fb92d1e9a24de29f0d359c70880f28.sock
W20260926 12:11:21.433779 1939 connection.cc:196] Error closing socket: Network error: TlsSocket::Close: Broken pipe
W20260926 12:11:21.442061 1939 connection.cc:196] Error closing socket: Network error: TlsSocket::Close: Broken pipe
W20260926 12:11:21.451553 1939 connection.cc:196] Error closing socket: Network error: TlsSocket::Close: Broken pipe
W20260926 12:11:21.459761 1939 connection.cc:196] Error closing socket: Network error: TlsSocket::Close: Broken pipe
W20260926 12:11:21.467896 1939 connection.cc:196] Error closing socket: Network error: TlsSocket::Close: Broken pipe
W20260926 12:11:21.477120 1939 connection.cc:196] Error closing socket: Network error: TlsSocket::Close: Broken pipe
W20260926 12:11:21.486066 1939 connection.cc:196] Error closing socket: Network error: TlsSocket::Close: Broken pipe
W20260926 12:11:21.499678 1939 connection.cc:196] Error closing socket: Network error: TlsSocket::Close: Broken pipe
W20260926 12:11:21.507496 1939 connection.cc:196] Error closing socket: Network error: TlsSocket::Close: Broken pipe
W20260926 12:11:21.517454 1939 connection.cc:196] Error closing socket: Network error: TlsSocket::Close: Broken pipe
W20260926 12:11:21.526983 1939 connection.cc:196] Error closing socket: Network error: TlsSocket::Close: Broken pipe
W20260926 12:11:21.536731 1939 connection.cc:196] Error closing socket: Network error: TlsSocket::Close: Broken pipe
W20260926 12:11:21.546188 1939 connection.cc:196] Error closing socket: Network error: TlsSocket::Close: Broken pipe
W20260926 12:11:21.555469 1939 connection.cc:196] Error closing socket: Network error: TlsSocket::Close: Broken pipe
W20260926 12:11:21.555496 1940 acceptor_pool.cc:285] unable to collect diagnostics on RPC socket unix:/tmp/dist-test-taskdqtXn4/test-tmp/rpc-test-b4fb92d1e9a24de29f0d359c70880f28.sock: Not implemented: netlink diagnostics is currently supported only on IPv4 TCP sockets
W20260926 12:11:21.563771 1939 connection.cc:196] Error closing socket: Network error: TlsSocket::Close: Broken pipe
W20260926 12:11:21.573117 1939 connection.cc:196] Error closing socket: Network error: TlsSocket::Close: Broken pipe
W20260926 12:11:21.582984 1939 connection.cc:196] Error closing socket: Network error: TlsSocket::Close: Broken pipe
W20260926 12:11:21.592408 1939 connection.cc:196] Error closing socket: Network error: TlsSocket::Close: Broken pipe
W20260926 12:11:21.601367 1939 connection.cc:196] Error closing socket: Network error: TlsSocket::Close: Broken pipe
W20260926 12:11:21.610350 1939 connection.cc:196] Error closing socket: Network error: TlsSocket::Close: Broken pipe
W20260926 12:11:21.619861 1939 connection.cc:196] Error closing socket: Network error: TlsSocket::Close: Broken pipe
W20260926 12:11:21.629026 1939 connection.cc:196] Error closing socket: Network error: TlsSocket::Close: Broken pipe
W20260926 12:11:21.638556 1939 connection.cc:196] Error closing socket: Network error: TlsSocket::Close: Broken pipe
W20260926 12:11:21.648013 1939 connection.cc:196] Error closing socket: Network error: TlsSocket::Close: Broken pipe
W20260926 12:11:21.657231 1939 connection.cc:196] Error closing socket: Network error: TlsSocket::Close: Broken pipe
W20260926 12:11:21.666152 1939 connection.cc:196] Error closing socket: Network error: TlsSocket::Close: Broken pipe
W20260926 12:11:21.675328 1939 connection.cc:196] Error closing socket: Network error: TlsSocket::Close: Broken pipe
W20260926 12:11:21.686925 1939 connection.cc:196] Error closing socket: Network error: TlsSocket::Close: Broken pipe
W20260926 12:11:21.694692 1939 connection.cc:196] Error closing socket: Network error: TlsSocket::Close: Broken pipe
W20260926 12:11:21.702440 1939 connection.cc:196] Error closing socket: Network error: TlsSocket::Close: Broken pipe
W20260926 12:11:21.710559 1939 connection.cc:196] Error closing socket: Network error: TlsSocket::Close: Broken pipe
W20260926 12:11:21.720695 1939 connection.cc:196] Error closing socket: Network error: TlsSocket::Close: Broken pipe
[ OK ] Parameters/TestRpc.TestReopenOutboundConnections/SSL_UnixSocket (349 ms)
[ RUN ] Parameters/TestRpc.TestConnectionNetworkPlane/SSL_UnixSocket
I20260926 12:11:21.746241 1963 acceptor_pool.cc:254] collecting diagnostics on the listening RPC socket unix:/tmp/dist-test-taskdqtXn4/test-tmp/rpc-test-d083256d0ad8408cba6f29756087465d.sock every 8 connection(s)
I20260926 12:11:21.747087 1964 acceptor_pool.cc:254] collecting diagnostics on the listening RPC socket unix:/tmp/dist-test-taskdqtXn4/test-tmp/rpc-test-d083256d0ad8408cba6f29756087465d.sock every 8 connection(s)
I20260926 12:11:21.749809 1724 rpc-test.cc:772] Connecting to unix:/tmp/dist-test-taskdqtXn4/test-tmp/rpc-test-d083256d0ad8408cba6f29756087465d.sock
W20260926 12:11:21.783581 1962 connection.cc:196] Error closing socket: Network error: TlsSocket::Close: Broken pipe
[ OK ] Parameters/TestRpc.TestConnectionNetworkPlane/SSL_UnixSocket (63 ms)
[ RUN ] Parameters/TestRpc.TestTCPKeepalive/SSL_UnixSocket
I20260926 12:11:21.807698 1988 acceptor_pool.cc:254] collecting diagnostics on the listening RPC socket unix:/tmp/dist-test-taskdqtXn4/test-tmp/rpc-test-6e51f310f2704f0598a16eca16365ed1.sock every 8 connection(s)
I20260926 12:11:21.808310 1989 acceptor_pool.cc:254] collecting diagnostics on the listening RPC socket unix:/tmp/dist-test-taskdqtXn4/test-tmp/rpc-test-6e51f310f2704f0598a16eca16365ed1.sock every 8 connection(s)
I20260926 12:11:21.842847 1992 rpc-test-base.h:222] got call: sleep_micros: 8000000 deferred: true
I20260926 12:11:29.846654 1992 rpcz_store.cc:275] Call kudu.rpc.GenericCalculatorService.Sleep from unix:<unnamed> (request call id 0) took 8003 ms. Trace:
I20260926 12:11:29.847084 1992 rpcz_store.cc:276] 0926 12:11:21.842704 (+ 0us) service_pool.cc:170] Inserting onto call queue
0926 12:11:21.842799 (+ 95us) service_pool.cc:227] Handling call
0926 12:11:29.846468 (+8003669us) inbound_call.cc:173] Queueing success response
Metrics: {}
W20260926 12:11:29.853609 1985 connection.cc:196] Error closing socket: Network error: TlsSocket::Close: Broken pipe
[ OK ] Parameters/TestRpc.TestTCPKeepalive/SSL_UnixSocket (8072 ms)
[ RUN ] Parameters/TestRpc.TestMaxSmallSidecars/SSL_UnixSocket
I20260926 12:11:29.876713 2014 acceptor_pool.cc:254] collecting diagnostics on the listening RPC socket unix:/tmp/dist-test-taskdqtXn4/test-tmp/rpc-test-569b7f4791fb415087e7c2b6eb8c000a.sock every 8 connection(s)
I20260926 12:11:29.877578 2015 acceptor_pool.cc:254] collecting diagnostics on the listening RPC socket unix:/tmp/dist-test-taskdqtXn4/test-tmp/rpc-test-569b7f4791fb415087e7c2b6eb8c000a.sock every 8 connection(s)
W20260926 12:11:30.028142 2011 connection.cc:196] Error closing socket: Network error: TlsSocket::Close: Broken pipe
[ OK ] Parameters/TestRpc.TestMaxSmallSidecars/SSL_UnixSocket (172 ms)
[ RUN ] Parameters/TestRpc.TestCallTimeout/SSL_UnixSocket
I20260926 12:11:30.046780 2039 acceptor_pool.cc:254] collecting diagnostics on the listening RPC socket unix:/tmp/dist-test-taskdqtXn4/test-tmp/rpc-test-bab5a22b6b1d486893cee9a3a091424e.sock every 8 connection(s)
I20260926 12:11:30.047457 2040 acceptor_pool.cc:254] collecting diagnostics on the listening RPC socket unix:/tmp/dist-test-taskdqtXn4/test-tmp/rpc-test-bab5a22b6b1d486893cee9a3a091424e.sock every 8 connection(s)
I20260926 12:11:30.070035 1724 rpc-test-base.h:595] status: Timed out: connection negotiation to unix:/tmp/dist-test-taskdqtXn4/test-tmp/rpc-test-bab5a22b6b1d486893cee9a3a091424e.sock for RPC Sleep timed out after 0.000s (ON_OUTBOUND_QUEUE), seconds elapsed: 0.00236789
I20260926 12:11:30.077370 2043 rpc-test-base.h:222] got call: sleep_micros: 700000
I20260926 12:11:30.270853 1724 rpc-test-base.h:595] status: Timed out: Sleep RPC to unix:/tmp/dist-test-taskdqtXn4/test-tmp/rpc-test-bab5a22b6b1d486893cee9a3a091424e.sock timed out after 0.200s (SENT), seconds elapsed: 0.200433
I20260926 12:11:30.272182 2042 rpc-test-base.h:222] got call: sleep_micros: 2000000
W20260926 12:11:30.778002 2043 rpcz_store.cc:267] Call kudu.rpc.GenericCalculatorService.Sleep from unix:<unnamed> (request call id 1) took 700 ms (client timeout 200 ms). Trace:
W20260926 12:11:30.778383 2043 rpcz_store.cc:269] 0926 12:11:30.077245 (+ 0us) service_pool.cc:170] Inserting onto call queue
0926 12:11:30.077334 (+ 89us) service_pool.cc:227] Handling call
0926 12:11:30.777950 (+700616us) inbound_call.cc:173] Queueing success response
Metrics: {}
I20260926 12:11:31.773337 1724 rpc-test-base.h:595] status: Timed out: Sleep RPC to unix:/tmp/dist-test-taskdqtXn4/test-tmp/rpc-test-bab5a22b6b1d486893cee9a3a091424e.sock timed out after 1.500s (SENT), seconds elapsed: 1.50216
W20260926 12:11:31.776099 2036 connection.cc:196] Error closing socket: Network error: TlsSocket::Close: Broken pipe
W20260926 12:11:32.272671 2042 rpcz_store.cc:267] Call kudu.rpc.GenericCalculatorService.Sleep from unix:<unnamed> (request call id 2) took 2000 ms (client timeout 1500 ms). Trace:
W20260926 12:11:32.272933 2042 rpcz_store.cc:269] 0926 12:11:30.271992 (+ 0us) service_pool.cc:170] Inserting onto call queue
0926 12:11:30.272121 (+ 129us) service_pool.cc:227] Handling call
0926 12:11:32.272623 (+2000502us) inbound_call.cc:173] Queueing success response
Metrics: {}
W20260926 12:11:32.273447 2036 connection.cc:441] server connection from unix:<unnamed> torn down before Call kudu.rpc.GenericCalculatorService.Sleep from unix:<unnamed> (request call id 2) could send its response
[ OK ] Parameters/TestRpc.TestCallTimeout/SSL_UnixSocket (2244 ms)
[ RUN ] Parameters/TestRpc.TestServerShutsDown/SSL_UnixSocket
I20260926 12:11:32.279726 1724 rpc-test.cc:1125] Connecting to 0.0.0.0:40545
W20260926 12:11:32.288781 2056 negotiation.cc:337] Failed RPC negotiation. Trace:
0926 12:11:32.287439 (+ 0us) reactor.cc:625] Submitting negotiation task for client connection to 0.0.0.0:40545 (local address 127.0.0.1:54552)
0926 12:11:32.287866 (+ 427us) negotiation.cc:107] Waiting for socket to connect
0926 12:11:32.287894 (+ 28us) client_negotiation.cc:174] Beginning negotiation
0926 12:11:32.288126 (+ 232us) client_negotiation.cc:252] Sending NEGOTIATE NegotiatePB request
0926 12:11:32.288330 (+ 204us) negotiation.cc:327] Negotiation complete: Network error: Client connection negotiation failed: client connection to 0.0.0.0:40545: BlockingWrite error: write error: Broken pipe (error 32)
Metrics: {"client-negotiator.queue_time_us":109}
[ OK ] Parameters/TestRpc.TestServerShutsDown/SSL_UnixSocket (12 ms)
[ RUN ] Parameters/TestRpc.TimedOutOnResponseMetric/SSL_UnixSocket
I20260926 12:11:32.360811 2073 acceptor_pool.cc:254] collecting diagnostics on the listening RPC socket unix:/tmp/dist-test-taskdqtXn4/test-tmp/rpc-test-deeba6e8307545aa8ee8edcb6d8baf98.sock every 8 connection(s)
I20260926 12:11:32.361464 2074 acceptor_pool.cc:254] collecting diagnostics on the listening RPC socket unix:/tmp/dist-test-taskdqtXn4/test-tmp/rpc-test-deeba6e8307545aa8ee8edcb6d8baf98.sock every 8 connection(s)
W20260926 12:11:32.598960 2077 rpcz_store.cc:267] Call kudu.rpc_test.CalculatorService.Sleep from unix:<unnamed> (request call id 3) took 50 ms (client timeout 25 ms). Trace:
W20260926 12:11:32.599206 2077 rpcz_store.cc:269] 0926 12:11:32.548464 (+ 0us) service_pool.cc:170] Inserting onto call queue
0926 12:11:32.548569 (+ 105us) service_pool.cc:227] Handling call
0926 12:11:32.598901 (+ 50332us) inbound_call.cc:173] Queueing success response
Related trace 'test_child':
Metrics: {"test_sleep_us":50000,"child_traces":[["test_child",{"related_trace_metric":1}]]}
W20260926 12:11:32.658008 2077 rpcz_store.cc:267] Call kudu.rpc_test.CalculatorService.Sleep from unix:<unnamed> (request call id 4) took 50 ms (client timeout 50 ms). Trace:
W20260926 12:11:32.658253 2077 rpcz_store.cc:269] 0926 12:11:32.607430 (+ 0us) service_pool.cc:170] Inserting onto call queue
0926 12:11:32.607545 (+ 115us) service_pool.cc:227] Handling call
0926 12:11:32.657917 (+ 50372us) inbound_call.cc:173] Queueing success response
Related trace 'test_child':
Metrics: {"test_sleep_us":50000,"child_traces":[["test_child",{"related_trace_metric":1}]]}
[ OK ] Parameters/TestRpc.TimedOutOnResponseMetric/SSL_UnixSocket (374 ms)
[ RUN ] Parameters/TestRpc.AcceptorDispatchingTimesMetric/SSL_UnixSocket
I20260926 12:11:32.682906 2098 acceptor_pool.cc:254] collecting diagnostics on the listening RPC socket 0.0.0.0:45949 every 8 connection(s)
I20260926 12:11:32.683599 2099 acceptor_pool.cc:254] collecting diagnostics on the listening RPC socket 0.0.0.0:45949 every 8 connection(s)
W20260926 12:11:32.688817 2094 negotiation.cc:337] Failed RPC negotiation. Trace:
0926 12:11:32.686777 (+ 0us) reactor.cc:625] Submitting negotiation task for server connection from 127.0.0.1:59162 (local address 127.0.0.1:45949)
0926 12:11:32.687326 (+ 549us) server_negotiation.cc:206] Beginning negotiation
0926 12:11:32.687355 (+ 29us) server_negotiation.cc:399] Waiting for connection header
0926 12:11:32.687658 (+ 303us) negotiation.cc:327] Negotiation complete: Network error: Server connection negotiation failed: server connection from 127.0.0.1:59162: BlockingRecv error: recv got EOF from 127.0.0.1:59162 (error 108)
Metrics: {"server-negotiator.queue_time_us":104}
[ OK ] Parameters/TestRpc.AcceptorDispatchingTimesMetric/SSL_UnixSocket (25 ms)
[ RUN ] Parameters/TestRpc.TestRpcCallbackDestroysMessenger/SSL_UnixSocket
[ OK ] Parameters/TestRpc.TestRpcCallbackDestroysMessenger/SSL_UnixSocket (13 ms)
[ RUN ] Parameters/TestRpc.TestApplicationFeatureFlag/SSL_UnixSocket
I20260926 12:11:32.718699 2123 acceptor_pool.cc:254] collecting diagnostics on the listening RPC socket unix:/tmp/dist-test-taskdqtXn4/test-tmp/rpc-test-ed6acdb0ae5c416cb171f43829c23d92.sock every 8 connection(s)
I20260926 12:11:32.719362 2124 acceptor_pool.cc:254] collecting diagnostics on the listening RPC socket unix:/tmp/dist-test-taskdqtXn4/test-tmp/rpc-test-ed6acdb0ae5c416cb171f43829c23d92.sock every 8 connection(s)
W20260926 12:11:32.742550 2120 messenger.cc:357] Unable to handle RPC call: Not implemented: call requires unsupported application feature flags: 99
[ OK ] Parameters/TestRpc.TestApplicationFeatureFlag/SSL_UnixSocket (43 ms)
[ RUN ] Parameters/TestRpc.TestCancellation/SSL_UnixSocket
I20260926 12:11:32.777921 2148 acceptor_pool.cc:254] collecting diagnostics on the listening RPC socket unix:/tmp/dist-test-taskdqtXn4/test-tmp/rpc-test-fa65ecf2608f4f95b45ea5f23242cee1.sock every 8 connection(s)
I20260926 12:11:32.778590 2149 acceptor_pool.cc:254] collecting diagnostics on the listening RPC socket unix:/tmp/dist-test-taskdqtXn4/test-tmp/rpc-test-fa65ecf2608f4f95b45ea5f23242cee1.sock every 8 connection(s)
I20260926 12:11:32.781538 1724 rpc-test.cc:1648] Connecting to unix:/tmp/dist-test-taskdqtXn4/test-tmp/rpc-test-fa65ecf2608f4f95b45ea5f23242cee1.sock
I20260926 12:11:32.871800 1724 rpc-test-base.h:595] status: Aborted: Sleep RPC to unix:/tmp/dist-test-taskdqtXn4/test-tmp/rpc-test-fa65ecf2608f4f95b45ea5f23242cee1.sock is cancelled in state READY, seconds elapsed: 0.000300964
I20260926 12:11:33.057526 1724 rpc-test-base.h:595] status: Aborted: Sleep RPC to unix:/tmp/dist-test-taskdqtXn4/test-tmp/rpc-test-fa65ecf2608f4f95b45ea5f23242cee1.sock is cancelled in state SENT, seconds elapsed: 0.000805793
I20260926 12:11:33.057672 2151 rpc-test-base.h:222] got call: sleep_micros: 510000
I20260926 12:11:33.230487 1724 rpc-test-base.h:595] status: Aborted: Sleep RPC to unix:/tmp/dist-test-taskdqtXn4/test-tmp/rpc-test-fa65ecf2608f4f95b45ea5f23242cee1.sock is cancelled in state SENT, seconds elapsed: 0.000766222
I20260926 12:11:33.230660 2150 rpc-test-base.h:222] got call: sleep_micros: 510000
I20260926 12:11:33.399180 1724 rpc-test-base.h:595] status: Aborted: Sleep RPC to unix:/tmp/dist-test-taskdqtXn4/test-tmp/rpc-test-fa65ecf2608f4f95b45ea5f23242cee1.sock is cancelled in state SENT, seconds elapsed: 0.000848577
W20260926 12:11:33.410029 2152 rpcz_store.cc:267] Call kudu.rpc.GenericCalculatorService.Sleep from unix:<unnamed> (request call id 11) took 11 ms (client timeout 10 ms). Trace:
W20260926 12:11:33.410382 2152 rpcz_store.cc:269] 0926 12:11:33.399131 (+ 0us) service_pool.cc:170] Inserting onto call queue
0926 12:11:33.409899 (+ 10768us) service_pool.cc:214] Skipping call since client already timed out
0926 12:11:33.409988 (+ 89us) inbound_call.cc:173] Queueing failure response
Metrics: {}
I20260926 12:11:33.410895 2152 rpc-test-base.h:222] got call: sleep_micros: 1500000
W20260926 12:11:33.568210 2151 rpcz_store.cc:267] Call kudu.rpc.GenericCalculatorService.Sleep from unix:<unnamed> (request call id 3) took 510 ms (client timeout 10 ms). Trace:
W20260926 12:11:33.568598 2151 rpcz_store.cc:269] 0926 12:11:33.057511 (+ 0us) service_pool.cc:170] Inserting onto call queue
0926 12:11:33.057630 (+ 119us) service_pool.cc:227] Handling call
0926 12:11:33.568149 (+510519us) inbound_call.cc:173] Queueing success response
Metrics: {}
W20260926 12:11:33.741278 2150 rpcz_store.cc:267] Call kudu.rpc.GenericCalculatorService.Sleep from unix:<unnamed> (request call id 7) took 510 ms (client timeout 10 ms). Trace:
W20260926 12:11:33.741611 2150 rpcz_store.cc:269] 0926 12:11:33.230514 (+ 0us) service_pool.cc:170] Inserting onto call queue
0926 12:11:33.230608 (+ 94us) service_pool.cc:227] Handling call
0926 12:11:33.741220 (+510612us) inbound_call.cc:173] Queueing success response
Metrics: {}
I20260926 12:11:34.401384 1724 rpc-test-base.h:595] status: Timed out: Sleep RPC to unix:/tmp/dist-test-taskdqtXn4/test-tmp/rpc-test-fa65ecf2608f4f95b45ea5f23242cee1.sock timed out after 1.000s (SENT), seconds elapsed: 1.00188
I20260926 12:11:34.402700 2150 rpc-test-base.h:222] got call: sleep_micros: 1500000
W20260926 12:11:34.911621 2152 rpcz_store.cc:267] Call kudu.rpc.GenericCalculatorService.Sleep from unix:<unnamed> (request call id 12) took 1511 ms (client timeout 1000 ms). Trace:
W20260926 12:11:34.912073 2152 rpcz_store.cc:269] 0926 12:11:33.400196 (+ 0us) service_pool.cc:170] Inserting onto call queue
0926 12:11:33.410861 (+ 10665us) service_pool.cc:227] Handling call
0926 12:11:34.911448 (+1500587us) inbound_call.cc:173] Queueing success response
Metrics: {}
I20260926 12:11:35.403663 1724 rpc-test-base.h:595] status: Timed out: Sleep RPC to unix:/tmp/dist-test-taskdqtXn4/test-tmp/rpc-test-fa65ecf2608f4f95b45ea5f23242cee1.sock timed out after 1.000s (SENT), seconds elapsed: 1.00183
W20260926 12:11:35.405179 2145 messenger.cc:357] Unable to handle RPC call: Not implemented: call requires unsupported application feature flags: 99, 1
W20260926 12:11:35.406446 2145 messenger.cc:357] Unable to handle RPC call: Not implemented: call requires unsupported application feature flags: 99, 1
W20260926 12:11:35.639144 2145 connection.cc:196] Error closing socket: Network error: TlsSocket::Close: Broken pipe
W20260926 12:11:35.903257 2150 rpcz_store.cc:267] Call kudu.rpc.GenericCalculatorService.Sleep from unix:<unnamed> (request call id 13) took 1500 ms (client timeout 1000 ms). Trace:
W20260926 12:11:35.903576 2150 rpcz_store.cc:269] 0926 12:11:34.402528 (+ 0us) service_pool.cc:170] Inserting onto call queue
0926 12:11:34.402652 (+ 124us) service_pool.cc:227] Handling call
0926 12:11:35.903119 (+1500467us) inbound_call.cc:173] Queueing success response
Metrics: {}
W20260926 12:11:35.904114 2145 connection.cc:441] server connection from unix:<unnamed> torn down before Call kudu.rpc.GenericCalculatorService.Sleep from unix:<unnamed> (request call id 13) could send its response
[ OK ] Parameters/TestRpc.TestCancellation/SSL_UnixSocket (3163 ms)
[ RUN ] Parameters/TestRpc.TestCancellationMultiThreads/SSL_UnixSocket
I20260926 12:11:35.943115 2174 acceptor_pool.cc:254] collecting diagnostics on the listening RPC socket unix:/tmp/dist-test-taskdqtXn4/test-tmp/rpc-test-8c399b2a40a0491db60ea3c4392430e6.sock every 8 connection(s)
I20260926 12:11:35.943969 2175 acceptor_pool.cc:254] collecting diagnostics on the listening RPC socket unix:/tmp/dist-test-taskdqtXn4/test-tmp/rpc-test-8c399b2a40a0491db60ea3c4392430e6.sock every 8 connection(s)
I20260926 12:11:35.947088 1724 rpc-test.cc:1808] Connecting to unix:/tmp/dist-test-taskdqtXn4/test-tmp/rpc-test-8c399b2a40a0491db60ea3c4392430e6.sock
I20260926 12:11:36.090035 2188 test_util.cc:268] Using random seed: -1140724398
I20260926 12:11:36.091118 2189 test_util.cc:268] Using random seed: -1140723246
I20260926 12:11:36.092482 2190 test_util.cc:268] Using random seed: -1140721878
I20260926 12:11:36.094197 2191 test_util.cc:268] Using random seed: -1140720296
I20260926 12:11:36.095564 2192 test_util.cc:268] Using random seed: -1140718913
I20260926 12:11:36.097082 2193 test_util.cc:268] Using random seed: -1140717418
I20260926 12:11:36.098599 2194 test_util.cc:268] Using random seed: -1140715895
I20260926 12:11:36.100142 2195 test_util.cc:268] Using random seed: -1140714365
I20260926 12:11:36.101512 2196 test_util.cc:268] Using random seed: -1140712988
I20260926 12:11:36.103145 2197 test_util.cc:268] Using random seed: -1140711329
I20260926 12:11:36.104638 2198 test_util.cc:268] Using random seed: -1140709855
I20260926 12:11:36.106132 2199 test_util.cc:268] Using random seed: -1140708374
I20260926 12:11:36.107791 2200 test_util.cc:268] Using random seed: -1140706728
I20260926 12:11:36.111222 2201 test_util.cc:268] Using random seed: -1140703357
I20260926 12:11:36.113040 2202 test_util.cc:268] Using random seed: -1140701535
I20260926 12:11:36.114627 2203 test_util.cc:268] Using random seed: -1140699885
I20260926 12:11:36.116140 2204 test_util.cc:268] Using random seed: -1140698338
I20260926 12:11:36.117436 2205 test_util.cc:268] Using random seed: -1140697053
I20260926 12:11:36.118773 2206 test_util.cc:268] Using random seed: -1140695695
I20260926 12:11:36.120694 2207 test_util.cc:268] Using random seed: -1140693804
I20260926 12:11:36.122355 2208 test_util.cc:268] Using random seed: -1140692188
I20260926 12:11:36.123687 2209 test_util.cc:268] Using random seed: -1140690841
I20260926 12:11:36.125150 2210 test_util.cc:268] Using random seed: -1140689355
I20260926 12:11:36.126478 2211 test_util.cc:268] Using random seed: -1140687995
I20260926 12:11:36.127941 2212 test_util.cc:268] Using random seed: -1140686572
I20260926 12:11:36.129454 2213 test_util.cc:268] Using random seed: -1140685082
I20260926 12:11:36.131078 2214 test_util.cc:268] Using random seed: -1140683439
I20260926 12:11:36.132611 2215 test_util.cc:268] Using random seed: -1140681914
I20260926 12:11:36.135051 2216 test_util.cc:268] Using random seed: -1140679466
I20260926 12:11:36.136518 2217 test_util.cc:268] Using random seed: -1140677991
W20260926 12:11:55.139497 2171 connection.cc:196] Error closing socket: Network error: TlsSocket::Close: Broken pipe
[ OK ] Parameters/TestRpc.TestCancellationMultiThreads/SSL_UnixSocket (19242 ms)
[ RUN ] Parameters/TestRpc.TestCallId/SSL_UnixSocket
I20260926 12:11:55.173384 2231 acceptor_pool.cc:254] collecting diagnostics on the listening RPC socket unix:/tmp/dist-test-taskdqtXn4/test-tmp/rpc-test-b6d7343e10394833943fc5a39bc04e64.sock every 8 connection(s)
I20260926 12:11:55.174182 2232 acceptor_pool.cc:254] collecting diagnostics on the listening RPC socket unix:/tmp/dist-test-taskdqtXn4/test-tmp/rpc-test-b6d7343e10394833943fc5a39bc04e64.sock every 8 connection(s)
[ OK ] Parameters/TestRpc.TestCallId/SSL_UnixSocket (59 ms)
[----------] 20 tests from Parameters/TestRpc (37543 ms total)
[----------] Global test environment tear-down
[==========] 21 tests from 2 test suites ran. (40645 ms total)
[ PASSED ] 20 tests.
[ FAILED ] 1 test, listed below:
[ FAILED ] Parameters/TestRpc.TestCallWithChainCertAndRootCA/SSL_UnixSocket, where GetParam() = (true, true)
1 FAILED TEST
I20260926 12:11:55.230822 1724 logging.cc:424] LogThrottler /data0/somelongdirectorytoavoidrpathissues/src/kudu/src/kudu/rpc/acceptor_pool.cc:285: suppressed but not reported on 3 messages since previous log ~33 seconds ago