Diagnosed failure
Parameters/TestRpc.TestCallWithChainCertAndChainCA/SSL_UnixSocket: /data0/somelongdirectorytoavoidrpathissues/src/kudu/src/kudu/rpc/rpc-test.cc:270: Failure
Failed
Bad status: Runtime error: could not verify certificate chain (error with cert: subject=CN = localhost, ST = sadfjas, C = AS, emailAddress = sdflkdsajf, O = lskdfjlsad, OU = sldfkja, issuer=C = AS, ST = ASDfkjdhf, L = lskdjf, O = saldfja, OU = skdjf, CN = localhost, emailAddress = sadjflkadsj): : certificate has expired
Google Test trace:
/data0/somelongdirectorytoavoidrpathissues/src/kudu/src/kudu/rpc/rpc-test.cc:267: Connecting to unix:/tmp/dist-test-taskxODdun/test-tmp/rpc-test-bf5e09d3d66d4515a1489c3082ac8069.sock
I20260924 03:09:24.547170 6628 test_util.cc:175] -----------------------------------------------
I20260924 03:09:24.547257 6628 test_util.cc:176] Had fatal failures, leaving test files at /tmp/dist-test-taskxODdun/test-tmp/rpc-test.6.Parameters_TestRpc.TestCallWithChainCertAndChainCA_SSL_UnixSocket.1790219364436944-6628-0
Full log
Note: This is test shard 7 of 8.
[==========] Running 21 tests from 2 test suites.
[----------] Global test environment set-up.
[----------] 20 tests from Parameters/TestRpc
[ RUN ] Parameters/TestRpc.TestMessengerCreateDestroy/SSL_UnixSocket
WARNING: Logging before InitGoogleLogging() is written to STDERR
I20260924 03:09:24.483916 6628 rpc-test.cc:169] started messenger TestCreateDestroy
[ OK ] Parameters/TestRpc.TestMessengerCreateDestroy/SSL_UnixSocket (31 ms)
[ RUN ] Parameters/TestRpc.TestNegotiationDeadlock/SSL_UnixSocket
I20260924 03:09:24.498773 6648 acceptor_pool.cc:254] collecting diagnostics on the listening RPC socket unix:/tmp/dist-test-taskxODdun/test-tmp/rpc-test-1669c6fc80ff47bcaeebd629ee5680ea.sock every 8 connection(s)
I20260924 03:09:24.499024 6649 acceptor_pool.cc:254] collecting diagnostics on the listening RPC socket unix:/tmp/dist-test-taskxODdun/test-tmp/rpc-test-1669c6fc80ff47bcaeebd629ee5680ea.sock every 8 connection(s)
[ OK ] Parameters/TestRpc.TestNegotiationDeadlock/SSL_UnixSocket (30 ms)
[ RUN ] Parameters/TestRpc.TestCallWithChainCertAndChainCA/SSL_UnixSocket
I20260924 03:09:24.535262 6664 acceptor_pool.cc:254] collecting diagnostics on the listening RPC socket unix:/tmp/dist-test-taskxODdun/test-tmp/rpc-test-bf5e09d3d66d4515a1489c3082ac8069.sock every 8 connection(s)
I20260924 03:09:24.535550 6665 acceptor_pool.cc:254] collecting diagnostics on the listening RPC socket unix:/tmp/dist-test-taskxODdun/test-tmp/rpc-test-bf5e09d3d66d4515a1489c3082ac8069.sock every 8 connection(s)
/data0/somelongdirectorytoavoidrpathissues/src/kudu/src/kudu/rpc/rpc-test.cc:270: Failure
Failed
Bad status: Runtime error: could not verify certificate chain (error with cert: subject=CN = localhost, ST = sadfjas, C = AS, emailAddress = sdflkdsajf, O = lskdfjlsad, OU = sldfkja, issuer=C = AS, ST = ASDfkjdhf, L = lskdjf, O = saldfja, OU = skdjf, CN = localhost, emailAddress = sadjflkadsj): : certificate has expired
Google Test trace:
/data0/somelongdirectorytoavoidrpathissues/src/kudu/src/kudu/rpc/rpc-test.cc:267: Connecting to unix:/tmp/dist-test-taskxODdun/test-tmp/rpc-test-bf5e09d3d66d4515a1489c3082ac8069.sock
I20260924 03:09:24.547170 6628 test_util.cc:175] -----------------------------------------------
I20260924 03:09:24.547257 6628 test_util.cc:176] Had fatal failures, leaving test files at /tmp/dist-test-taskxODdun/test-tmp/rpc-test.6.Parameters_TestRpc.TestCallWithChainCertAndChainCA_SSL_UnixSocket.1790219364436944-6628-0
[ FAILED ] Parameters/TestRpc.TestCallWithChainCertAndChainCA/SSL_UnixSocket, where GetParam() = (true, true) (29 ms)
[ RUN ] Parameters/TestRpc.TestCallWithPasswordProtectedKey/SSL_UnixSocket
I20260924 03:09:24.559114 6689 acceptor_pool.cc:254] collecting diagnostics on the listening RPC socket unix:/tmp/dist-test-taskxODdun/test-tmp/rpc-test-5c34fb3c0a614672ac85a6e837f855ae.sock every 8 connection(s)
I20260924 03:09:24.559376 6690 acceptor_pool.cc:254] collecting diagnostics on the listening RPC socket unix:/tmp/dist-test-taskxODdun/test-tmp/rpc-test-5c34fb3c0a614672ac85a6e837f855ae.sock every 8 connection(s)
W20260924 03:09:24.593304 6686 connection.cc:196] Error closing socket: Network error: TlsSocket::Close: Broken pipe
[ OK ] Parameters/TestRpc.TestCallWithPasswordProtectedKey/SSL_UnixSocket (50 ms)
[ RUN ] Parameters/TestRpc.TestCallToBadServer/SSL_UnixSocket
I20260924 03:09:24.611531 6628 rpc-test.cc:394] Status: Network error: Client connection negotiation failed: client connection to 0.0.0.0:0: connect: Connection refused (error 111)
I20260924 03:09:24.612196 6628 rpc-test.cc:394] Status: Network error: Client connection negotiation failed: client connection to 0.0.0.0:0: connect: Connection refused (error 111)
I20260924 03:09:24.612730 6628 rpc-test.cc:394] Status: Network error: Client connection negotiation failed: client connection to 0.0.0.0:0: connect: Connection refused (error 111)
I20260924 03:09:24.613234 6628 rpc-test.cc:394] Status: Network error: Client connection negotiation failed: client connection to 0.0.0.0:0: connect: Connection refused (error 111)
I20260924 03:09:24.613812 6628 rpc-test.cc:394] Status: Network error: Client connection negotiation failed: client connection to 0.0.0.0:0: connect: Connection refused (error 111)
[ OK ] Parameters/TestRpc.TestCallToBadServer/SSL_UnixSocket (17 ms)
[ RUN ] Parameters/TestRpc.TestWrongService/SSL_UnixSocket
I20260924 03:09:24.628785 6724 acceptor_pool.cc:254] collecting diagnostics on the listening RPC socket unix:/tmp/dist-test-taskxODdun/test-tmp/rpc-test-f5b40784a7a241afab6ae714106b6065.sock every 8 connection(s)
I20260924 03:09:24.629073 6725 acceptor_pool.cc:254] collecting diagnostics on the listening RPC socket unix:/tmp/dist-test-taskxODdun/test-tmp/rpc-test-f5b40784a7a241afab6ae714106b6065.sock every 8 connection(s)
I20260924 03:09:24.668129 6721 messenger.cc:345] service WrongServiceName not registered on TestServer
W20260924 03:09:24.669474 6721 connection.cc:196] Error closing socket: Network error: TlsSocket::Close: Broken pipe
[ OK ] Parameters/TestRpc.TestWrongService/SSL_UnixSocket (61 ms)
[ RUN ] Parameters/TestRpc.TestConnectionKeepalive/SSL_UnixSocket
I20260924 03:09:24.695446 6747 acceptor_pool.cc:254] collecting diagnostics on the listening RPC socket unix:/tmp/dist-test-taskxODdun/test-tmp/rpc-test-1f622a86830e4015b8c11bf7d53cf3fe.sock every 8 connection(s)
I20260924 03:09:24.695694 6748 acceptor_pool.cc:254] collecting diagnostics on the listening RPC socket unix:/tmp/dist-test-taskxODdun/test-tmp/rpc-test-1f622a86830e4015b8c11bf7d53cf3fe.sock every 8 connection(s)
I20260924 03:09:24.696678 6628 rpc-test.cc:488] Connecting to unix:/tmp/dist-test-taskxODdun/test-tmp/rpc-test-1f622a86830e4015b8c11bf7d53cf3fe.sock
W20260924 03:09:25.179319 6760 connection.cc:196] Error closing socket: Network error: TlsSocket::Close: Broken pipe
[ OK ] Parameters/TestRpc.TestConnectionKeepalive/SSL_UnixSocket (1054 ms)
[ RUN ] Parameters/TestRpc.TestClientConnectionMetrics/SSL_UnixSocket
I20260924 03:09:25.759835 6772 acceptor_pool.cc:254] collecting diagnostics on the listening RPC socket unix:/tmp/dist-test-taskxODdun/test-tmp/rpc-test-7b629938641843bc8d770d902750a555.sock every 8 connection(s)
I20260924 03:09:25.760102 6773 acceptor_pool.cc:254] collecting diagnostics on the listening RPC socket unix:/tmp/dist-test-taskxODdun/test-tmp/rpc-test-7b629938641843bc8d770d902750a555.sock every 8 connection(s)
I20260924 03:09:25.761024 6628 rpc-test.cc:569] Connecting to unix:/tmp/dist-test-taskxODdun/test-tmp/rpc-test-7b629938641843bc8d770d902750a555.sock
W20260924 03:09:47.249541 6769 connection.cc:196] Error closing socket: Network error: TlsSocket::Close: Broken pipe
[ OK ] Parameters/TestRpc.TestClientConnectionMetrics/SSL_UnixSocket (21523 ms)
[ RUN ] Parameters/TestRpc.TestCredentialsPolicy/SSL_UnixSocket
I20260924 03:09:47.270383 6795 acceptor_pool.cc:254] collecting diagnostics on the listening RPC socket unix:/tmp/dist-test-taskxODdun/test-tmp/rpc-test-b5e4758e95084bc9b1aecc7eed3f8a7b.sock every 8 connection(s)
I20260924 03:09:47.270622 6796 acceptor_pool.cc:254] collecting diagnostics on the listening RPC socket unix:/tmp/dist-test-taskxODdun/test-tmp/rpc-test-b5e4758e95084bc9b1aecc7eed3f8a7b.sock every 8 connection(s)
I20260924 03:09:47.271586 6628 rpc-test.cc:700] Connecting to unix:/tmp/dist-test-taskxODdun/test-tmp/rpc-test-b5e4758e95084bc9b1aecc7eed3f8a7b.sock
W20260924 03:09:47.306066 6794 connection.cc:196] Error closing socket: Network error: TlsSocket::Close: Broken pipe
W20260924 03:09:47.313910 6794 connection.cc:196] Error closing socket: Network error: TlsSocket::Close: Broken pipe
[ OK ] Parameters/TestRpc.TestCredentialsPolicy/SSL_UnixSocket (60 ms)
[ RUN ] Parameters/TestRpc.TestCallLongerThanKeepalive/SSL_UnixSocket
I20260924 03:09:47.330696 6820 acceptor_pool.cc:254] collecting diagnostics on the listening RPC socket unix:/tmp/dist-test-taskxODdun/test-tmp/rpc-test-ca031a8bfb8e420c94c05075f81288b8.sock every 8 connection(s)
I20260924 03:09:47.330941 6821 acceptor_pool.cc:254] collecting diagnostics on the listening RPC socket unix:/tmp/dist-test-taskxODdun/test-tmp/rpc-test-ca031a8bfb8e420c94c05075f81288b8.sock every 8 connection(s)
I20260924 03:09:47.374416 6824 rpc-test-base.h:222] got call: sleep_micros: 3000000 deferred: true
I20260924 03:09:50.376259 6824 rpcz_store.cc:275] Call kudu.rpc.GenericCalculatorService.Sleep from unix:<unnamed> (request call id 0) took 3001 ms. Trace:
I20260924 03:09:50.376477 6824 rpcz_store.cc:276] 0924 03:09:47.374291 (+ 0us) service_pool.cc:170] Inserting onto call queue
0924 03:09:47.374360 (+ 69us) service_pool.cc:227] Handling call
0924 03:09:50.376204 (+3001844us) inbound_call.cc:173] Queueing success response
Metrics: {}
W20260924 03:09:50.379271 6817 connection.cc:196] Error closing socket: Network error: TlsSocket::Close: Broken pipe
[ OK ] Parameters/TestRpc.TestCallLongerThanKeepalive/SSL_UnixSocket (3065 ms)
[ RUN ] Parameters/TestRpc.TestRpcSidecar/SSL_UnixSocket
I20260924 03:09:50.396178 6845 acceptor_pool.cc:254] collecting diagnostics on the listening RPC socket unix:/tmp/dist-test-taskxODdun/test-tmp/rpc-test-357dd55f5062463cb86511f72caef3e6.sock every 8 connection(s)
I20260924 03:09:50.396481 6846 acceptor_pool.cc:254] collecting diagnostics on the listening RPC socket unix:/tmp/dist-test-taskxODdun/test-tmp/rpc-test-357dd55f5062463cb86511f72caef3e6.sock every 8 connection(s)
W20260924 03:09:50.491570 6842 connection.cc:196] Error closing socket: Network error: TlsSocket::Close: Broken pipe
[ OK ] Parameters/TestRpc.TestRpcSidecar/SSL_UnixSocket (112 ms)
[ RUN ] Parameters/TestRpc.TestRpcSidecarLimits/SSL_UnixSocket
I20260924 03:09:52.556267 6870 acceptor_pool.cc:254] collecting diagnostics on the listening RPC socket unix:/tmp/dist-test-taskxODdun/test-tmp/rpc-test-416600cfc34e489b9914349e1a8bc256.sock every 8 connection(s)
I20260924 03:09:52.556530 6871 acceptor_pool.cc:254] collecting diagnostics on the listening RPC socket unix:/tmp/dist-test-taskxODdun/test-tmp/rpc-test-416600cfc34e489b9914349e1a8bc256.sock every 8 connection(s)
W20260924 03:09:52.574808 6628 serialization.cc:72] Serialized kudu.rpc_test.PushStringsRequestPB (2147483654 bytes) is larger than the maximum configured RPC message size (52428800 bytes). Sending anyway, but peer may reject the data.
W20260924 03:09:52.580801 6867 connection.cc:535] server connection from unix:<unnamed> recv error: Network error: RPC frame had a length of 2147483714, but we only support messages up to 52428800 bytes long.
W20260924 03:09:52.580950 6867 connection.cc:158] shutting down server connection from unix:<unnamed> with pending inbound data: 4/2147483714 bytes received; last active 0 ns ago: status Network error: RPC frame had a length of 2147483714, but we only support messages up to 52428800 bytes long.
W20260924 03:09:52.581290 6883 connection.cc:698] client connection to unix:/tmp/dist-test-taskxODdun/test-tmp/rpc-test-416600cfc34e489b9914349e1a8bc256.sock send error: Network error: failed to write to TLS socket: Broken pipe
W20260924 03:09:52.581635 6883 connection.cc:196] Error closing socket: Network error: TlsSocket::Close: Success
I20260924 03:09:52.598187 6895 acceptor_pool.cc:254] collecting diagnostics on the listening RPC socket unix:/tmp/dist-test-taskxODdun/test-tmp/rpc-test-416600cfc34e489b9914349e1a8bc256.sock every 8 connection(s)
I20260924 03:09:52.598400 6896 acceptor_pool.cc:254] collecting diagnostics on the listening RPC socket unix:/tmp/dist-test-taskxODdun/test-tmp/rpc-test-416600cfc34e489b9914349e1a8bc256.sock every 8 connection(s)
W20260924 03:09:58.283454 6892 connection.cc:577] server connection from unix:<unnamed>: received bad data: 'Corruption: Invalid packet: message had a length of 2147483710, but we only support messages up to 2147483647 bytes
'
W20260924 03:09:58.284159 6908 connection.cc:196] Error closing socket: Network error: TlsSocket::Close: Broken pipe
[ OK ] Parameters/TestRpc.TestRpcSidecarLimits/SSL_UnixSocket (8256 ms)
[ RUN ] Parameters/TestRpc.TestCallTimeoutDoesntAffectNegotiation/SSL_UnixSocket
I20260924 03:09:58.776522 6920 acceptor_pool.cc:254] collecting diagnostics on the listening RPC socket unix:/tmp/dist-test-taskxODdun/test-tmp/rpc-test-d051d5ca5dc74e6ab9769a7e284e0b49.sock every 8 connection(s)
I20260924 03:09:58.776809 6921 acceptor_pool.cc:254] collecting diagnostics on the listening RPC socket unix:/tmp/dist-test-taskxODdun/test-tmp/rpc-test-d051d5ca5dc74e6ab9769a7e284e0b49.sock every 8 connection(s)
W20260924 03:09:58.788867 6916 negotiation.cc:266] Injecting 500ms delay in negotiation
I20260924 03:09:58.839309 6628 rpc-test-base.h:595] status: Timed out: connection negotiation to unix:/tmp/dist-test-taskxODdun/test-tmp/rpc-test-d051d5ca5dc74e6ab9769a7e284e0b49.sock for RPC Sleep timed out after 0.050s (ON_OUTBOUND_QUEUE), seconds elapsed: 0.0510648
W20260924 03:09:59.296249 6917 connection.cc:196] Error closing socket: Network error: TlsSocket::Close: Broken pipe
[ OK ] Parameters/TestRpc.TestCallTimeoutDoesntAffectNegotiation/SSL_UnixSocket (548 ms)
[ RUN ] Parameters/TestRpc.TestRpcHandlerLatencyMetric/SSL_UnixSocket
I20260924 03:09:59.335798 6945 acceptor_pool.cc:254] collecting diagnostics on the listening RPC socket unix:/tmp/dist-test-taskxODdun/test-tmp/rpc-test-60c2e9128f764ad1815e1b6fad62577a.sock every 8 connection(s)
I20260924 03:09:59.336025 6946 acceptor_pool.cc:254] collecting diagnostics on the listening RPC socket unix:/tmp/dist-test-taskxODdun/test-tmp/rpc-test-60c2e9128f764ad1815e1b6fad62577a.sock every 8 connection(s)
I20260924 03:09:59.396776 6628 rpc-test.cc:1236] Sleep() min lat: 20672
I20260924 03:09:59.396876 6628 rpc-test.cc:1237] Sleep() mean lat: 20672
I20260924 03:09:59.396916 6628 rpc-test.cc:1238] Sleep() max lat: 20672
I20260924 03:09:59.396938 6628 rpc-test.cc:1239] Sleep() #calls: 1
[ OK ] Parameters/TestRpc.TestRpcHandlerLatencyMetric/SSL_UnixSocket (102 ms)
[ RUN ] Parameters/TestRpc.TimedOutOnResponseMetricServiceQueue/SSL_UnixSocket
I20260924 03:09:59.425930 6971 acceptor_pool.cc:254] collecting diagnostics on the listening RPC socket unix:/tmp/dist-test-taskxODdun/test-tmp/rpc-test-912fe93d759a40f2ba48322ea5ec6017.sock every 8 connection(s)
I20260924 03:09:59.426156 6972 acceptor_pool.cc:254] collecting diagnostics on the listening RPC socket unix:/tmp/dist-test-taskxODdun/test-tmp/rpc-test-912fe93d759a40f2ba48322ea5ec6017.sock every 8 connection(s)
W20260924 03:09:59.480737 6973 rpcz_store.cc:267] Call kudu.rpc_test.CalculatorService.Sleep from unix:<unnamed> (request call id 2) took 20 ms (client timeout 20 ms). Trace:
W20260924 03:09:59.480887 6973 rpcz_store.cc:269] 0924 03:09:59.460406 (+ 0us) service_pool.cc:170] Inserting onto call queue
0924 03:09:59.480681 (+ 20275us) service_pool.cc:214] Skipping call since client already timed out
0924 03:09:59.480720 (+ 39us) inbound_call.cc:173] Queueing failure response
Metrics: {}
W20260924 03:09:59.482086 6968 connection.cc:196] Error closing socket: Network error: TlsSocket::Close: Broken pipe
[ OK ] Parameters/TestRpc.TimedOutOnResponseMetricServiceQueue/SSL_UnixSocket (83 ms)
[ RUN ] Parameters/TestRpc.RpcPendingConnectionsMetric/SSL_UnixSocket
I20260924 03:09:59.489842 6994 acceptor_pool.cc:254] collecting diagnostics on the listening RPC socket 0.0.0.0:33943 every 8 connection(s)
I20260924 03:09:59.490059 6995 acceptor_pool.cc:254] collecting diagnostics on the listening RPC socket 0.0.0.0:33943 every 8 connection(s)
W20260924 03:09:59.491972 6990 negotiation.cc:337] Failed RPC negotiation. Trace:
0924 03:09:59.491378 (+ 0us) reactor.cc:625] Submitting negotiation task for server connection from 127.0.0.1:42996 (local address 127.0.0.1:33943)
0924 03:09:59.491543 (+ 165us) server_negotiation.cc:206] Beginning negotiation
0924 03:09:59.491547 (+ 4us) server_negotiation.cc:399] Waiting for connection header
0924 03:09:59.491687 (+ 140us) negotiation.cc:327] Negotiation complete: Network error: Server connection negotiation failed: server connection from 127.0.0.1:42996: BlockingRecv error: recv got EOF from 127.0.0.1:42996 (error 108)
Metrics: {"server-negotiator.queue_time_us":52}
[ OK ] Parameters/TestRpc.RpcPendingConnectionsMetric/SSL_UnixSocket (19 ms)
[ RUN ] Parameters/TestRpc.TestRpcContextClientDeadline/SSL_UnixSocket
I20260924 03:09:59.513366 7010 acceptor_pool.cc:254] collecting diagnostics on the listening RPC socket unix:/tmp/dist-test-taskxODdun/test-tmp/rpc-test-e874988ab6a74d009b6d6c2ebf11faef.sock every 8 connection(s)
I20260924 03:09:59.513684 7011 acceptor_pool.cc:254] collecting diagnostics on the listening RPC socket unix:/tmp/dist-test-taskxODdun/test-tmp/rpc-test-e874988ab6a74d009b6d6c2ebf11faef.sock every 8 connection(s)
[ OK ] Parameters/TestRpc.TestRpcContextClientDeadline/SSL_UnixSocket (55 ms)
[ RUN ] Parameters/TestRpc.TestApplicationFeatureFlagUnsupportedServer/SSL_UnixSocket
I20260924 03:09:59.581997 7035 acceptor_pool.cc:254] collecting diagnostics on the listening RPC socket unix:/tmp/dist-test-taskxODdun/test-tmp/rpc-test-132e165e16054f1cba631d0f19588e43.sock every 8 connection(s)
I20260924 03:09:59.582214 7036 acceptor_pool.cc:254] collecting diagnostics on the listening RPC socket unix:/tmp/dist-test-taskxODdun/test-tmp/rpc-test-132e165e16054f1cba631d0f19588e43.sock every 8 connection(s)
W20260924 03:09:59.598870 7032 connection.cc:196] Error closing socket: Network error: TlsSocket::Close: Broken pipe
[ OK ] Parameters/TestRpc.TestApplicationFeatureFlagUnsupportedServer/SSL_UnixSocket (42 ms)
[ RUN ] Parameters/TestRpc.TestCancellationAsync/SSL_UnixSocket
I20260924 03:09:59.616734 7060 acceptor_pool.cc:254] collecting diagnostics on the listening RPC socket unix:/tmp/dist-test-taskxODdun/test-tmp/rpc-test-469f8394b2354430a8fd698976f33c36.sock every 8 connection(s)
I20260924 03:09:59.616951 7061 acceptor_pool.cc:254] collecting diagnostics on the listening RPC socket unix:/tmp/dist-test-taskxODdun/test-tmp/rpc-test-469f8394b2354430a8fd698976f33c36.sock every 8 connection(s)
I20260924 03:09:59.617904 6628 rpc-test.cc:1716] Connecting to unix:/tmp/dist-test-taskxODdun/test-tmp/rpc-test-469f8394b2354430a8fd698976f33c36.sock
I20260924 03:09:59.628927 6628 test_util.cc:268] Using random seed: -278755219
I20260924 03:09:59.663312 7064 rpc-test-base.h:240] got call: sleep_micros: 500 pattern: 4294967295 num_repetitions: 2097152 sidecar_idx: 0
I20260924 03:09:59.683180 7063 rpc-test-base.h:240] got call: sleep_micros: 500 pattern: 4294967295 num_repetitions: 2097152 sidecar_idx: 0
I20260924 03:09:59.713127 7062 rpc-test-base.h:240] got call: sleep_micros: 500 pattern: 4294967295 num_repetitions: 2097152 sidecar_idx: 0
I20260924 03:09:59.742749 7063 rpc-test-base.h:240] got call: sleep_micros: 500 pattern: 4294967295 num_repetitions: 2097152 sidecar_idx: 0
I20260924 03:09:59.772732 7062 rpc-test-base.h:240] got call: sleep_micros: 500 pattern: 4294967295 num_repetitions: 2097152 sidecar_idx: 0
I20260924 03:09:59.800278 7064 rpc-test-base.h:240] got call: sleep_micros: 500 pattern: 4294967295 num_repetitions: 2097152 sidecar_idx: 0
I20260924 03:09:59.829384 7062 rpc-test-base.h:240] got call: sleep_micros: 500 pattern: 4294967295 num_repetitions: 2097152 sidecar_idx: 0
W20260924 03:09:59.831609 7057 connection.cc:196] Error closing socket: Network error: TlsSocket::Close: Broken pipe
W20260924 03:09:59.846473 7057 connection.cc:441] server connection from unix:<unnamed> torn down before Call kudu.rpc.GenericCalculatorService.SleepWithSidecar from unix:<unnamed> (request call id 8) could send its response
W20260924 03:09:59.863947 7057 connection.cc:441] server connection from unix:<unnamed> torn down before Call kudu.rpc.GenericCalculatorService.SleepWithSidecar from unix:<unnamed> (request call id 9) could send its response
[ OK ] Parameters/TestRpc.TestCancellationAsync/SSL_UnixSocket (264 ms)
[ RUN ] Parameters/TestRpc.TestPerformanceBySocketType/SSL_UnixSocket
I20260924 03:09:59.893850 7085 acceptor_pool.cc:254] collecting diagnostics on the listening RPC socket unix:/tmp/dist-test-taskxODdun/test-tmp/rpc-test-cbf394d6ecd94697976ed4f8cc2586a8.sock every 8 connection(s)
I20260924 03:09:59.894059 7086 acceptor_pool.cc:254] collecting diagnostics on the listening RPC socket unix:/tmp/dist-test-taskxODdun/test-tmp/rpc-test-cbf394d6ecd94697976ed4f8cc2586a8.sock every 8 connection(s)
I20260924 03:09:59.894994 6628 rpc-test.cc:1846] Connecting to unix:/tmp/dist-test-taskxODdun/test-tmp/rpc-test-cbf394d6ecd94697976ed4f8cc2586a8.sock
I20260924 03:10:02.965031 6628 rpc-test.cc:1859] Sending 1024MB via ssl-enabled unix socket: real 3.057s user 2.820s sys 2.380s
I20260924 03:10:06.091324 6628 rpc-test.cc:1859] Sending 1024MB via ssl-enabled unix socket: real 3.126s user 3.123s sys 2.190s
I20260924 03:10:09.156994 6628 rpc-test.cc:1859] Sending 1024MB via ssl-enabled unix socket: real 3.066s user 2.978s sys 2.241s
I20260924 03:10:12.245183 6628 rpc-test.cc:1859] Sending 1024MB via ssl-enabled unix socket: real 3.088s user 2.933s sys 2.291s
I20260924 03:10:15.394423 6628 rpc-test.cc:1859] Sending 1024MB via ssl-enabled unix socket: real 3.149s user 3.125s sys 2.227s
W20260924 03:10:15.395563 7082 connection.cc:196] Error closing socket: Network error: TlsSocket::Close: Broken pipe
[ OK ] Parameters/TestRpc.TestPerformanceBySocketType/SSL_UnixSocket (15535 ms)
[----------] 20 tests from Parameters/TestRpc (50946 ms total)
[----------] 1 test from Parameters/TestRpcSocketTxRxQueue
[ RUN ] Parameters/TestRpcSocketTxRxQueue.AcceptorRxQueueSizeMetric/0
I20260924 03:10:15.407259 7110 acceptor_pool.cc:254] collecting diagnostics on the listening RPC socket 0.0.0.0:42265 every 1 connection(s)
I20260924 03:10:15.407498 7111 acceptor_pool.cc:254] collecting diagnostics on the listening RPC socket 0.0.0.0:42265 every 1 connection(s)
W20260924 03:10:15.409140 7106 negotiation.cc:337] Failed RPC negotiation. Trace:
0924 03:10:15.408780 (+ 0us) reactor.cc:625] Submitting negotiation task for server connection from 127.0.0.1:48646 (local address 127.0.0.1:42265)
0924 03:10:15.408921 (+ 141us) server_negotiation.cc:206] Beginning negotiation
0924 03:10:15.408925 (+ 4us) server_negotiation.cc:399] Waiting for connection header
0924 03:10:15.409042 (+ 117us) negotiation.cc:327] Negotiation complete: Network error: Server connection negotiation failed: server connection from 127.0.0.1:48646: BlockingRecv error: recv got EOF from 127.0.0.1:48646 (error 108)
Metrics: {"server-negotiator.queue_time_us":43}
[ OK ] Parameters/TestRpcSocketTxRxQueue.AcceptorRxQueueSizeMetric/0 (10 ms)
[----------] 1 test from Parameters/TestRpcSocketTxRxQueue (10 ms total)
[----------] Global test environment tear-down
[==========] 21 tests from 2 test suites ran. (50957 ms total)
[ PASSED ] 20 tests.
[ FAILED ] 1 test, listed below:
[ FAILED ] Parameters/TestRpc.TestCallWithChainCertAndChainCA/SSL_UnixSocket, where GetParam() = (true, true)
1 FAILED TEST