Diagnosed failure

Parameters/TestRpc.TestCallWithChainCertAndChainCA/SSL_UnixSocket: /data0/somelongdirectorytoavoidrpathissues/src/kudu/src/kudu/rpc/rpc-test.cc:270: Failure
Failed
Bad status: Runtime error: could not verify certificate chain (error with cert: subject=CN = localhost, ST = sadfjas, C = AS, emailAddress = sdflkdsajf, O = lskdfjlsad, OU = sldfkja, issuer=C = AS, ST = ASDfkjdhf, L = lskdjf, O = saldfja, OU = skdjf, CN = localhost, emailAddress = sadjflkadsj): : certificate has expired
Google Test trace:
/data0/somelongdirectorytoavoidrpathissues/src/kudu/src/kudu/rpc/rpc-test.cc:267: Connecting to unix:/tmp/dist-test-taskKgXrIO/test-tmp/rpc-test-90267b3deb884d1c86d9cd22ac72d297.sock
I20260929 22:44:58.566721 29147 test_util.cc:175] -----------------------------------------------
I20260929 22:44:58.566776 29147 test_util.cc:176] Had fatal failures, leaving test files at /tmp/dist-test-taskKgXrIO/test-tmp/rpc-test.6.Parameters_TestRpc.TestCallWithChainCertAndChainCA_SSL_UnixSocket.1790721898489375-29147-0

Full log

Note: This is test shard 7 of 8.
[==========] Running 21 tests from 2 test suites.
[----------] Global test environment set-up.
[----------] 20 tests from Parameters/TestRpc
[ RUN      ] Parameters/TestRpc.TestMessengerCreateDestroy/SSL_UnixSocket
WARNING: Logging before InitGoogleLogging() is written to STDERR
I20260929 22:44:58.527235 29147 rpc-test.cc:169] started messenger TestCreateDestroy
[       OK ] Parameters/TestRpc.TestMessengerCreateDestroy/SSL_UnixSocket (36 ms)
[ RUN      ] Parameters/TestRpc.TestNegotiationDeadlock/SSL_UnixSocket
I20260929 22:44:58.543563 29167 acceptor_pool.cc:254] collecting diagnostics on the listening RPC socket unix:/tmp/dist-test-taskKgXrIO/test-tmp/rpc-test-7f6d00a636ad46a7818c7d425fe723b7.sock every 8 connection(s)
I20260929 22:44:58.543627 29168 acceptor_pool.cc:254] collecting diagnostics on the listening RPC socket unix:/tmp/dist-test-taskKgXrIO/test-tmp/rpc-test-7f6d00a636ad46a7818c7d425fe723b7.sock every 8 connection(s)
[       OK ] Parameters/TestRpc.TestNegotiationDeadlock/SSL_UnixSocket (25 ms)
[ RUN      ] Parameters/TestRpc.TestCallWithChainCertAndChainCA/SSL_UnixSocket
I20260929 22:44:58.562296 29184 acceptor_pool.cc:254] collecting diagnostics on the listening RPC socket unix:/tmp/dist-test-taskKgXrIO/test-tmp/rpc-test-90267b3deb884d1c86d9cd22ac72d297.sock every 8 connection(s)
I20260929 22:44:58.562292 29183 acceptor_pool.cc:254] collecting diagnostics on the listening RPC socket unix:/tmp/dist-test-taskKgXrIO/test-tmp/rpc-test-90267b3deb884d1c86d9cd22ac72d297.sock every 8 connection(s)
/data0/somelongdirectorytoavoidrpathissues/src/kudu/src/kudu/rpc/rpc-test.cc:270: Failure
Failed
Bad status: Runtime error: could not verify certificate chain (error with cert: subject=CN = localhost, ST = sadfjas, C = AS, emailAddress = sdflkdsajf, O = lskdfjlsad, OU = sldfkja, issuer=C = AS, ST = ASDfkjdhf, L = lskdjf, O = saldfja, OU = skdjf, CN = localhost, emailAddress = sadjflkadsj): : certificate has expired
Google Test trace:
/data0/somelongdirectorytoavoidrpathissues/src/kudu/src/kudu/rpc/rpc-test.cc:267: Connecting to unix:/tmp/dist-test-taskKgXrIO/test-tmp/rpc-test-90267b3deb884d1c86d9cd22ac72d297.sock
I20260929 22:44:58.566721 29147 test_util.cc:175] -----------------------------------------------
I20260929 22:44:58.566776 29147 test_util.cc:176] Had fatal failures, leaving test files at /tmp/dist-test-taskKgXrIO/test-tmp/rpc-test.6.Parameters_TestRpc.TestCallWithChainCertAndChainCA_SSL_UnixSocket.1790721898489375-29147-0
[  FAILED  ] Parameters/TestRpc.TestCallWithChainCertAndChainCA/SSL_UnixSocket, where GetParam() = (true, true) (13 ms)
[ RUN      ] Parameters/TestRpc.TestCallWithPasswordProtectedKey/SSL_UnixSocket
I20260929 22:44:58.576977 29208 acceptor_pool.cc:254] collecting diagnostics on the listening RPC socket unix:/tmp/dist-test-taskKgXrIO/test-tmp/rpc-test-60db536d02e34b32839029e9e55ce5d1.sock every 8 connection(s)
I20260929 22:44:58.576999 29209 acceptor_pool.cc:254] collecting diagnostics on the listening RPC socket unix:/tmp/dist-test-taskKgXrIO/test-tmp/rpc-test-60db536d02e34b32839029e9e55ce5d1.sock every 8 connection(s)
W20260929 22:44:58.590095 29205 connection.cc:196] Error closing socket: Network error: TlsSocket::Close: Broken pipe
[       OK ] Parameters/TestRpc.TestCallWithPasswordProtectedKey/SSL_UnixSocket (24 ms)
[ RUN      ] Parameters/TestRpc.TestCallToBadServer/SSL_UnixSocket
I20260929 22:44:58.623828 29147 rpc-test.cc:394] Status: Network error: Client connection negotiation failed: client connection to 0.0.0.0:0: connect: Connection refused (error 111)
I20260929 22:44:58.624238 29147 rpc-test.cc:394] Status: Network error: Client connection negotiation failed: client connection to 0.0.0.0:0: connect: Connection refused (error 111)
I20260929 22:44:58.624514 29147 rpc-test.cc:394] Status: Network error: Client connection negotiation failed: client connection to 0.0.0.0:0: connect: Connection refused (error 111)
I20260929 22:44:58.624768 29147 rpc-test.cc:394] Status: Network error: Client connection negotiation failed: client connection to 0.0.0.0:0: connect: Connection refused (error 111)
I20260929 22:44:58.625000 29147 rpc-test.cc:394] Status: Network error: Client connection negotiation failed: client connection to 0.0.0.0:0: connect: Connection refused (error 111)
[       OK ] Parameters/TestRpc.TestCallToBadServer/SSL_UnixSocket (34 ms)
[ RUN      ] Parameters/TestRpc.TestWrongService/SSL_UnixSocket
I20260929 22:44:58.640256 29243 acceptor_pool.cc:254] collecting diagnostics on the listening RPC socket unix:/tmp/dist-test-taskKgXrIO/test-tmp/rpc-test-bf53e3c051d14e9fba73b222887a398f.sock every 8 connection(s)
I20260929 22:44:58.640262 29244 acceptor_pool.cc:254] collecting diagnostics on the listening RPC socket unix:/tmp/dist-test-taskKgXrIO/test-tmp/rpc-test-bf53e3c051d14e9fba73b222887a398f.sock every 8 connection(s)
I20260929 22:44:58.651278 29240 messenger.cc:345] service WrongServiceName not registered on TestServer
W20260929 22:44:58.652060 29240 connection.cc:196] Error closing socket: Network error: TlsSocket::Close: Broken pipe
[       OK ] Parameters/TestRpc.TestWrongService/SSL_UnixSocket (27 ms)
[ RUN      ] Parameters/TestRpc.TestConnectionKeepalive/SSL_UnixSocket
I20260929 22:44:58.657136 29266 acceptor_pool.cc:254] collecting diagnostics on the listening RPC socket unix:/tmp/dist-test-taskKgXrIO/test-tmp/rpc-test-aa081567568f4aaab0d5abf79518efae.sock every 8 connection(s)
I20260929 22:44:58.657195 29267 acceptor_pool.cc:254] collecting diagnostics on the listening RPC socket unix:/tmp/dist-test-taskKgXrIO/test-tmp/rpc-test-aa081567568f4aaab0d5abf79518efae.sock every 8 connection(s)
I20260929 22:44:58.657380 29147 rpc-test.cc:488] Connecting to unix:/tmp/dist-test-taskKgXrIO/test-tmp/rpc-test-aa081567568f4aaab0d5abf79518efae.sock
W20260929 22:44:59.154703 29279 connection.cc:196] Error closing socket: Network error: TlsSocket::Close: Broken pipe
[       OK ] Parameters/TestRpc.TestConnectionKeepalive/SSL_UnixSocket (1040 ms)
[ RUN      ] Parameters/TestRpc.TestClientConnectionMetrics/SSL_UnixSocket
I20260929 22:44:59.702783 29291 acceptor_pool.cc:254] collecting diagnostics on the listening RPC socket unix:/tmp/dist-test-taskKgXrIO/test-tmp/rpc-test-89615b861fa64d03aa6642ef78ad70ae.sock every 8 connection(s)
I20260929 22:44:59.702899 29292 acceptor_pool.cc:254] collecting diagnostics on the listening RPC socket unix:/tmp/dist-test-taskKgXrIO/test-tmp/rpc-test-89615b861fa64d03aa6642ef78ad70ae.sock every 8 connection(s)
I20260929 22:44:59.703047 29147 rpc-test.cc:569] Connecting to unix:/tmp/dist-test-taskKgXrIO/test-tmp/rpc-test-89615b861fa64d03aa6642ef78ad70ae.sock
W20260929 22:45:08.346726 29288 connection.cc:196] Error closing socket: Network error: TlsSocket::Close: Broken pipe
[       OK ] Parameters/TestRpc.TestClientConnectionMetrics/SSL_UnixSocket (8654 ms)
[ RUN      ] Parameters/TestRpc.TestCredentialsPolicy/SSL_UnixSocket
I20260929 22:45:08.361799 29314 acceptor_pool.cc:254] collecting diagnostics on the listening RPC socket unix:/tmp/dist-test-taskKgXrIO/test-tmp/rpc-test-21f681d80f374655be7b179d8b715141.sock every 8 connection(s)
I20260929 22:45:08.361843 29315 acceptor_pool.cc:254] collecting diagnostics on the listening RPC socket unix:/tmp/dist-test-taskKgXrIO/test-tmp/rpc-test-21f681d80f374655be7b179d8b715141.sock every 8 connection(s)
I20260929 22:45:08.362016 29147 rpc-test.cc:700] Connecting to unix:/tmp/dist-test-taskKgXrIO/test-tmp/rpc-test-21f681d80f374655be7b179d8b715141.sock
W20260929 22:45:08.380477 29313 connection.cc:196] Error closing socket: Network error: TlsSocket::Close: Broken pipe
[       OK ] Parameters/TestRpc.TestCredentialsPolicy/SSL_UnixSocket (37 ms)
[ RUN      ] Parameters/TestRpc.TestCallLongerThanKeepalive/SSL_UnixSocket
I20260929 22:45:08.405269 29339 acceptor_pool.cc:254] collecting diagnostics on the listening RPC socket unix:/tmp/dist-test-taskKgXrIO/test-tmp/rpc-test-65157c69155b4610b9fd05a380b7acef.sock every 8 connection(s)
I20260929 22:45:08.405315 29340 acceptor_pool.cc:254] collecting diagnostics on the listening RPC socket unix:/tmp/dist-test-taskKgXrIO/test-tmp/rpc-test-65157c69155b4610b9fd05a380b7acef.sock every 8 connection(s)
I20260929 22:45:08.430523 29342 rpc-test-base.h:222] got call: sleep_micros: 3000000 deferred: true
I20260929 22:45:11.431419 29342 rpcz_store.cc:275] Call kudu.rpc.GenericCalculatorService.Sleep from unix:<unnamed> (request call id 0) took 3000 ms. Trace:
I20260929 22:45:11.431541 29342 rpcz_store.cc:276] 0929 22:45:08.430464 (+     0us) service_pool.cc:170] Inserting onto call queue
0929 22:45:08.430495 (+    31us) service_pool.cc:227] Handling call
0929 22:45:11.431398 (+3000903us) inbound_call.cc:173] Queueing success response
Metrics: {}
[       OK ] Parameters/TestRpc.TestCallLongerThanKeepalive/SSL_UnixSocket (3048 ms)
[ RUN      ] Parameters/TestRpc.TestRpcSidecar/SSL_UnixSocket
I20260929 22:45:11.446122 29364 acceptor_pool.cc:254] collecting diagnostics on the listening RPC socket unix:/tmp/dist-test-taskKgXrIO/test-tmp/rpc-test-af18eecaa5644e99ac61429c5da42131.sock every 8 connection(s)
I20260929 22:45:11.446161 29365 acceptor_pool.cc:254] collecting diagnostics on the listening RPC socket unix:/tmp/dist-test-taskKgXrIO/test-tmp/rpc-test-af18eecaa5644e99ac61429c5da42131.sock every 8 connection(s)
W20260929 22:45:11.488265 29361 connection.cc:196] Error closing socket: Network error: TlsSocket::Close: Broken pipe
[       OK ] Parameters/TestRpc.TestRpcSidecar/SSL_UnixSocket (55 ms)
[ RUN      ] Parameters/TestRpc.TestRpcSidecarLimits/SSL_UnixSocket
I20260929 22:45:13.201959 29389 acceptor_pool.cc:254] collecting diagnostics on the listening RPC socket unix:/tmp/dist-test-taskKgXrIO/test-tmp/rpc-test-c4988b010d0f4a93ae68a982367b1a9e.sock every 8 connection(s)
I20260929 22:45:13.201995 29390 acceptor_pool.cc:254] collecting diagnostics on the listening RPC socket unix:/tmp/dist-test-taskKgXrIO/test-tmp/rpc-test-c4988b010d0f4a93ae68a982367b1a9e.sock every 8 connection(s)
W20260929 22:45:13.219650 29147 serialization.cc:72] Serialized kudu.rpc_test.PushStringsRequestPB (2147483654 bytes) is larger than the maximum configured RPC message size (52428800 bytes). Sending anyway, but peer may reject the data.
W20260929 22:45:13.222620 29386 connection.cc:535] server connection from unix:<unnamed> recv error: Network error: RPC frame had a length of 2147483714, but we only support messages up to 52428800 bytes long.
W20260929 22:45:13.222672 29386 connection.cc:158] shutting down server connection from unix:<unnamed> with pending inbound data: 4/2147483714 bytes received; last active 0 ns ago: status Network error: RPC frame had a length of 2147483714, but we only support messages up to 52428800 bytes long.
W20260929 22:45:13.222808 29402 connection.cc:698] client connection to unix:/tmp/dist-test-taskKgXrIO/test-tmp/rpc-test-c4988b010d0f4a93ae68a982367b1a9e.sock send error: Network error: failed to write to TLS socket: Broken pipe
W20260929 22:45:13.222957 29402 connection.cc:196] Error closing socket: Network error: TlsSocket::Close: Success
I20260929 22:45:13.240738 29414 acceptor_pool.cc:254] collecting diagnostics on the listening RPC socket unix:/tmp/dist-test-taskKgXrIO/test-tmp/rpc-test-c4988b010d0f4a93ae68a982367b1a9e.sock every 8 connection(s)
I20260929 22:45:13.240892 29415 acceptor_pool.cc:254] collecting diagnostics on the listening RPC socket unix:/tmp/dist-test-taskKgXrIO/test-tmp/rpc-test-c4988b010d0f4a93ae68a982367b1a9e.sock every 8 connection(s)
W20260929 22:45:17.725322 29411 connection.cc:577] server connection from unix:<unnamed>: received bad data: 'Corruption: Invalid packet: message had a length of 2147483710, but we only support messages up to 2147483647 bytes
'
W20260929 22:45:17.725605 29427 connection.cc:196] Error closing socket: Network error: TlsSocket::Close: Broken pipe
[       OK ] Parameters/TestRpc.TestRpcSidecarLimits/SSL_UnixSocket (6238 ms)
[ RUN      ] Parameters/TestRpc.TestCallTimeoutDoesntAffectNegotiation/SSL_UnixSocket
I20260929 22:45:17.745496 29439 acceptor_pool.cc:254] collecting diagnostics on the listening RPC socket unix:/tmp/dist-test-taskKgXrIO/test-tmp/rpc-test-f94a66c41e6745e0a940dedfd916511f.sock every 8 connection(s)
I20260929 22:45:17.745549 29440 acceptor_pool.cc:254] collecting diagnostics on the listening RPC socket unix:/tmp/dist-test-taskKgXrIO/test-tmp/rpc-test-f94a66c41e6745e0a940dedfd916511f.sock every 8 connection(s)
W20260929 22:45:17.770501 29435 negotiation.cc:266] Injecting 500ms delay in negotiation
I20260929 22:45:17.820737 29147 rpc-test-base.h:595] status: Timed out: connection negotiation to unix:/tmp/dist-test-taskKgXrIO/test-tmp/rpc-test-f94a66c41e6745e0a940dedfd916511f.sock for RPC Sleep timed out after 0.050s (ON_OUTBOUND_QUEUE), seconds elapsed: 0.0506127
[       OK ] Parameters/TestRpc.TestCallTimeoutDoesntAffectNegotiation/SSL_UnixSocket (548 ms)
[ RUN      ] Parameters/TestRpc.TestRpcHandlerLatencyMetric/SSL_UnixSocket
I20260929 22:45:18.291445 29464 acceptor_pool.cc:254] collecting diagnostics on the listening RPC socket unix:/tmp/dist-test-taskKgXrIO/test-tmp/rpc-test-fa76dc18b1c24bacb1dbc6bfd996e9a9.sock every 8 connection(s)
I20260929 22:45:18.291486 29465 acceptor_pool.cc:254] collecting diagnostics on the listening RPC socket unix:/tmp/dist-test-taskKgXrIO/test-tmp/rpc-test-fa76dc18b1c24bacb1dbc6bfd996e9a9.sock every 8 connection(s)
I20260929 22:45:18.329061 29147 rpc-test.cc:1236] Sleep() min lat: 20278
I20260929 22:45:18.329140 29147 rpc-test.cc:1237] Sleep() mean lat: 20278
I20260929 22:45:18.329169 29147 rpc-test.cc:1238] Sleep() max lat: 20278
I20260929 22:45:18.329183 29147 rpc-test.cc:1239] Sleep() #calls: 1
[       OK ] Parameters/TestRpc.TestRpcHandlerLatencyMetric/SSL_UnixSocket (54 ms)
[ RUN      ] Parameters/TestRpc.TimedOutOnResponseMetricServiceQueue/SSL_UnixSocket
I20260929 22:45:18.337414 29490 acceptor_pool.cc:254] collecting diagnostics on the listening RPC socket unix:/tmp/dist-test-taskKgXrIO/test-tmp/rpc-test-66b111ea5ee842bab01800bd5c0829f4.sock every 8 connection(s)
I20260929 22:45:18.337427 29491 acceptor_pool.cc:254] collecting diagnostics on the listening RPC socket unix:/tmp/dist-test-taskKgXrIO/test-tmp/rpc-test-66b111ea5ee842bab01800bd5c0829f4.sock every 8 connection(s)
W20260929 22:45:18.393237 29492 rpcz_store.cc:267] Call kudu.rpc_test.CalculatorService.Sleep from unix:<unnamed> (request call id 2) took 20 ms (client timeout 20 ms). Trace:
W20260929 22:45:18.393361 29492 rpcz_store.cc:269] 0929 22:45:18.372943 (+     0us) service_pool.cc:170] Inserting onto call queue
0929 22:45:18.393205 (+ 20262us) service_pool.cc:214] Skipping call since client already timed out
0929 22:45:18.393218 (+    13us) inbound_call.cc:173] Queueing failure response
Metrics: {}
[       OK ] Parameters/TestRpc.TimedOutOnResponseMetricServiceQueue/SSL_UnixSocket (63 ms)
[ RUN      ] Parameters/TestRpc.RpcPendingConnectionsMetric/SSL_UnixSocket
I20260929 22:45:18.396657 29513 acceptor_pool.cc:254] collecting diagnostics on the listening RPC socket 0.0.0.0:42257 every 8 connection(s)
I20260929 22:45:18.396700 29514 acceptor_pool.cc:254] collecting diagnostics on the listening RPC socket 0.0.0.0:42257 every 8 connection(s)
W20260929 22:45:18.397339 29509 negotiation.cc:337] Failed RPC negotiation. Trace:
0929 22:45:18.397145 (+     0us) reactor.cc:625] Submitting negotiation task for server connection from 127.0.0.1:48414 (local address 127.0.0.1:42257)
0929 22:45:18.397188 (+    43us) server_negotiation.cc:206] Beginning negotiation
0929 22:45:18.397190 (+     2us) server_negotiation.cc:399] Waiting for connection header
0929 22:45:18.397279 (+    89us) negotiation.cc:327] Negotiation complete: Network error: Server connection negotiation failed: server connection from 127.0.0.1:48414: BlockingRecv error: recv got EOF from 127.0.0.1:48414 (error 108)
Metrics: {"server-negotiator.queue_time_us":14}
[       OK ] Parameters/TestRpc.RpcPendingConnectionsMetric/SSL_UnixSocket (13 ms)
[ RUN      ] Parameters/TestRpc.TestRpcContextClientDeadline/SSL_UnixSocket
I20260929 22:45:18.417483 29529 acceptor_pool.cc:254] collecting diagnostics on the listening RPC socket unix:/tmp/dist-test-taskKgXrIO/test-tmp/rpc-test-56be2203ca8c4ae3aba8387ff044c5ea.sock every 8 connection(s)
I20260929 22:45:18.417513 29530 acceptor_pool.cc:254] collecting diagnostics on the listening RPC socket unix:/tmp/dist-test-taskKgXrIO/test-tmp/rpc-test-56be2203ca8c4ae3aba8387ff044c5ea.sock every 8 connection(s)
[       OK ] Parameters/TestRpc.TestRpcContextClientDeadline/SSL_UnixSocket (47 ms)
[ RUN      ] Parameters/TestRpc.TestApplicationFeatureFlagUnsupportedServer/SSL_UnixSocket
I20260929 22:45:18.463112 29554 acceptor_pool.cc:254] collecting diagnostics on the listening RPC socket unix:/tmp/dist-test-taskKgXrIO/test-tmp/rpc-test-38d0306ef16c4316bb6573148aadff6e.sock every 8 connection(s)
I20260929 22:45:18.463155 29555 acceptor_pool.cc:254] collecting diagnostics on the listening RPC socket unix:/tmp/dist-test-taskKgXrIO/test-tmp/rpc-test-38d0306ef16c4316bb6573148aadff6e.sock every 8 connection(s)
[       OK ] Parameters/TestRpc.TestApplicationFeatureFlagUnsupportedServer/SSL_UnixSocket (34 ms)
[ RUN      ] Parameters/TestRpc.TestCancellationAsync/SSL_UnixSocket
I20260929 22:45:18.507285 29580 acceptor_pool.cc:254] collecting diagnostics on the listening RPC socket unix:/tmp/dist-test-taskKgXrIO/test-tmp/rpc-test-f0e122f569ab4e6eaaba3c0b2136adfe.sock every 8 connection(s)
I20260929 22:45:18.507243 29579 acceptor_pool.cc:254] collecting diagnostics on the listening RPC socket unix:/tmp/dist-test-taskKgXrIO/test-tmp/rpc-test-f0e122f569ab4e6eaaba3c0b2136adfe.sock every 8 connection(s)
I20260929 22:45:18.507471 29147 rpc-test.cc:1716] Connecting to unix:/tmp/dist-test-taskKgXrIO/test-tmp/rpc-test-f0e122f569ab4e6eaaba3c0b2136adfe.sock
I20260929 22:45:18.511404 29147 test_util.cc:268] Using random seed: -271046360
I20260929 22:45:18.525188 29583 rpc-test-base.h:240] got call: sleep_micros: 500 pattern: 4294967295 num_repetitions: 2097152 sidecar_idx: 0
I20260929 22:45:18.535657 29583 rpc-test-base.h:240] got call: sleep_micros: 500 pattern: 4294967295 num_repetitions: 2097152 sidecar_idx: 0
I20260929 22:45:18.546468 29583 rpc-test-base.h:240] got call: sleep_micros: 500 pattern: 4294967295 num_repetitions: 2097152 sidecar_idx: 0
I20260929 22:45:18.557207 29583 rpc-test-base.h:240] got call: sleep_micros: 500 pattern: 4294967295 num_repetitions: 2097152 sidecar_idx: 0
I20260929 22:45:18.568305 29583 rpc-test-base.h:240] got call: sleep_micros: 500 pattern: 4294967295 num_repetitions: 2097152 sidecar_idx: 0
I20260929 22:45:18.579161 29583 rpc-test-base.h:240] got call: sleep_micros: 500 pattern: 4294967295 num_repetitions: 2097152 sidecar_idx: 0
I20260929 22:45:18.589861 29583 rpc-test-base.h:240] got call: sleep_micros: 500 pattern: 4294967295 num_repetitions: 2097152 sidecar_idx: 0
I20260929 22:45:18.600816 29583 rpc-test-base.h:240] got call: sleep_micros: 500 pattern: 4294967295 num_repetitions: 2097152 sidecar_idx: 0
W20260929 22:45:18.602485 29576 connection.cc:196] Error closing socket: Network error: TlsSocket::Close: Broken pipe
W20260929 22:45:18.603966 29576 connection.cc:441] server connection from unix:<unnamed> torn down before Call kudu.rpc.GenericCalculatorService.SleepWithSidecar from unix:<unnamed> (request call id 9) could send its response
[       OK ] Parameters/TestRpc.TestCancellationAsync/SSL_UnixSocket (114 ms)
[ RUN      ] Parameters/TestRpc.TestPerformanceBySocketType/SSL_UnixSocket
I20260929 22:45:18.619374 29604 acceptor_pool.cc:254] collecting diagnostics on the listening RPC socket unix:/tmp/dist-test-taskKgXrIO/test-tmp/rpc-test-77a1682529024baa960bb9cfac76db58.sock every 8 connection(s)
I20260929 22:45:18.619446 29605 acceptor_pool.cc:254] collecting diagnostics on the listening RPC socket unix:/tmp/dist-test-taskKgXrIO/test-tmp/rpc-test-77a1682529024baa960bb9cfac76db58.sock every 8 connection(s)
I20260929 22:45:18.619761 29147 rpc-test.cc:1846] Connecting to unix:/tmp/dist-test-taskKgXrIO/test-tmp/rpc-test-77a1682529024baa960bb9cfac76db58.sock
I20260929 22:45:19.971966 29147 rpc-test.cc:1859] Sending 1024MB via ssl-enabled unix socket: real 1.341s	user 1.462s	sys 0.913s
I20260929 22:45:21.356786 29147 rpc-test.cc:1859] Sending 1024MB via ssl-enabled unix socket: real 1.385s	user 1.482s	sys 0.968s
I20260929 22:45:22.653304 29147 rpc-test.cc:1859] Sending 1024MB via ssl-enabled unix socket: real 1.296s	user 1.441s	sys 0.868s
I20260929 22:45:24.054960 29147 rpc-test.cc:1859] Sending 1024MB via ssl-enabled unix socket: real 1.402s	user 1.620s	sys 0.875s
I20260929 22:45:25.339213 29147 rpc-test.cc:1859] Sending 1024MB via ssl-enabled unix socket: real 1.284s	user 1.417s	sys 0.882s
W20260929 22:45:25.339972 29601 connection.cc:196] Error closing socket: Network error: TlsSocket::Close: Broken pipe
[       OK ] Parameters/TestRpc.TestPerformanceBySocketType/SSL_UnixSocket (6736 ms)
[----------] 20 tests from Parameters/TestRpc (26849 ms total)

[----------] 1 test from Parameters/TestRpcSocketTxRxQueue
[ RUN      ] Parameters/TestRpcSocketTxRxQueue.AcceptorRxQueueSizeMetric/0
I20260929 22:45:25.351224 29629 acceptor_pool.cc:254] collecting diagnostics on the listening RPC socket 0.0.0.0:44293 every 1 connection(s)
I20260929 22:45:25.351356 29630 acceptor_pool.cc:254] collecting diagnostics on the listening RPC socket 0.0.0.0:44293 every 1 connection(s)
W20260929 22:45:25.351890 29625 negotiation.cc:337] Failed RPC negotiation. Trace:
0929 22:45:25.351717 (+     0us) reactor.cc:625] Submitting negotiation task for server connection from 127.0.0.1:43394 (local address 127.0.0.1:44293)
0929 22:45:25.351794 (+    77us) server_negotiation.cc:206] Beginning negotiation
0929 22:45:25.351796 (+     2us) server_negotiation.cc:399] Waiting for connection header
0929 22:45:25.351858 (+    62us) negotiation.cc:327] Negotiation complete: Network error: Server connection negotiation failed: server connection from 127.0.0.1:43394: BlockingRecv error: recv got EOF from 127.0.0.1:43394 (error 108)
Metrics: {"server-negotiator.queue_time_us":43}
[       OK ] Parameters/TestRpcSocketTxRxQueue.AcceptorRxQueueSizeMetric/0 (12 ms)
[----------] 1 test from Parameters/TestRpcSocketTxRxQueue (12 ms total)

[----------] Global test environment tear-down
[==========] 21 tests from 2 test suites ran. (26862 ms total)
[  PASSED  ] 20 tests.
[  FAILED  ] 1 test, listed below:
[  FAILED  ] Parameters/TestRpc.TestCallWithChainCertAndChainCA/SSL_UnixSocket, where GetParam() = (true, true)

 1 FAILED TEST