Diagnosed failure
Parameters/TestRpc.TestCallWithChainCertAndChainCA/SSL_UnixSocket: /data0/somelongdirectorytoavoidrpathissues/src/kudu/src/kudu/rpc/rpc-test.cc:270: Failure
Failed
Bad status: Runtime error: could not verify certificate chain (error with cert: subject=CN = localhost, ST = sadfjas, C = AS, emailAddress = sdflkdsajf, O = lskdfjlsad, OU = sldfkja, issuer=C = AS, ST = ASDfkjdhf, L = lskdjf, O = saldfja, OU = skdjf, CN = localhost, emailAddress = sadjflkadsj): : certificate has expired
Google Test trace:
/data0/somelongdirectorytoavoidrpathissues/src/kudu/src/kudu/rpc/rpc-test.cc:267: Connecting to unix:/tmp/dist-test-taskf5jFFD/test-tmp/rpc-test-bf20a07570b649e19ae4483960d42cd2.sock
I20260924 19:01:29.210983 3208 test_util.cc:175] -----------------------------------------------
I20260924 19:01:29.211052 3208 test_util.cc:176] Had fatal failures, leaving test files at /tmp/dist-test-taskf5jFFD/test-tmp/rpc-test.6.Parameters_TestRpc.TestCallWithChainCertAndChainCA_SSL_UnixSocket.1790276489101919-3208-0
Full log
Note: This is test shard 7 of 8.
[==========] Running 21 tests from 2 test suites.
[----------] Global test environment set-up.
[----------] 20 tests from Parameters/TestRpc
[ RUN ] Parameters/TestRpc.TestMessengerCreateDestroy/SSL_UnixSocket
WARNING: Logging before InitGoogleLogging() is written to STDERR
I20260924 19:01:29.148665 3208 rpc-test.cc:169] started messenger TestCreateDestroy
[ OK ] Parameters/TestRpc.TestMessengerCreateDestroy/SSL_UnixSocket (31 ms)
[ RUN ] Parameters/TestRpc.TestNegotiationDeadlock/SSL_UnixSocket
I20260924 19:01:29.171058 3228 acceptor_pool.cc:254] collecting diagnostics on the listening RPC socket unix:/tmp/dist-test-taskf5jFFD/test-tmp/rpc-test-6f5d2d96d82a4d8d84c9c6bd9efb13fd.sock every 8 connection(s)
I20260924 19:01:29.171352 3229 acceptor_pool.cc:254] collecting diagnostics on the listening RPC socket unix:/tmp/dist-test-taskf5jFFD/test-tmp/rpc-test-6f5d2d96d82a4d8d84c9c6bd9efb13fd.sock every 8 connection(s)
[ OK ] Parameters/TestRpc.TestNegotiationDeadlock/SSL_UnixSocket (37 ms)
[ RUN ] Parameters/TestRpc.TestCallWithChainCertAndChainCA/SSL_UnixSocket
I20260924 19:01:29.198144 3244 acceptor_pool.cc:254] collecting diagnostics on the listening RPC socket unix:/tmp/dist-test-taskf5jFFD/test-tmp/rpc-test-bf20a07570b649e19ae4483960d42cd2.sock every 8 connection(s)
I20260924 19:01:29.198891 3245 acceptor_pool.cc:254] collecting diagnostics on the listening RPC socket unix:/tmp/dist-test-taskf5jFFD/test-tmp/rpc-test-bf20a07570b649e19ae4483960d42cd2.sock every 8 connection(s)
/data0/somelongdirectorytoavoidrpathissues/src/kudu/src/kudu/rpc/rpc-test.cc:270: Failure
Failed
Bad status: Runtime error: could not verify certificate chain (error with cert: subject=CN = localhost, ST = sadfjas, C = AS, emailAddress = sdflkdsajf, O = lskdfjlsad, OU = sldfkja, issuer=C = AS, ST = ASDfkjdhf, L = lskdjf, O = saldfja, OU = skdjf, CN = localhost, emailAddress = sadjflkadsj): : certificate has expired
Google Test trace:
/data0/somelongdirectorytoavoidrpathissues/src/kudu/src/kudu/rpc/rpc-test.cc:267: Connecting to unix:/tmp/dist-test-taskf5jFFD/test-tmp/rpc-test-bf20a07570b649e19ae4483960d42cd2.sock
I20260924 19:01:29.210983 3208 test_util.cc:175] -----------------------------------------------
I20260924 19:01:29.211052 3208 test_util.cc:176] Had fatal failures, leaving test files at /tmp/dist-test-taskf5jFFD/test-tmp/rpc-test.6.Parameters_TestRpc.TestCallWithChainCertAndChainCA_SSL_UnixSocket.1790276489101919-3208-0
[ FAILED ] Parameters/TestRpc.TestCallWithChainCertAndChainCA/SSL_UnixSocket, where GetParam() = (true, true) (22 ms)
[ RUN ] Parameters/TestRpc.TestCallWithPasswordProtectedKey/SSL_UnixSocket
I20260924 19:01:29.232524 3269 acceptor_pool.cc:254] collecting diagnostics on the listening RPC socket unix:/tmp/dist-test-taskf5jFFD/test-tmp/rpc-test-accc68bf2d8c4d35a36c1e2117b89a86.sock every 8 connection(s)
I20260924 19:01:29.232754 3270 acceptor_pool.cc:254] collecting diagnostics on the listening RPC socket unix:/tmp/dist-test-taskf5jFFD/test-tmp/rpc-test-accc68bf2d8c4d35a36c1e2117b89a86.sock every 8 connection(s)
W20260924 19:01:29.261070 3266 connection.cc:196] Error closing socket: Network error: TlsSocket::Close: Broken pipe
[ OK ] Parameters/TestRpc.TestCallWithPasswordProtectedKey/SSL_UnixSocket (53 ms)
[ RUN ] Parameters/TestRpc.TestCallToBadServer/SSL_UnixSocket
I20260924 19:01:29.279799 3208 rpc-test.cc:394] Status: Network error: Client connection negotiation failed: client connection to 0.0.0.0:0: connect: Connection refused (error 111)
I20260924 19:01:29.280329 3208 rpc-test.cc:394] Status: Network error: Client connection negotiation failed: client connection to 0.0.0.0:0: connect: Connection refused (error 111)
I20260924 19:01:29.280833 3208 rpc-test.cc:394] Status: Network error: Client connection negotiation failed: client connection to 0.0.0.0:0: connect: Connection refused (error 111)
I20260924 19:01:29.281342 3208 rpc-test.cc:394] Status: Network error: Client connection negotiation failed: client connection to 0.0.0.0:0: connect: Connection refused (error 111)
I20260924 19:01:29.281880 3208 rpc-test.cc:394] Status: Network error: Client connection negotiation failed: client connection to 0.0.0.0:0: connect: Connection refused (error 111)
[ OK ] Parameters/TestRpc.TestCallToBadServer/SSL_UnixSocket (18 ms)
[ RUN ] Parameters/TestRpc.TestWrongService/SSL_UnixSocket
I20260924 19:01:29.298928 3304 acceptor_pool.cc:254] collecting diagnostics on the listening RPC socket unix:/tmp/dist-test-taskf5jFFD/test-tmp/rpc-test-0a04977f40554e83a2a2f3f6d1da69e0.sock every 8 connection(s)
I20260924 19:01:29.299264 3305 acceptor_pool.cc:254] collecting diagnostics on the listening RPC socket unix:/tmp/dist-test-taskf5jFFD/test-tmp/rpc-test-0a04977f40554e83a2a2f3f6d1da69e0.sock every 8 connection(s)
I20260924 19:01:29.331423 3301 messenger.cc:345] service WrongServiceName not registered on TestServer
W20260924 19:01:29.333137 3301 connection.cc:196] Error closing socket: Network error: TlsSocket::Close: Broken pipe
[ OK ] Parameters/TestRpc.TestWrongService/SSL_UnixSocket (53 ms)
[ RUN ] Parameters/TestRpc.TestConnectionKeepalive/SSL_UnixSocket
I20260924 19:01:29.355201 3327 acceptor_pool.cc:254] collecting diagnostics on the listening RPC socket unix:/tmp/dist-test-taskf5jFFD/test-tmp/rpc-test-e5725a3340e34560a17939ea24639e35.sock every 8 connection(s)
I20260924 19:01:29.355428 3328 acceptor_pool.cc:254] collecting diagnostics on the listening RPC socket unix:/tmp/dist-test-taskf5jFFD/test-tmp/rpc-test-e5725a3340e34560a17939ea24639e35.sock every 8 connection(s)
I20260924 19:01:29.356212 3208 rpc-test.cc:488] Connecting to unix:/tmp/dist-test-taskf5jFFD/test-tmp/rpc-test-e5725a3340e34560a17939ea24639e35.sock
W20260924 19:01:29.838855 3340 connection.cc:196] Error closing socket: Network error: TlsSocket::Close: Broken pipe
[ OK ] Parameters/TestRpc.TestConnectionKeepalive/SSL_UnixSocket (1053 ms)
[ RUN ] Parameters/TestRpc.TestClientConnectionMetrics/SSL_UnixSocket
I20260924 19:01:30.420176 3352 acceptor_pool.cc:254] collecting diagnostics on the listening RPC socket unix:/tmp/dist-test-taskf5jFFD/test-tmp/rpc-test-9b54022a13b24a3abd0e7310ca364e45.sock every 8 connection(s)
I20260924 19:01:30.420395 3353 acceptor_pool.cc:254] collecting diagnostics on the listening RPC socket unix:/tmp/dist-test-taskf5jFFD/test-tmp/rpc-test-9b54022a13b24a3abd0e7310ca364e45.sock every 8 connection(s)
I20260924 19:01:30.421237 3208 rpc-test.cc:569] Connecting to unix:/tmp/dist-test-taskf5jFFD/test-tmp/rpc-test-9b54022a13b24a3abd0e7310ca364e45.sock
W20260924 19:01:50.821820 3349 connection.cc:196] Error closing socket: Network error: TlsSocket::Close: Broken pipe
[ OK ] Parameters/TestRpc.TestClientConnectionMetrics/SSL_UnixSocket (20437 ms)
[ RUN ] Parameters/TestRpc.TestCredentialsPolicy/SSL_UnixSocket
I20260924 19:01:50.839607 3375 acceptor_pool.cc:254] collecting diagnostics on the listening RPC socket unix:/tmp/dist-test-taskf5jFFD/test-tmp/rpc-test-07e992a5fb594ae5a98ed17cb020e897.sock every 8 connection(s)
I20260924 19:01:50.839849 3376 acceptor_pool.cc:254] collecting diagnostics on the listening RPC socket unix:/tmp/dist-test-taskf5jFFD/test-tmp/rpc-test-07e992a5fb594ae5a98ed17cb020e897.sock every 8 connection(s)
I20260924 19:01:50.840672 3208 rpc-test.cc:700] Connecting to unix:/tmp/dist-test-taskf5jFFD/test-tmp/rpc-test-07e992a5fb594ae5a98ed17cb020e897.sock
W20260924 19:01:50.869220 3374 connection.cc:196] Error closing socket: Network error: TlsSocket::Close: Broken pipe
W20260924 19:01:50.875679 3374 connection.cc:196] Error closing socket: Network error: TlsSocket::Close: Broken pipe
[ OK ] Parameters/TestRpc.TestCredentialsPolicy/SSL_UnixSocket (50 ms)
[ RUN ] Parameters/TestRpc.TestCallLongerThanKeepalive/SSL_UnixSocket
I20260924 19:01:50.891701 3400 acceptor_pool.cc:254] collecting diagnostics on the listening RPC socket unix:/tmp/dist-test-taskf5jFFD/test-tmp/rpc-test-9d970f713b844c70a723fd374a9f4a9f.sock every 8 connection(s)
I20260924 19:01:50.891929 3401 acceptor_pool.cc:254] collecting diagnostics on the listening RPC socket unix:/tmp/dist-test-taskf5jFFD/test-tmp/rpc-test-9d970f713b844c70a723fd374a9f4a9f.sock every 8 connection(s)
I20260924 19:01:50.943356 3404 rpc-test-base.h:222] got call: sleep_micros: 3000000 deferred: true
I20260924 19:01:53.944921 3404 rpcz_store.cc:275] Call kudu.rpc.GenericCalculatorService.Sleep from unix:<unnamed> (request call id 0) took 3001 ms. Trace:
I20260924 19:01:53.945106 3404 rpcz_store.cc:276] 0924 19:01:50.943250 (+ 0us) service_pool.cc:170] Inserting onto call queue
0924 19:01:50.943314 (+ 64us) service_pool.cc:227] Handling call
0924 19:01:53.944880 (+3001566us) inbound_call.cc:173] Queueing success response
Metrics: {}
[ OK ] Parameters/TestRpc.TestCallLongerThanKeepalive/SSL_UnixSocket (3072 ms)
[ RUN ] Parameters/TestRpc.TestRpcSidecar/SSL_UnixSocket
I20260924 19:01:53.978295 3425 acceptor_pool.cc:254] collecting diagnostics on the listening RPC socket unix:/tmp/dist-test-taskf5jFFD/test-tmp/rpc-test-ade31f6bd1834cab823a9926767e65be.sock every 8 connection(s)
I20260924 19:01:53.978533 3426 acceptor_pool.cc:254] collecting diagnostics on the listening RPC socket unix:/tmp/dist-test-taskf5jFFD/test-tmp/rpc-test-ade31f6bd1834cab823a9926767e65be.sock every 8 connection(s)
W20260924 19:01:54.068248 3422 connection.cc:196] Error closing socket: Network error: TlsSocket::Close: Broken pipe
[ OK ] Parameters/TestRpc.TestRpcSidecar/SSL_UnixSocket (121 ms)
[ RUN ] Parameters/TestRpc.TestRpcSidecarLimits/SSL_UnixSocket
I20260924 19:01:56.083772 3450 acceptor_pool.cc:254] collecting diagnostics on the listening RPC socket unix:/tmp/dist-test-taskf5jFFD/test-tmp/rpc-test-4fd2361933c74029842faa4b68db7bf2.sock every 8 connection(s)
I20260924 19:01:56.084059 3451 acceptor_pool.cc:254] collecting diagnostics on the listening RPC socket unix:/tmp/dist-test-taskf5jFFD/test-tmp/rpc-test-4fd2361933c74029842faa4b68db7bf2.sock every 8 connection(s)
W20260924 19:01:56.100096 3208 serialization.cc:72] Serialized kudu.rpc_test.PushStringsRequestPB (2147483654 bytes) is larger than the maximum configured RPC message size (52428800 bytes). Sending anyway, but peer may reject the data.
W20260924 19:01:56.105695 3447 connection.cc:535] server connection from unix:<unnamed> recv error: Network error: RPC frame had a length of 2147483714, but we only support messages up to 52428800 bytes long.
W20260924 19:01:56.105834 3447 connection.cc:158] shutting down server connection from unix:<unnamed> with pending inbound data: 4/2147483714 bytes received; last active 0 ns ago: status Network error: RPC frame had a length of 2147483714, but we only support messages up to 52428800 bytes long.
W20260924 19:01:56.106271 3463 connection.cc:196] Error closing socket: Network error: TlsSocket::Close: Broken pipe
I20260924 19:01:56.138727 3475 acceptor_pool.cc:254] collecting diagnostics on the listening RPC socket unix:/tmp/dist-test-taskf5jFFD/test-tmp/rpc-test-4fd2361933c74029842faa4b68db7bf2.sock every 8 connection(s)
I20260924 19:01:56.138911 3476 acceptor_pool.cc:254] collecting diagnostics on the listening RPC socket unix:/tmp/dist-test-taskf5jFFD/test-tmp/rpc-test-4fd2361933c74029842faa4b68db7bf2.sock every 8 connection(s)
W20260924 19:02:01.486356 3472 connection.cc:577] server connection from unix:<unnamed>: received bad data: 'Corruption: Invalid packet: message had a length of 2147483710, but we only support messages up to 2147483647 bytes
'
W20260924 19:02:01.486937 3488 connection.cc:196] Error closing socket: Network error: TlsSocket::Close: Broken pipe
[ OK ] Parameters/TestRpc.TestRpcSidecarLimits/SSL_UnixSocket (7877 ms)
[ RUN ] Parameters/TestRpc.TestCallTimeoutDoesntAffectNegotiation/SSL_UnixSocket
I20260924 19:02:01.970300 3500 acceptor_pool.cc:254] collecting diagnostics on the listening RPC socket unix:/tmp/dist-test-taskf5jFFD/test-tmp/rpc-test-effd1ab1a26847298bd0a4c4130d1999.sock every 8 connection(s)
I20260924 19:02:01.970557 3501 acceptor_pool.cc:254] collecting diagnostics on the listening RPC socket unix:/tmp/dist-test-taskf5jFFD/test-tmp/rpc-test-effd1ab1a26847298bd0a4c4130d1999.sock every 8 connection(s)
W20260924 19:02:01.979570 3496 negotiation.cc:266] Injecting 500ms delay in negotiation
I20260924 19:02:02.030014 3208 rpc-test-base.h:595] status: Timed out: connection negotiation to unix:/tmp/dist-test-taskf5jFFD/test-tmp/rpc-test-effd1ab1a26847298bd0a4c4130d1999.sock for RPC Sleep timed out after 0.050s (ON_OUTBOUND_QUEUE), seconds elapsed: 0.0510339
W20260924 19:02:02.485809 3497 connection.cc:196] Error closing socket: Network error: TlsSocket::Close: Broken pipe
[ OK ] Parameters/TestRpc.TestCallTimeoutDoesntAffectNegotiation/SSL_UnixSocket (538 ms)
[ RUN ] Parameters/TestRpc.TestRpcHandlerLatencyMetric/SSL_UnixSocket
I20260924 19:02:02.506155 3525 acceptor_pool.cc:254] collecting diagnostics on the listening RPC socket unix:/tmp/dist-test-taskf5jFFD/test-tmp/rpc-test-e2046a4a7a20463896250e93d0a59925.sock every 8 connection(s)
I20260924 19:02:02.506352 3526 acceptor_pool.cc:254] collecting diagnostics on the listening RPC socket unix:/tmp/dist-test-taskf5jFFD/test-tmp/rpc-test-e2046a4a7a20463896250e93d0a59925.sock every 8 connection(s)
I20260924 19:02:02.551728 3208 rpc-test.cc:1236] Sleep() min lat: 20586
I20260924 19:02:02.551807 3208 rpc-test.cc:1237] Sleep() mean lat: 20586
I20260924 19:02:02.551843 3208 rpc-test.cc:1238] Sleep() max lat: 20586
I20260924 19:02:02.551862 3208 rpc-test.cc:1239] Sleep() #calls: 1
[ OK ] Parameters/TestRpc.TestRpcHandlerLatencyMetric/SSL_UnixSocket (67 ms)
[ RUN ] Parameters/TestRpc.TimedOutOnResponseMetricServiceQueue/SSL_UnixSocket
I20260924 19:02:02.575876 3551 acceptor_pool.cc:254] collecting diagnostics on the listening RPC socket unix:/tmp/dist-test-taskf5jFFD/test-tmp/rpc-test-cd2723e8b55643eb80321f93f9e90ed4.sock every 8 connection(s)
I20260924 19:02:02.576099 3552 acceptor_pool.cc:254] collecting diagnostics on the listening RPC socket unix:/tmp/dist-test-taskf5jFFD/test-tmp/rpc-test-cd2723e8b55643eb80321f93f9e90ed4.sock every 8 connection(s)
W20260924 19:02:02.644091 3553 rpcz_store.cc:267] Call kudu.rpc_test.CalculatorService.Sleep from unix:<unnamed> (request call id 2) took 20 ms (client timeout 20 ms). Trace:
W20260924 19:02:02.644232 3553 rpcz_store.cc:269] 0924 19:02:02.623732 (+ 0us) service_pool.cc:170] Inserting onto call queue
0924 19:02:02.644039 (+ 20307us) service_pool.cc:214] Skipping call since client already timed out
0924 19:02:02.644075 (+ 36us) inbound_call.cc:173] Queueing failure response
Metrics: {}
[ OK ] Parameters/TestRpc.TimedOutOnResponseMetricServiceQueue/SSL_UnixSocket (91 ms)
[ RUN ] Parameters/TestRpc.RpcPendingConnectionsMetric/SSL_UnixSocket
I20260924 19:02:02.651947 3574 acceptor_pool.cc:254] collecting diagnostics on the listening RPC socket 0.0.0.0:40273 every 8 connection(s)
I20260924 19:02:02.652140 3575 acceptor_pool.cc:254] collecting diagnostics on the listening RPC socket 0.0.0.0:40273 every 8 connection(s)
W20260924 19:02:02.662223 3570 negotiation.cc:337] Failed RPC negotiation. Trace:
0924 19:02:02.661439 (+ 0us) reactor.cc:625] Submitting negotiation task for server connection from 127.0.0.1:56786 (local address 127.0.0.1:40273)
0924 19:02:02.661622 (+ 183us) server_negotiation.cc:206] Beginning negotiation
0924 19:02:02.661628 (+ 6us) server_negotiation.cc:399] Waiting for connection header
0924 19:02:02.661822 (+ 194us) negotiation.cc:327] Negotiation complete: Network error: Server connection negotiation failed: server connection from 127.0.0.1:56786: BlockingRecv error: recv got EOF from 127.0.0.1:56786 (error 108)
Metrics: {"server-negotiator.queue_time_us":33}
[ OK ] Parameters/TestRpc.RpcPendingConnectionsMetric/SSL_UnixSocket (26 ms)
[ RUN ] Parameters/TestRpc.TestRpcContextClientDeadline/SSL_UnixSocket
I20260924 19:02:02.690730 3590 acceptor_pool.cc:254] collecting diagnostics on the listening RPC socket unix:/tmp/dist-test-taskf5jFFD/test-tmp/rpc-test-ddf7015a6f4a4a6595aa03fe3513f40a.sock every 8 connection(s)
I20260924 19:02:02.690923 3591 acceptor_pool.cc:254] collecting diagnostics on the listening RPC socket unix:/tmp/dist-test-taskf5jFFD/test-tmp/rpc-test-ddf7015a6f4a4a6595aa03fe3513f40a.sock every 8 connection(s)
[ OK ] Parameters/TestRpc.TestRpcContextClientDeadline/SSL_UnixSocket (76 ms)
[ RUN ] Parameters/TestRpc.TestApplicationFeatureFlagUnsupportedServer/SSL_UnixSocket
I20260924 19:02:02.758304 3615 acceptor_pool.cc:254] collecting diagnostics on the listening RPC socket unix:/tmp/dist-test-taskf5jFFD/test-tmp/rpc-test-5ce68ca5874540f197fcc217bbf2d006.sock every 8 connection(s)
I20260924 19:02:02.758548 3616 acceptor_pool.cc:254] collecting diagnostics on the listening RPC socket unix:/tmp/dist-test-taskf5jFFD/test-tmp/rpc-test-5ce68ca5874540f197fcc217bbf2d006.sock every 8 connection(s)
W20260924 19:02:02.780139 3612 connection.cc:196] Error closing socket: Network error: TlsSocket::Close: Broken pipe
[ OK ] Parameters/TestRpc.TestApplicationFeatureFlagUnsupportedServer/SSL_UnixSocket (32 ms)
[ RUN ] Parameters/TestRpc.TestCancellationAsync/SSL_UnixSocket
I20260924 19:02:02.801318 3640 acceptor_pool.cc:254] collecting diagnostics on the listening RPC socket unix:/tmp/dist-test-taskf5jFFD/test-tmp/rpc-test-3445219f570b464a9111ab1cd543b012.sock every 8 connection(s)
I20260924 19:02:02.801585 3641 acceptor_pool.cc:254] collecting diagnostics on the listening RPC socket unix:/tmp/dist-test-taskf5jFFD/test-tmp/rpc-test-3445219f570b464a9111ab1cd543b012.sock every 8 connection(s)
I20260924 19:02:02.802330 3208 rpc-test.cc:1716] Connecting to unix:/tmp/dist-test-taskf5jFFD/test-tmp/rpc-test-3445219f570b464a9111ab1cd543b012.sock
I20260924 19:02:02.825206 3208 test_util.cc:268] Using random seed: 1009866210
I20260924 19:02:02.869071 3644 rpc-test-base.h:240] got call: sleep_micros: 500 pattern: 4294967295 num_repetitions: 2097152 sidecar_idx: 0
I20260924 19:02:02.900462 3644 rpc-test-base.h:240] got call: sleep_micros: 500 pattern: 4294967295 num_repetitions: 2097152 sidecar_idx: 0
I20260924 19:02:02.932781 3644 rpc-test-base.h:240] got call: sleep_micros: 500 pattern: 4294967295 num_repetitions: 2097152 sidecar_idx: 0
I20260924 19:02:02.959621 3643 rpc-test-base.h:240] got call: sleep_micros: 500 pattern: 4294967295 num_repetitions: 2097152 sidecar_idx: 0
I20260924 19:02:02.992411 3642 rpc-test-base.h:240] got call: sleep_micros: 500 pattern: 4294967295 num_repetitions: 2097152 sidecar_idx: 0
I20260924 19:02:03.024658 3643 rpc-test-base.h:240] got call: sleep_micros: 500 pattern: 4294967295 num_repetitions: 2097152 sidecar_idx: 0
I20260924 19:02:03.056002 3642 rpc-test-base.h:240] got call: sleep_micros: 500 pattern: 4294967295 num_repetitions: 2097152 sidecar_idx: 0
W20260924 19:02:03.058086 3637 connection.cc:196] Error closing socket: Network error: TlsSocket::Close: Broken pipe
W20260924 19:02:03.084237 3637 connection.cc:441] server connection from unix:<unnamed> torn down before Call kudu.rpc.GenericCalculatorService.SleepWithSidecar from unix:<unnamed> (request call id 8) could send its response
W20260924 19:02:03.101523 3637 connection.cc:441] server connection from unix:<unnamed> torn down before Call kudu.rpc.GenericCalculatorService.SleepWithSidecar from unix:<unnamed> (request call id 9) could send its response
[ OK ] Parameters/TestRpc.TestCancellationAsync/SSL_UnixSocket (321 ms)
[ RUN ] Parameters/TestRpc.TestPerformanceBySocketType/SSL_UnixSocket
I20260924 19:02:03.146013 3665 acceptor_pool.cc:254] collecting diagnostics on the listening RPC socket unix:/tmp/dist-test-taskf5jFFD/test-tmp/rpc-test-6abce775a2544826b102d376f3a86eab.sock every 8 connection(s)
I20260924 19:02:03.146237 3666 acceptor_pool.cc:254] collecting diagnostics on the listening RPC socket unix:/tmp/dist-test-taskf5jFFD/test-tmp/rpc-test-6abce775a2544826b102d376f3a86eab.sock every 8 connection(s)
I20260924 19:02:03.147173 3208 rpc-test.cc:1846] Connecting to unix:/tmp/dist-test-taskf5jFFD/test-tmp/rpc-test-6abce775a2544826b102d376f3a86eab.sock
I20260924 19:02:05.993655 3208 rpc-test.cc:1859] Sending 1024MB via ssl-enabled unix socket: real 2.829s user 2.765s sys 2.070s
I20260924 19:02:08.825346 3208 rpc-test.cc:1859] Sending 1024MB via ssl-enabled unix socket: real 2.832s user 2.638s sys 2.196s
I20260924 19:02:11.646603 3208 rpc-test.cc:1859] Sending 1024MB via ssl-enabled unix socket: real 2.821s user 2.666s sys 2.146s
I20260924 19:02:14.502939 3208 rpc-test.cc:1859] Sending 1024MB via ssl-enabled unix socket: real 2.856s user 2.814s sys 2.076s
I20260924 19:02:17.346499 3208 rpc-test.cc:1859] Sending 1024MB via ssl-enabled unix socket: real 2.843s user 2.657s sys 2.189s
W20260924 19:02:17.348156 3662 connection.cc:196] Error closing socket: Network error: TlsSocket::Close: Broken pipe
[ OK ] Parameters/TestRpc.TestPerformanceBySocketType/SSL_UnixSocket (14247 ms)
[----------] 20 tests from Parameters/TestRpc (48232 ms total)
[----------] 1 test from Parameters/TestRpcSocketTxRxQueue
[ RUN ] Parameters/TestRpcSocketTxRxQueue.AcceptorRxQueueSizeMetric/0
I20260924 19:02:17.359973 3690 acceptor_pool.cc:254] collecting diagnostics on the listening RPC socket 0.0.0.0:33865 every 1 connection(s)
I20260924 19:02:17.360198 3691 acceptor_pool.cc:254] collecting diagnostics on the listening RPC socket 0.0.0.0:33865 every 1 connection(s)
W20260924 19:02:17.361711 3686 negotiation.cc:337] Failed RPC negotiation. Trace:
0924 19:02:17.361336 (+ 0us) reactor.cc:625] Submitting negotiation task for server connection from 127.0.0.1:47942 (local address 127.0.0.1:33865)
0924 19:02:17.361473 (+ 137us) server_negotiation.cc:206] Beginning negotiation
0924 19:02:17.361477 (+ 4us) server_negotiation.cc:399] Waiting for connection header
0924 19:02:17.361606 (+ 129us) negotiation.cc:327] Negotiation complete: Network error: Server connection negotiation failed: server connection from 127.0.0.1:47942: BlockingRecv error: recv got EOF from 127.0.0.1:47942 (error 108)
Metrics: {"server-negotiator.queue_time_us":39}
[ OK ] Parameters/TestRpcSocketTxRxQueue.AcceptorRxQueueSizeMetric/0 (12 ms)
[----------] 1 test from Parameters/TestRpcSocketTxRxQueue (12 ms total)
[----------] Global test environment tear-down
[==========] 21 tests from 2 test suites ran. (48245 ms total)
[ PASSED ] 20 tests.
[ FAILED ] 1 test, listed below:
[ FAILED ] Parameters/TestRpc.TestCallWithChainCertAndChainCA/SSL_UnixSocket, where GetParam() = (true, true)
1 FAILED TEST