Parameters/TestRpc.TestCallWithChainCertAndRootCA/SSL_TCP: /data0/somelongdirectorytoavoidrpathissues/src/kudu/src/kudu/rpc/rpc-test.cc:303: Failure
Failed
Bad status: Runtime error: could not verify certificate chain (error with cert: subject=CN = localhost, ST = sadfjas, C = AS, emailAddress = sdflkdsajf, O = lskdfjlsad, OU = sldfkja, issuer=C = AS, ST = ASDfkjdhf, L = lskdjf, O = saldfja, OU = skdjf, CN = localhost, emailAddress = sadjflkadsj): : certificate has expired
Google Test trace:
/data0/somelongdirectorytoavoidrpathissues/src/kudu/src/kudu/rpc/rpc-test.cc:300: Connecting to 0.0.0.0:39941
I20260926 12:11:16.337215 4877 test_util.cc:175] -----------------------------------------------
I20260926 12:11:16.337410 4877 test_util.cc:176] Had fatal failures, leaving test files at /tmp/dist-test-taskXIvmMo/test-tmp/rpc-test.1.Parameters_TestRpc.TestCallWithChainCertAndRootCA_SSL_TCP.1790424674805347-4877-0
Note: This is test shard 2 of 8.
[==========] Running 21 tests from 2 test suites.
[----------] Global test environment set-up.
[----------] 1 test from TestRpc
[ RUN ] TestRpc.TestMethodsByName
[ OK ] TestRpc.TestMethodsByName (6 ms)
[----------] 1 test from TestRpc (6 ms total)
[----------] 20 tests from Parameters/TestRpc
[ RUN ] Parameters/TestRpc.TestAcceptorPoolStartStop/SSL_TCP
WARNING: Logging before InitGoogleLogging() is written to STDERR
I20260926 12:11:14.932319 4892 acceptor_pool.cc:254] collecting diagnostics on the listening RPC socket 0.0.0.0:34929 every 8 connection(s)
W20260926 12:11:15.934593 4877 thread.cc:536] Waited for 1000ms trying to join with acceptor (tid 4893)
I20260926 12:11:14.933966 4893 acceptor_pool.cc:254] collecting diagnostics on the listening RPC socket 0.0.0.0:34929 every 8 connection(s)
I20260926 12:11:16.077297 4904 acceptor_pool.cc:254] collecting diagnostics on the listening RPC socket 0.0.0.0:40007 every 8 connection(s)
I20260926 12:11:16.078812 4905 acceptor_pool.cc:254] collecting diagnostics on the listening RPC socket 0.0.0.0:40007 every 8 connection(s)
I20260926 12:11:16.105309 4915 acceptor_pool.cc:254] collecting diagnostics on the listening RPC socket 0.0.0.0:37113 every 8 connection(s)
I20260926 12:11:16.106808 4916 acceptor_pool.cc:254] collecting diagnostics on the listening RPC socket 0.0.0.0:37113 every 8 connection(s)
I20260926 12:11:16.136816 4926 acceptor_pool.cc:254] collecting diagnostics on the listening RPC socket 0.0.0.0:42007 every 8 connection(s)
I20260926 12:11:16.137574 4927 acceptor_pool.cc:254] collecting diagnostics on the listening RPC socket 0.0.0.0:42007 every 8 connection(s)
I20260926 12:11:16.155627 4937 acceptor_pool.cc:254] collecting diagnostics on the listening RPC socket 0.0.0.0:33165 every 8 connection(s)
I20260926 12:11:16.156361 4938 acceptor_pool.cc:254] collecting diagnostics on the listening RPC socket 0.0.0.0:33165 every 8 connection(s)
[ OK ] Parameters/TestRpc.TestAcceptorPoolStartStop/SSL_TCP (1294 ms)
[ RUN ] Parameters/TestRpc.TestCall/SSL_TCP
I20260926 12:11:16.192535 4950 acceptor_pool.cc:254] collecting diagnostics on the listening RPC socket 0.0.0.0:42085 every 8 connection(s)
I20260926 12:11:16.194168 4951 acceptor_pool.cc:254] collecting diagnostics on the listening RPC socket 0.0.0.0:42085 every 8 connection(s)
I20260926 12:11:16.199857 4877 rpc-test.cc:234] Connecting to 0.0.0.0:42085
[ OK ] Parameters/TestRpc.TestCall/SSL_TCP (138 ms)
[ RUN ] Parameters/TestRpc.TestCallWithChainCertAndRootCA/SSL_TCP
I20260926 12:11:16.316900 4975 acceptor_pool.cc:254] collecting diagnostics on the listening RPC socket 0.0.0.0:39941 every 8 connection(s)
I20260926 12:11:16.317649 4976 acceptor_pool.cc:254] collecting diagnostics on the listening RPC socket 0.0.0.0:39941 every 8 connection(s)
/data0/somelongdirectorytoavoidrpathissues/src/kudu/src/kudu/rpc/rpc-test.cc:303: Failure
Failed
Bad status: Runtime error: could not verify certificate chain (error with cert: subject=CN = localhost, ST = sadfjas, C = AS, emailAddress = sdflkdsajf, O = lskdfjlsad, OU = sldfkja, issuer=C = AS, ST = ASDfkjdhf, L = lskdjf, O = saldfja, OU = skdjf, CN = localhost, emailAddress = sadjflkadsj): : certificate has expired
Google Test trace:
/data0/somelongdirectorytoavoidrpathissues/src/kudu/src/kudu/rpc/rpc-test.cc:300: Connecting to 0.0.0.0:39941
I20260926 12:11:16.337215 4877 test_util.cc:175] -----------------------------------------------
I20260926 12:11:16.337410 4877 test_util.cc:176] Had fatal failures, leaving test files at /tmp/dist-test-taskXIvmMo/test-tmp/rpc-test.1.Parameters_TestRpc.TestCallWithChainCertAndRootCA_SSL_TCP.1790424674805347-4877-0
[ FAILED ] Parameters/TestRpc.TestCallWithChainCertAndRootCA/SSL_TCP, where GetParam() = (true, false) (37 ms)
[ RUN ] Parameters/TestRpc.TestCallWithBadPasswordProtectedKey/SSL_TCP
[ OK ] Parameters/TestRpc.TestCallWithBadPasswordProtectedKey/SSL_TCP (32 ms)
[ RUN ] Parameters/TestRpc.TestInvalidMethodCall/SSL_TCP
I20260926 12:11:16.390538 5012 acceptor_pool.cc:254] collecting diagnostics on the listening RPC socket 0.0.0.0:38057 every 8 connection(s)
I20260926 12:11:16.391434 5013 acceptor_pool.cc:254] collecting diagnostics on the listening RPC socket 0.0.0.0:38057 every 8 connection(s)
I20260926 12:11:16.394807 4877 rpc-test.cc:406] Connecting to 0.0.0.0:38057
[ OK ] Parameters/TestRpc.TestInvalidMethodCall/SSL_TCP (67 ms)
[ RUN ] Parameters/TestRpc.TestHighFDs/SSL_TCP
I20260926 12:11:16.657935 5037 acceptor_pool.cc:254] collecting diagnostics on the listening RPC socket 0.0.0.0:42053 every 8 connection(s)
I20260926 12:11:16.658720 5038 acceptor_pool.cc:254] collecting diagnostics on the listening RPC socket 0.0.0.0:42053 every 8 connection(s)
[ OK ] Parameters/TestRpc.TestHighFDs/SSL_TCP (292 ms)
[ RUN ] Parameters/TestRpc.TestConnectionAlwaysKeepalive/SSL_TCP
I20260926 12:11:16.750603 5060 acceptor_pool.cc:254] collecting diagnostics on the listening RPC socket 0.0.0.0:33545 every 8 connection(s)
I20260926 12:11:16.751356 5061 acceptor_pool.cc:254] collecting diagnostics on the listening RPC socket 0.0.0.0:33545 every 8 connection(s)
I20260926 12:11:16.754480 4877 rpc-test.cc:532] Connecting to 0.0.0.0:33545
[ OK ] Parameters/TestRpc.TestConnectionAlwaysKeepalive/SSL_TCP (3064 ms)
[ RUN ] Parameters/TestRpc.TestReopenOutboundConnections/SSL_TCP
I20260926 12:11:19.826576 5083 acceptor_pool.cc:254] collecting diagnostics on the listening RPC socket 0.0.0.0:44335 every 8 connection(s)
I20260926 12:11:19.827322 5084 acceptor_pool.cc:254] collecting diagnostics on the listening RPC socket 0.0.0.0:44335 every 8 connection(s)
I20260926 12:11:19.830507 4877 rpc-test.cc:658] Connecting to 0.0.0.0:44335
[ OK ] Parameters/TestRpc.TestReopenOutboundConnections/SSL_TCP (399 ms)
[ RUN ] Parameters/TestRpc.TestConnectionNetworkPlane/SSL_TCP
I20260926 12:11:20.210410 5106 acceptor_pool.cc:254] collecting diagnostics on the listening RPC socket 0.0.0.0:46165 every 8 connection(s)
I20260926 12:11:20.211140 5107 acceptor_pool.cc:254] collecting diagnostics on the listening RPC socket 0.0.0.0:46165 every 8 connection(s)
I20260926 12:11:20.214290 4877 rpc-test.cc:772] Connecting to 0.0.0.0:46165
[ OK ] Parameters/TestRpc.TestConnectionNetworkPlane/SSL_TCP (60 ms)
[ RUN ] Parameters/TestRpc.TestTCPKeepalive/SSL_TCP
I20260926 12:11:20.306402 5131 acceptor_pool.cc:254] collecting diagnostics on the listening RPC socket 0.0.0.0:34475 every 8 connection(s)
I20260926 12:11:20.307080 5132 acceptor_pool.cc:254] collecting diagnostics on the listening RPC socket 0.0.0.0:34475 every 8 connection(s)
I20260926 12:11:20.342386 5135 rpc-test-base.h:222] got call: sleep_micros: 8000000 deferred: true
I20260926 12:11:28.346463 5135 rpcz_store.cc:275] Call kudu.rpc.GenericCalculatorService.Sleep from 127.0.0.1:33074 (request call id 0) took 8004 ms. Trace:
I20260926 12:11:28.346869 5135 rpcz_store.cc:276] 0926 12:11:20.342045 (+ 0us) service_pool.cc:170] Inserting onto call queue
0926 12:11:20.342177 (+ 132us) service_pool.cc:227] Handling call
0926 12:11:28.346180 (+8004003us) inbound_call.cc:173] Queueing success response
Metrics: {}
[ OK ] Parameters/TestRpc.TestTCPKeepalive/SSL_TCP (8104 ms)
[ RUN ] Parameters/TestRpc.TestMaxSmallSidecars/SSL_TCP
I20260926 12:11:28.386796 5157 acceptor_pool.cc:254] collecting diagnostics on the listening RPC socket 0.0.0.0:36375 every 8 connection(s)
I20260926 12:11:28.387594 5158 acceptor_pool.cc:254] collecting diagnostics on the listening RPC socket 0.0.0.0:36375 every 8 connection(s)
[ OK ] Parameters/TestRpc.TestMaxSmallSidecars/SSL_TCP (200 ms)
[ RUN ] Parameters/TestRpc.TestCallTimeout/SSL_TCP
I20260926 12:11:28.580472 5182 acceptor_pool.cc:254] collecting diagnostics on the listening RPC socket 0.0.0.0:44895 every 8 connection(s)
I20260926 12:11:28.581198 5183 acceptor_pool.cc:254] collecting diagnostics on the listening RPC socket 0.0.0.0:44895 every 8 connection(s)
I20260926 12:11:28.602564 4877 rpc-test-base.h:595] status: Timed out: connection negotiation to 0.0.0.0:44895 for RPC Sleep timed out after 0.000s (ON_OUTBOUND_QUEUE), seconds elapsed: 0.00245863
I20260926 12:11:28.610080 5186 rpc-test-base.h:222] got call: sleep_micros: 700000
I20260926 12:11:28.803838 4877 rpc-test-base.h:595] status: Timed out: Sleep RPC to 0.0.0.0:44895 timed out after 0.200s (SENT), seconds elapsed: 0.200888
I20260926 12:11:28.805270 5185 rpc-test-base.h:222] got call: sleep_micros: 2000000
W20260926 12:11:29.310811 5186 rpcz_store.cc:267] Call kudu.rpc.GenericCalculatorService.Sleep from 127.0.0.1:45328 (request call id 1) took 700 ms (client timeout 200 ms). Trace:
W20260926 12:11:29.311199 5186 rpcz_store.cc:269] 0926 12:11:28.609916 (+ 0us) service_pool.cc:170] Inserting onto call queue
0926 12:11:28.610024 (+ 108us) service_pool.cc:227] Handling call
0926 12:11:29.310743 (+700719us) inbound_call.cc:173] Queueing success response
Metrics: {}
I20260926 12:11:30.305608 4877 rpc-test-base.h:595] status: Timed out: Sleep RPC to 0.0.0.0:44895 timed out after 1.500s (SENT), seconds elapsed: 1.50143
W20260926 12:11:30.805815 5185 rpcz_store.cc:267] Call kudu.rpc.GenericCalculatorService.Sleep from 127.0.0.1:45328 (request call id 2) took 2000 ms (client timeout 1500 ms). Trace:
W20260926 12:11:30.806177 5185 rpcz_store.cc:269] 0926 12:11:28.804984 (+ 0us) service_pool.cc:170] Inserting onto call queue
0926 12:11:28.805117 (+ 133us) service_pool.cc:227] Handling call
0926 12:11:30.805762 (+2000645us) inbound_call.cc:173] Queueing success response
Metrics: {}
W20260926 12:11:30.806758 5180 connection.cc:441] server connection from 127.0.0.1:45328 torn down before Call kudu.rpc.GenericCalculatorService.Sleep from 127.0.0.1:45328 (request call id 2) could send its response
[ OK ] Parameters/TestRpc.TestCallTimeout/SSL_TCP (2250 ms)
[ RUN ] Parameters/TestRpc.TestServerShutsDown/SSL_TCP
I20260926 12:11:30.813635 4877 rpc-test.cc:1125] Connecting to 0.0.0.0:41997
W20260926 12:11:30.822505 5199 negotiation.cc:337] Failed RPC negotiation. Trace:
0926 12:11:30.820954 (+ 0us) reactor.cc:625] Submitting negotiation task for client connection to 0.0.0.0:41997 (local address 127.0.0.1:35562)
0926 12:11:30.821391 (+ 437us) negotiation.cc:107] Waiting for socket to connect
0926 12:11:30.821421 (+ 30us) client_negotiation.cc:174] Beginning negotiation
0926 12:11:30.821630 (+ 209us) client_negotiation.cc:252] Sending NEGOTIATE NegotiatePB request
0926 12:11:30.821844 (+ 214us) negotiation.cc:327] Negotiation complete: Network error: Client connection negotiation failed: client connection to 0.0.0.0:41997: BlockingWrite error: write error: Broken pipe (error 32)
Metrics: {"client-negotiator.queue_time_us":115}
[ OK ] Parameters/TestRpc.TestServerShutsDown/SSL_TCP (13 ms)
[ RUN ] Parameters/TestRpc.TimedOutOnResponseMetric/SSL_TCP
I20260926 12:11:30.850415 5216 acceptor_pool.cc:254] collecting diagnostics on the listening RPC socket 0.0.0.0:46773 every 8 connection(s)
I20260926 12:11:30.851166 5217 acceptor_pool.cc:254] collecting diagnostics on the listening RPC socket 0.0.0.0:46773 every 8 connection(s)
W20260926 12:11:31.090842 5220 rpcz_store.cc:267] Call kudu.rpc_test.CalculatorService.Sleep from 127.0.0.1:43218 (request call id 3) took 50 ms (client timeout 25 ms). Trace:
W20260926 12:11:31.091131 5220 rpcz_store.cc:269] 0926 12:11:31.040238 (+ 0us) service_pool.cc:170] Inserting onto call queue
0926 12:11:31.040377 (+ 139us) service_pool.cc:227] Handling call
0926 12:11:31.090771 (+ 50394us) inbound_call.cc:173] Queueing success response
Related trace 'test_child':
Metrics: {"test_sleep_us":50000,"child_traces":[["test_child",{"related_trace_metric":1}]]}
W20260926 12:11:31.150338 5220 rpcz_store.cc:267] Call kudu.rpc_test.CalculatorService.Sleep from 127.0.0.1:43218 (request call id 4) took 50 ms (client timeout 50 ms). Trace:
W20260926 12:11:31.150658 5220 rpcz_store.cc:269] 0926 12:11:31.099826 (+ 0us) service_pool.cc:170] Inserting onto call queue
0926 12:11:31.099946 (+ 120us) service_pool.cc:227] Handling call
0926 12:11:31.150281 (+ 50335us) inbound_call.cc:173] Queueing success response
Related trace 'test_child':
Metrics: {"test_sleep_us":50000,"child_traces":[["test_child",{"related_trace_metric":1}]]}
[ OK ] Parameters/TestRpc.TimedOutOnResponseMetric/SSL_TCP (333 ms)
[ RUN ] Parameters/TestRpc.AcceptorDispatchingTimesMetric/SSL_TCP
I20260926 12:11:31.170841 5241 acceptor_pool.cc:254] collecting diagnostics on the listening RPC socket 0.0.0.0:39309 every 8 connection(s)
I20260926 12:11:31.171564 5242 acceptor_pool.cc:254] collecting diagnostics on the listening RPC socket 0.0.0.0:39309 every 8 connection(s)
W20260926 12:11:31.176296 5237 negotiation.cc:337] Failed RPC negotiation. Trace:
0926 12:11:31.175247 (+ 0us) reactor.cc:625] Submitting negotiation task for server connection from 127.0.0.1:42390 (local address 127.0.0.1:39309)
0926 12:11:31.175654 (+ 407us) server_negotiation.cc:206] Beginning negotiation
0926 12:11:31.175671 (+ 17us) server_negotiation.cc:399] Waiting for connection header
0926 12:11:31.175881 (+ 210us) negotiation.cc:327] Negotiation complete: Network error: Server connection negotiation failed: server connection from 127.0.0.1:42390: BlockingRecv error: recv got EOF from 127.0.0.1:42390 (error 108)
Metrics: {"server-negotiator.queue_time_us":106}
[ OK ] Parameters/TestRpc.AcceptorDispatchingTimesMetric/SSL_TCP (22 ms)
[ RUN ] Parameters/TestRpc.TestRpcCallbackDestroysMessenger/SSL_TCP
[ OK ] Parameters/TestRpc.TestRpcCallbackDestroysMessenger/SSL_TCP (19 ms)
[ RUN ] Parameters/TestRpc.TestApplicationFeatureFlag/SSL_TCP
I20260926 12:11:31.222132 5266 acceptor_pool.cc:254] collecting diagnostics on the listening RPC socket 0.0.0.0:36213 every 8 connection(s)
I20260926 12:11:31.222836 5267 acceptor_pool.cc:254] collecting diagnostics on the listening RPC socket 0.0.0.0:36213 every 8 connection(s)
W20260926 12:11:31.253183 5264 messenger.cc:357] Unable to handle RPC call: Not implemented: call requires unsupported application feature flags: 99
[ OK ] Parameters/TestRpc.TestApplicationFeatureFlag/SSL_TCP (59 ms)
[ RUN ] Parameters/TestRpc.TestCancellation/SSL_TCP
I20260926 12:11:31.280967 5291 acceptor_pool.cc:254] collecting diagnostics on the listening RPC socket 0.0.0.0:34265 every 8 connection(s)
I20260926 12:11:31.281667 5292 acceptor_pool.cc:254] collecting diagnostics on the listening RPC socket 0.0.0.0:34265 every 8 connection(s)
I20260926 12:11:31.284842 4877 rpc-test.cc:1648] Connecting to 0.0.0.0:34265
I20260926 12:11:31.415655 4877 rpc-test-base.h:595] status: Aborted: Sleep RPC to 0.0.0.0:34265 is cancelled in state READY, seconds elapsed: 0.000367357
I20260926 12:11:31.551964 4877 rpc-test-base.h:595] status: Aborted: Sleep RPC to 0.0.0.0:34265 is cancelled in state SENT, seconds elapsed: 0.000854536
I20260926 12:11:31.597321 5294 rpc-test-base.h:222] got call: sleep_micros: 510000
I20260926 12:11:31.728336 4877 rpc-test-base.h:595] status: Aborted: Sleep RPC to 0.0.0.0:34265 is cancelled in state SENT, seconds elapsed: 0.000910118
I20260926 12:11:31.771425 5293 rpc-test-base.h:222] got call: sleep_micros: 510000
I20260926 12:11:31.896394 4877 rpc-test-base.h:595] status: Aborted: Sleep RPC to 0.0.0.0:34265 is cancelled in state SENT, seconds elapsed: 0.000779083
W20260926 12:11:31.945189 5295 rpcz_store.cc:267] Call kudu.rpc.GenericCalculatorService.Sleep from 127.0.0.1:59010 (request call id 11) took 17 ms (client timeout 10 ms). Trace:
W20260926 12:11:31.945540 5295 rpcz_store.cc:269] 0926 12:11:31.927532 (+ 0us) service_pool.cc:170] Inserting onto call queue
0926 12:11:31.944861 (+ 17329us) service_pool.cc:214] Skipping call since client already timed out
0926 12:11:31.944993 (+ 132us) inbound_call.cc:173] Queueing failure response
Metrics: {}
I20260926 12:11:31.946090 5295 rpc-test-base.h:222] got call: sleep_micros: 1500000
W20260926 12:11:32.108040 5294 rpcz_store.cc:267] Call kudu.rpc.GenericCalculatorService.Sleep from 127.0.0.1:59010 (request call id 3) took 511 ms (client timeout 10 ms). Trace:
W20260926 12:11:32.108453 5294 rpcz_store.cc:269] 0926 12:11:31.597100 (+ 0us) service_pool.cc:170] Inserting onto call queue
0926 12:11:31.597250 (+ 150us) service_pool.cc:227] Handling call
0926 12:11:32.107986 (+510736us) inbound_call.cc:173] Queueing success response
Metrics: {}
W20260926 12:11:32.282117 5293 rpcz_store.cc:267] Call kudu.rpc.GenericCalculatorService.Sleep from 127.0.0.1:59010 (request call id 7) took 516 ms (client timeout 10 ms). Trace:
W20260926 12:11:32.282536 5293 rpcz_store.cc:269] 0926 12:11:31.765911 (+ 0us) service_pool.cc:170] Inserting onto call queue
0926 12:11:31.771350 (+ 5439us) service_pool.cc:227] Handling call
0926 12:11:32.282062 (+510712us) inbound_call.cc:173] Queueing success response
Metrics: {}
I20260926 12:11:32.898624 4877 rpc-test-base.h:595] status: Timed out: Sleep RPC to 0.0.0.0:34265 timed out after 1.000s (SENT), seconds elapsed: 1.00191
I20260926 12:11:32.900233 5293 rpc-test-base.h:222] got call: sleep_micros: 1500000
W20260926 12:11:33.446695 5295 rpcz_store.cc:267] Call kudu.rpc.GenericCalculatorService.Sleep from 127.0.0.1:59010 (request call id 12) took 1518 ms (client timeout 1000 ms). Trace:
W20260926 12:11:33.447000 5295 rpcz_store.cc:269] 0926 12:11:31.927913 (+ 0us) service_pool.cc:170] Inserting onto call queue
0926 12:11:31.946049 (+ 18136us) service_pool.cc:227] Handling call
0926 12:11:33.446643 (+1500594us) inbound_call.cc:173] Queueing success response
Metrics: {}
I20260926 12:11:33.900291 4877 rpc-test-base.h:595] status: Timed out: Sleep RPC to 0.0.0.0:34265 timed out after 1.000s (SENT), seconds elapsed: 1.00117
W20260926 12:11:33.901639 5289 messenger.cc:357] Unable to handle RPC call: Not implemented: call requires unsupported application feature flags: 99, 1
W20260926 12:11:33.903111 5289 messenger.cc:357] Unable to handle RPC call: Not implemented: call requires unsupported application feature flags: 99, 1
W20260926 12:11:34.400870 5293 rpcz_store.cc:267] Call kudu.rpc.GenericCalculatorService.Sleep from 127.0.0.1:59010 (request call id 13) took 1500 ms (client timeout 1000 ms). Trace:
W20260926 12:11:34.401345 5293 rpcz_store.cc:269] 0926 12:11:32.900066 (+ 0us) service_pool.cc:170] Inserting onto call queue
0926 12:11:32.900182 (+ 116us) service_pool.cc:227] Handling call
0926 12:11:34.400786 (+1500604us) inbound_call.cc:173] Queueing success response
Metrics: {}
W20260926 12:11:34.401971 5289 connection.cc:441] server connection from 127.0.0.1:59010 torn down before Call kudu.rpc.GenericCalculatorService.Sleep from 127.0.0.1:59010 (request call id 13) could send its response
[ OK ] Parameters/TestRpc.TestCancellation/SSL_TCP (3147 ms)
[ RUN ] Parameters/TestRpc.TestCancellationMultiThreads/SSL_TCP
I20260926 12:11:34.436833 5316 acceptor_pool.cc:254] collecting diagnostics on the listening RPC socket 0.0.0.0:45477 every 8 connection(s)
I20260926 12:11:34.437510 5317 acceptor_pool.cc:254] collecting diagnostics on the listening RPC socket 0.0.0.0:45477 every 8 connection(s)
I20260926 12:11:34.440659 4877 rpc-test.cc:1808] Connecting to 0.0.0.0:45477
I20260926 12:11:34.583590 5330 test_util.cc:268] Using random seed: -1142230772
I20260926 12:11:34.584740 5331 test_util.cc:268] Using random seed: -1142229620
I20260926 12:11:34.586150 5332 test_util.cc:268] Using random seed: -1142228209
I20260926 12:11:34.587493 5333 test_util.cc:268] Using random seed: -1142226882
I20260926 12:11:34.589178 5334 test_util.cc:268] Using random seed: -1142225347
I20260926 12:11:34.590550 5335 test_util.cc:268] Using random seed: -1142223931
I20260926 12:11:34.592175 5336 test_util.cc:268] Using random seed: -1142222346
I20260926 12:11:34.593683 5337 test_util.cc:268] Using random seed: -1142220811
I20260926 12:11:34.595336 5338 test_util.cc:268] Using random seed: -1142219186
I20260926 12:11:34.596812 5339 test_util.cc:268] Using random seed: -1142217654
I20260926 12:11:34.598176 5340 test_util.cc:268] Using random seed: -1142216325
I20260926 12:11:34.599828 5341 test_util.cc:268] Using random seed: -1142214677
I20260926 12:11:34.601411 5342 test_util.cc:268] Using random seed: -1142213089
I20260926 12:11:34.602972 5343 test_util.cc:268] Using random seed: -1142211575
I20260926 12:11:34.605005 5344 test_util.cc:268] Using random seed: -1142209511
I20260926 12:11:34.606592 5345 test_util.cc:268] Using random seed: -1142207894
I20260926 12:11:34.609303 5346 test_util.cc:268] Using random seed: -1142205198
I20260926 12:11:34.610821 5347 test_util.cc:268] Using random seed: -1142203696
I20260926 12:11:34.612162 5348 test_util.cc:268] Using random seed: -1142202291
I20260926 12:11:34.613315 5349 test_util.cc:268] Using random seed: -1142201143
I20260926 12:11:34.614645 5350 test_util.cc:268] Using random seed: -1142199810
I20260926 12:11:34.615854 5351 test_util.cc:268] Using random seed: -1142198610
I20260926 12:11:34.616976 5352 test_util.cc:268] Using random seed: -1142197471
I20260926 12:11:34.622623 5355 test_util.cc:268] Using random seed: -1142191920
I20260926 12:11:34.618108 5353 test_util.cc:268] Using random seed: -1142196340
I20260926 12:11:34.619655 5354 test_util.cc:268] Using random seed: -1142194870
I20260926 12:11:34.625486 5356 test_util.cc:268] Using random seed: -1142189077
I20260926 12:11:34.633715 5357 test_util.cc:268] Using random seed: -1142180819
I20260926 12:11:34.637315 5358 test_util.cc:268] Using random seed: -1142177235
I20260926 12:11:34.643113 5359 test_util.cc:268] Using random seed: -1142171417
[ OK ] Parameters/TestRpc.TestCancellationMultiThreads/SSL_TCP (17778 ms)
[ RUN ] Parameters/TestRpc.TestCallId/SSL_TCP
I20260926 12:11:52.234781 5373 acceptor_pool.cc:254] collecting diagnostics on the listening RPC socket 0.0.0.0:34389 every 8 connection(s)
I20260926 12:11:52.235582 5374 acceptor_pool.cc:254] collecting diagnostics on the listening RPC socket 0.0.0.0:34389 every 8 connection(s)
[ OK ] Parameters/TestRpc.TestCallId/SSL_TCP (99 ms)
[----------] 20 tests from Parameters/TestRpc (37420 ms total)
[----------] Global test environment tear-down
[==========] 21 tests from 2 test suites ran. (37427 ms total)
[ PASSED ] 20 tests.
[ FAILED ] 1 test, listed below:
[ FAILED ] Parameters/TestRpc.TestCallWithChainCertAndRootCA/SSL_TCP, where GetParam() = (true, false)
1 FAILED TEST