Diagnosed failure
Parameters/TestRpc.TestCallWithChainCertAndChainCA/SSL_UnixSocket: /data0/somelongdirectorytoavoidrpathissues/src/kudu/src/kudu/rpc/rpc-test.cc:270: Failure
Failed
Bad status: Runtime error: could not verify certificate chain (error with cert: subject=CN = localhost, ST = sadfjas, C = AS, emailAddress = sdflkdsajf, O = lskdfjlsad, OU = sldfkja, issuer=C = AS, ST = ASDfkjdhf, L = lskdjf, O = saldfja, OU = skdjf, CN = localhost, emailAddress = sadjflkadsj): : certificate has expired
Google Test trace:
/data0/somelongdirectorytoavoidrpathissues/src/kudu/src/kudu/rpc/rpc-test.cc:267: Connecting to unix:/tmp/dist-test-taskYBRu3H/test-tmp/rpc-test-42c7a4883a704afea209b54dbc4ecfc7.sock
I20260929 16:25:20.726841 383 test_util.cc:175] -----------------------------------------------
I20260929 16:25:20.726925 383 test_util.cc:176] Had fatal failures, leaving test files at /tmp/dist-test-taskYBRu3H/test-tmp/rpc-test.6.Parameters_TestRpc.TestCallWithChainCertAndChainCA_SSL_UnixSocket.1790699120613184-383-0
Full log
Note: This is test shard 7 of 8.
[==========] Running 21 tests from 2 test suites.
[----------] Global test environment set-up.
[----------] 20 tests from Parameters/TestRpc
[ RUN ] Parameters/TestRpc.TestMessengerCreateDestroy/SSL_UnixSocket
WARNING: Logging before InitGoogleLogging() is written to STDERR
I20260929 16:25:20.657282 383 rpc-test.cc:169] started messenger TestCreateDestroy
[ OK ] Parameters/TestRpc.TestMessengerCreateDestroy/SSL_UnixSocket (39 ms)
[ RUN ] Parameters/TestRpc.TestNegotiationDeadlock/SSL_UnixSocket
I20260929 16:25:20.686954 403 acceptor_pool.cc:254] collecting diagnostics on the listening RPC socket unix:/tmp/dist-test-taskYBRu3H/test-tmp/rpc-test-0b11347d2415474ebda660e937a9f03a.sock every 8 connection(s)
I20260929 16:25:20.687011 404 acceptor_pool.cc:254] collecting diagnostics on the listening RPC socket unix:/tmp/dist-test-taskYBRu3H/test-tmp/rpc-test-0b11347d2415474ebda660e937a9f03a.sock every 8 connection(s)
[ OK ] Parameters/TestRpc.TestNegotiationDeadlock/SSL_UnixSocket (42 ms)
[ RUN ] Parameters/TestRpc.TestCallWithChainCertAndChainCA/SSL_UnixSocket
I20260929 16:25:20.720109 419 acceptor_pool.cc:254] collecting diagnostics on the listening RPC socket unix:/tmp/dist-test-taskYBRu3H/test-tmp/rpc-test-42c7a4883a704afea209b54dbc4ecfc7.sock every 8 connection(s)
I20260929 16:25:20.720209 420 acceptor_pool.cc:254] collecting diagnostics on the listening RPC socket unix:/tmp/dist-test-taskYBRu3H/test-tmp/rpc-test-42c7a4883a704afea209b54dbc4ecfc7.sock every 8 connection(s)
/data0/somelongdirectorytoavoidrpathissues/src/kudu/src/kudu/rpc/rpc-test.cc:270: Failure
Failed
Bad status: Runtime error: could not verify certificate chain (error with cert: subject=CN = localhost, ST = sadfjas, C = AS, emailAddress = sdflkdsajf, O = lskdfjlsad, OU = sldfkja, issuer=C = AS, ST = ASDfkjdhf, L = lskdjf, O = saldfja, OU = skdjf, CN = localhost, emailAddress = sadjflkadsj): : certificate has expired
Google Test trace:
/data0/somelongdirectorytoavoidrpathissues/src/kudu/src/kudu/rpc/rpc-test.cc:267: Connecting to unix:/tmp/dist-test-taskYBRu3H/test-tmp/rpc-test-42c7a4883a704afea209b54dbc4ecfc7.sock
I20260929 16:25:20.726841 383 test_util.cc:175] -----------------------------------------------
I20260929 16:25:20.726925 383 test_util.cc:176] Had fatal failures, leaving test files at /tmp/dist-test-taskYBRu3H/test-tmp/rpc-test.6.Parameters_TestRpc.TestCallWithChainCertAndChainCA_SSL_UnixSocket.1790699120613184-383-0
[ FAILED ] Parameters/TestRpc.TestCallWithChainCertAndChainCA/SSL_UnixSocket, where GetParam() = (true, true) (24 ms)
[ RUN ] Parameters/TestRpc.TestCallWithPasswordProtectedKey/SSL_UnixSocket
I20260929 16:25:20.767016 444 acceptor_pool.cc:254] collecting diagnostics on the listening RPC socket unix:/tmp/dist-test-taskYBRu3H/test-tmp/rpc-test-8cdeeac78dc646afaed7a356dd7cfecc.sock every 8 connection(s)
I20260929 16:25:20.767057 445 acceptor_pool.cc:254] collecting diagnostics on the listening RPC socket unix:/tmp/dist-test-taskYBRu3H/test-tmp/rpc-test-8cdeeac78dc646afaed7a356dd7cfecc.sock every 8 connection(s)
W20260929 16:25:20.784253 441 connection.cc:196] Error closing socket: Network error: TlsSocket::Close: Broken pipe
[ OK ] Parameters/TestRpc.TestCallWithPasswordProtectedKey/SSL_UnixSocket (59 ms)
[ RUN ] Parameters/TestRpc.TestCallToBadServer/SSL_UnixSocket
I20260929 16:25:20.825989 383 rpc-test.cc:394] Status: Network error: Client connection negotiation failed: client connection to 0.0.0.0:0: connect: Connection refused (error 111)
I20260929 16:25:20.826709 383 rpc-test.cc:394] Status: Network error: Client connection negotiation failed: client connection to 0.0.0.0:0: connect: Connection refused (error 111)
I20260929 16:25:20.827446 383 rpc-test.cc:394] Status: Network error: Client connection negotiation failed: client connection to 0.0.0.0:0: connect: Connection refused (error 111)
I20260929 16:25:20.828244 383 rpc-test.cc:394] Status: Network error: Client connection negotiation failed: client connection to 0.0.0.0:0: connect: Connection refused (error 111)
I20260929 16:25:20.828855 383 rpc-test.cc:394] Status: Network error: Client connection negotiation failed: client connection to 0.0.0.0:0: connect: Connection refused (error 111)
[ OK ] Parameters/TestRpc.TestCallToBadServer/SSL_UnixSocket (42 ms)
[ RUN ] Parameters/TestRpc.TestWrongService/SSL_UnixSocket
I20260929 16:25:20.845221 480 acceptor_pool.cc:254] collecting diagnostics on the listening RPC socket unix:/tmp/dist-test-taskYBRu3H/test-tmp/rpc-test-c4a4725b321f4d98b77312269abc28d4.sock every 8 connection(s)
I20260929 16:25:20.845222 479 acceptor_pool.cc:254] collecting diagnostics on the listening RPC socket unix:/tmp/dist-test-taskYBRu3H/test-tmp/rpc-test-c4a4725b321f4d98b77312269abc28d4.sock every 8 connection(s)
I20260929 16:25:20.866328 476 messenger.cc:345] service WrongServiceName not registered on TestServer
[ OK ] Parameters/TestRpc.TestWrongService/SSL_UnixSocket (40 ms)
[ RUN ] Parameters/TestRpc.TestConnectionKeepalive/SSL_UnixSocket
I20260929 16:25:20.898487 503 acceptor_pool.cc:254] collecting diagnostics on the listening RPC socket unix:/tmp/dist-test-taskYBRu3H/test-tmp/rpc-test-497cd57bac9641129f5c1404d79f31e3.sock every 8 connection(s)
I20260929 16:25:20.898562 502 acceptor_pool.cc:254] collecting diagnostics on the listening RPC socket unix:/tmp/dist-test-taskYBRu3H/test-tmp/rpc-test-497cd57bac9641129f5c1404d79f31e3.sock every 8 connection(s)
I20260929 16:25:20.898818 383 rpc-test.cc:488] Connecting to unix:/tmp/dist-test-taskYBRu3H/test-tmp/rpc-test-497cd57bac9641129f5c1404d79f31e3.sock
W20260929 16:25:21.373471 515 connection.cc:196] Error closing socket: Network error: TlsSocket::Close: Broken pipe
[ OK ] Parameters/TestRpc.TestConnectionKeepalive/SSL_UnixSocket (1063 ms)
[ RUN ] Parameters/TestRpc.TestClientConnectionMetrics/SSL_UnixSocket
I20260929 16:25:21.943104 527 acceptor_pool.cc:254] collecting diagnostics on the listening RPC socket unix:/tmp/dist-test-taskYBRu3H/test-tmp/rpc-test-86c8e40e1d684cf49e5ae2ce8de93a51.sock every 8 connection(s)
I20260929 16:25:21.943547 528 acceptor_pool.cc:254] collecting diagnostics on the listening RPC socket unix:/tmp/dist-test-taskYBRu3H/test-tmp/rpc-test-86c8e40e1d684cf49e5ae2ce8de93a51.sock every 8 connection(s)
I20260929 16:25:21.943650 383 rpc-test.cc:569] Connecting to unix:/tmp/dist-test-taskYBRu3H/test-tmp/rpc-test-86c8e40e1d684cf49e5ae2ce8de93a51.sock
W20260929 16:25:36.999552 524 connection.cc:196] Error closing socket: Network error: TlsSocket::Close: Broken pipe
[ OK ] Parameters/TestRpc.TestClientConnectionMetrics/SSL_UnixSocket (15066 ms)
[ RUN ] Parameters/TestRpc.TestCredentialsPolicy/SSL_UnixSocket
I20260929 16:25:37.019999 550 acceptor_pool.cc:254] collecting diagnostics on the listening RPC socket unix:/tmp/dist-test-taskYBRu3H/test-tmp/rpc-test-a207cd24b3624eeeb1c6ad6e3a7f7bd0.sock every 8 connection(s)
I20260929 16:25:37.020064 551 acceptor_pool.cc:254] collecting diagnostics on the listening RPC socket unix:/tmp/dist-test-taskYBRu3H/test-tmp/rpc-test-a207cd24b3624eeeb1c6ad6e3a7f7bd0.sock every 8 connection(s)
I20260929 16:25:37.020349 383 rpc-test.cc:700] Connecting to unix:/tmp/dist-test-taskYBRu3H/test-tmp/rpc-test-a207cd24b3624eeeb1c6ad6e3a7f7bd0.sock
W20260929 16:25:37.043129 549 connection.cc:196] Error closing socket: Network error: TlsSocket::Close: Broken pipe
[ OK ] Parameters/TestRpc.TestCredentialsPolicy/SSL_UnixSocket (50 ms)
[ RUN ] Parameters/TestRpc.TestCallLongerThanKeepalive/SSL_UnixSocket
I20260929 16:25:37.068655 575 acceptor_pool.cc:254] collecting diagnostics on the listening RPC socket unix:/tmp/dist-test-taskYBRu3H/test-tmp/rpc-test-a80e68fa35234ba28fe0205b1f5e6848.sock every 8 connection(s)
I20260929 16:25:37.068727 576 acceptor_pool.cc:254] collecting diagnostics on the listening RPC socket unix:/tmp/dist-test-taskYBRu3H/test-tmp/rpc-test-a80e68fa35234ba28fe0205b1f5e6848.sock every 8 connection(s)
I20260929 16:25:37.093387 579 rpc-test-base.h:222] got call: sleep_micros: 3000000 deferred: true
I20260929 16:25:40.094480 579 rpcz_store.cc:275] Call kudu.rpc.GenericCalculatorService.Sleep from unix:<unnamed> (request call id 0) took 3001 ms. Trace:
I20260929 16:25:40.094657 579 rpcz_store.cc:276] 0929 16:25:37.093263 (+ 0us) service_pool.cc:170] Inserting onto call queue
0929 16:25:37.093353 (+ 90us) service_pool.cc:227] Handling call
0929 16:25:40.094449 (+3001096us) inbound_call.cc:173] Queueing success response
Metrics: {}
[ OK ] Parameters/TestRpc.TestCallLongerThanKeepalive/SSL_UnixSocket (3046 ms)
[ RUN ] Parameters/TestRpc.TestRpcSidecar/SSL_UnixSocket
I20260929 16:25:40.117496 600 acceptor_pool.cc:254] collecting diagnostics on the listening RPC socket unix:/tmp/dist-test-taskYBRu3H/test-tmp/rpc-test-f18d31bf654e49bfaefb2a811a711960.sock every 8 connection(s)
I20260929 16:25:40.117587 601 acceptor_pool.cc:254] collecting diagnostics on the listening RPC socket unix:/tmp/dist-test-taskYBRu3H/test-tmp/rpc-test-f18d31bf654e49bfaefb2a811a711960.sock every 8 connection(s)
W20260929 16:25:40.185544 597 connection.cc:196] Error closing socket: Network error: TlsSocket::Close: Broken pipe
[ OK ] Parameters/TestRpc.TestRpcSidecar/SSL_UnixSocket (88 ms)
[ RUN ] Parameters/TestRpc.TestRpcSidecarLimits/SSL_UnixSocket
I20260929 16:25:42.121146 626 acceptor_pool.cc:254] collecting diagnostics on the listening RPC socket unix:/tmp/dist-test-taskYBRu3H/test-tmp/rpc-test-34dc919e1f0c4bba97550a4486dce950.sock every 8 connection(s)
I20260929 16:25:42.121273 625 acceptor_pool.cc:254] collecting diagnostics on the listening RPC socket unix:/tmp/dist-test-taskYBRu3H/test-tmp/rpc-test-34dc919e1f0c4bba97550a4486dce950.sock every 8 connection(s)
W20260929 16:25:42.137111 383 serialization.cc:72] Serialized kudu.rpc_test.PushStringsRequestPB (2147483654 bytes) is larger than the maximum configured RPC message size (52428800 bytes). Sending anyway, but peer may reject the data.
W20260929 16:25:42.141736 622 connection.cc:535] server connection from unix:<unnamed> recv error: Network error: RPC frame had a length of 2147483714, but we only support messages up to 52428800 bytes long.
W20260929 16:25:42.141891 622 connection.cc:158] shutting down server connection from unix:<unnamed> with pending inbound data: 4/2147483714 bytes received; last active 0 ns ago: status Network error: RPC frame had a length of 2147483714, but we only support messages up to 52428800 bytes long.
W20260929 16:25:42.142272 638 connection.cc:196] Error closing socket: Network error: TlsSocket::Close: Broken pipe
I20260929 16:25:42.158963 651 acceptor_pool.cc:254] collecting diagnostics on the listening RPC socket unix:/tmp/dist-test-taskYBRu3H/test-tmp/rpc-test-34dc919e1f0c4bba97550a4486dce950.sock every 8 connection(s)
I20260929 16:25:42.159070 650 acceptor_pool.cc:254] collecting diagnostics on the listening RPC socket unix:/tmp/dist-test-taskYBRu3H/test-tmp/rpc-test-34dc919e1f0c4bba97550a4486dce950.sock every 8 connection(s)
W20260929 16:25:48.321486 647 connection.cc:577] server connection from unix:<unnamed>: received bad data: 'Corruption: Invalid packet: message had a length of 2147483710, but we only support messages up to 2147483647 bytes
'
W20260929 16:25:48.322044 663 connection.cc:196] Error closing socket: Network error: TlsSocket::Close: Broken pipe
[ OK ] Parameters/TestRpc.TestRpcSidecarLimits/SSL_UnixSocket (8138 ms)
[ RUN ] Parameters/TestRpc.TestCallTimeoutDoesntAffectNegotiation/SSL_UnixSocket
I20260929 16:25:48.352440 675 acceptor_pool.cc:254] collecting diagnostics on the listening RPC socket unix:/tmp/dist-test-taskYBRu3H/test-tmp/rpc-test-52b24dea266a4a78b4eec4498b4558c7.sock every 8 connection(s)
I20260929 16:25:48.352500 676 acceptor_pool.cc:254] collecting diagnostics on the listening RPC socket unix:/tmp/dist-test-taskYBRu3H/test-tmp/rpc-test-52b24dea266a4a78b4eec4498b4558c7.sock every 8 connection(s)
W20260929 16:25:48.364679 671 negotiation.cc:266] Injecting 500ms delay in negotiation
I20260929 16:25:48.415032 383 rpc-test-base.h:595] status: Timed out: connection negotiation to unix:/tmp/dist-test-taskYBRu3H/test-tmp/rpc-test-52b24dea266a4a78b4eec4498b4558c7.sock for RPC Sleep timed out after 0.050s (ON_OUTBOUND_QUEUE), seconds elapsed: 0.0512172
W20260929 16:25:48.871387 672 connection.cc:196] Error closing socket: Network error: TlsSocket::Close: Broken pipe
[ OK ] Parameters/TestRpc.TestCallTimeoutDoesntAffectNegotiation/SSL_UnixSocket (547 ms)
[ RUN ] Parameters/TestRpc.TestRpcHandlerLatencyMetric/SSL_UnixSocket
I20260929 16:25:48.886649 701 acceptor_pool.cc:254] collecting diagnostics on the listening RPC socket unix:/tmp/dist-test-taskYBRu3H/test-tmp/rpc-test-c1e84a80caf74c969d94e50884b8960b.sock every 8 connection(s)
I20260929 16:25:48.886730 700 acceptor_pool.cc:254] collecting diagnostics on the listening RPC socket unix:/tmp/dist-test-taskYBRu3H/test-tmp/rpc-test-c1e84a80caf74c969d94e50884b8960b.sock every 8 connection(s)
I20260929 16:25:48.931512 383 rpc-test.cc:1236] Sleep() min lat: 20513
I20260929 16:25:48.931614 383 rpc-test.cc:1237] Sleep() mean lat: 20513
I20260929 16:25:48.931658 383 rpc-test.cc:1238] Sleep() max lat: 20513
I20260929 16:25:48.931680 383 rpc-test.cc:1239] Sleep() #calls: 1
W20260929 16:25:48.932853 697 connection.cc:196] Error closing socket: Network error: TlsSocket::Close: Broken pipe
[ OK ] Parameters/TestRpc.TestRpcHandlerLatencyMetric/SSL_UnixSocket (62 ms)
[ RUN ] Parameters/TestRpc.TimedOutOnResponseMetricServiceQueue/SSL_UnixSocket
I20260929 16:25:48.944119 726 acceptor_pool.cc:254] collecting diagnostics on the listening RPC socket unix:/tmp/dist-test-taskYBRu3H/test-tmp/rpc-test-e9b697086ffb47b5915f28f4ac6f8759.sock every 8 connection(s)
I20260929 16:25:48.944147 727 acceptor_pool.cc:254] collecting diagnostics on the listening RPC socket unix:/tmp/dist-test-taskYBRu3H/test-tmp/rpc-test-e9b697086ffb47b5915f28f4ac6f8759.sock every 8 connection(s)
W20260929 16:25:49.008059 728 rpcz_store.cc:267] Call kudu.rpc_test.CalculatorService.Sleep from unix:<unnamed> (request call id 2) took 20 ms (client timeout 20 ms). Trace:
W20260929 16:25:49.008217 728 rpcz_store.cc:269] 0929 16:25:48.987534 (+ 0us) service_pool.cc:170] Inserting onto call queue
0929 16:25:49.008004 (+ 20470us) service_pool.cc:214] Skipping call since client already timed out
0929 16:25:49.008036 (+ 32us) inbound_call.cc:173] Queueing failure response
Metrics: {}
W20260929 16:25:49.009297 723 connection.cc:196] Error closing socket: Network error: TlsSocket::Close: Broken pipe
[ OK ] Parameters/TestRpc.TimedOutOnResponseMetricServiceQueue/SSL_UnixSocket (75 ms)
[ RUN ] Parameters/TestRpc.RpcPendingConnectionsMetric/SSL_UnixSocket
I20260929 16:25:49.013806 750 acceptor_pool.cc:254] collecting diagnostics on the listening RPC socket 0.0.0.0:44355 every 8 connection(s)
I20260929 16:25:49.013806 749 acceptor_pool.cc:254] collecting diagnostics on the listening RPC socket 0.0.0.0:44355 every 8 connection(s)
W20260929 16:25:49.027551 745 negotiation.cc:337] Failed RPC negotiation. Trace:
0929 16:25:49.026588 (+ 0us) reactor.cc:625] Submitting negotiation task for server connection from 127.0.0.1:53700 (local address 127.0.0.1:44355)
0929 16:25:49.026911 (+ 323us) server_negotiation.cc:206] Beginning negotiation
0929 16:25:49.026917 (+ 6us) server_negotiation.cc:399] Waiting for connection header
0929 16:25:49.027127 (+ 210us) negotiation.cc:327] Negotiation complete: Network error: Server connection negotiation failed: server connection from 127.0.0.1:53700: BlockingRecv error: recv got EOF from 127.0.0.1:53700 (error 108)
Metrics: {"server-negotiator.queue_time_us":153}
[ OK ] Parameters/TestRpc.RpcPendingConnectionsMetric/SSL_UnixSocket (27 ms)
[ RUN ] Parameters/TestRpc.TestRpcContextClientDeadline/SSL_UnixSocket
I20260929 16:25:49.046440 765 acceptor_pool.cc:254] collecting diagnostics on the listening RPC socket unix:/tmp/dist-test-taskYBRu3H/test-tmp/rpc-test-a6dab86b74be418b9d1c97497d2a9457.sock every 8 connection(s)
I20260929 16:25:49.046561 766 acceptor_pool.cc:254] collecting diagnostics on the listening RPC socket unix:/tmp/dist-test-taskYBRu3H/test-tmp/rpc-test-a6dab86b74be418b9d1c97497d2a9457.sock every 8 connection(s)
W20260929 16:25:49.122048 762 connection.cc:196] Error closing socket: Network error: TlsSocket::Close: Broken pipe
[ OK ] Parameters/TestRpc.TestRpcContextClientDeadline/SSL_UnixSocket (85 ms)
[ RUN ] Parameters/TestRpc.TestApplicationFeatureFlagUnsupportedServer/SSL_UnixSocket
I20260929 16:25:49.144526 791 acceptor_pool.cc:254] collecting diagnostics on the listening RPC socket unix:/tmp/dist-test-taskYBRu3H/test-tmp/rpc-test-d2a52878ee7e491db9c97e0386e982ff.sock every 8 connection(s)
I20260929 16:25:49.144515 790 acceptor_pool.cc:254] collecting diagnostics on the listening RPC socket unix:/tmp/dist-test-taskYBRu3H/test-tmp/rpc-test-d2a52878ee7e491db9c97e0386e982ff.sock every 8 connection(s)
[ OK ] Parameters/TestRpc.TestApplicationFeatureFlagUnsupportedServer/SSL_UnixSocket (50 ms)
[ RUN ] Parameters/TestRpc.TestCancellationAsync/SSL_UnixSocket
I20260929 16:25:49.205879 816 acceptor_pool.cc:254] collecting diagnostics on the listening RPC socket unix:/tmp/dist-test-taskYBRu3H/test-tmp/rpc-test-35a67e26dddc4916b4bdc963759661d3.sock every 8 connection(s)
I20260929 16:25:49.206103 815 acceptor_pool.cc:254] collecting diagnostics on the listening RPC socket unix:/tmp/dist-test-taskYBRu3H/test-tmp/rpc-test-35a67e26dddc4916b4bdc963759661d3.sock every 8 connection(s)
I20260929 16:25:49.206207 383 rpc-test.cc:1716] Connecting to unix:/tmp/dist-test-taskYBRu3H/test-tmp/rpc-test-35a67e26dddc4916b4bdc963759661d3.sock
I20260929 16:25:49.241011 383 test_util.cc:268] Using random seed: -1565480275
I20260929 16:25:49.270031 819 rpc-test-base.h:240] got call: sleep_micros: 500 pattern: 4294967295 num_repetitions: 2097152 sidecar_idx: 0
I20260929 16:25:49.299526 819 rpc-test-base.h:240] got call: sleep_micros: 500 pattern: 4294967295 num_repetitions: 2097152 sidecar_idx: 0
I20260929 16:25:49.328850 819 rpc-test-base.h:240] got call: sleep_micros: 500 pattern: 4294967295 num_repetitions: 2097152 sidecar_idx: 0
I20260929 16:25:49.357280 819 rpc-test-base.h:240] got call: sleep_micros: 500 pattern: 4294967295 num_repetitions: 2097152 sidecar_idx: 0
I20260929 16:25:49.385605 819 rpc-test-base.h:240] got call: sleep_micros: 500 pattern: 4294967295 num_repetitions: 2097152 sidecar_idx: 0
I20260929 16:25:49.414291 819 rpc-test-base.h:240] got call: sleep_micros: 500 pattern: 4294967295 num_repetitions: 2097152 sidecar_idx: 0
I20260929 16:25:49.442464 819 rpc-test-base.h:240] got call: sleep_micros: 500 pattern: 4294967295 num_repetitions: 2097152 sidecar_idx: 0
I20260929 16:25:49.472259 819 rpc-test-base.h:240] got call: sleep_micros: 500 pattern: 4294967295 num_repetitions: 2097152 sidecar_idx: 0
W20260929 16:25:49.475718 812 connection.cc:196] Error closing socket: Network error: TlsSocket::Close: Broken pipe
W20260929 16:25:49.490834 812 connection.cc:441] server connection from unix:<unnamed> torn down before Call kudu.rpc.GenericCalculatorService.SleepWithSidecar from unix:<unnamed> (request call id 9) could send its response
[ OK ] Parameters/TestRpc.TestCancellationAsync/SSL_UnixSocket (318 ms)
[ RUN ] Parameters/TestRpc.TestPerformanceBySocketType/SSL_UnixSocket
I20260929 16:25:49.526538 841 acceptor_pool.cc:254] collecting diagnostics on the listening RPC socket unix:/tmp/dist-test-taskYBRu3H/test-tmp/rpc-test-ec40f42c53ff447e9920dfb99ccab6f5.sock every 8 connection(s)
I20260929 16:25:49.526566 840 acceptor_pool.cc:254] collecting diagnostics on the listening RPC socket unix:/tmp/dist-test-taskYBRu3H/test-tmp/rpc-test-ec40f42c53ff447e9920dfb99ccab6f5.sock every 8 connection(s)
I20260929 16:25:49.526854 383 rpc-test.cc:1846] Connecting to unix:/tmp/dist-test-taskYBRu3H/test-tmp/rpc-test-ec40f42c53ff447e9920dfb99ccab6f5.sock
I20260929 16:25:51.939883 383 rpc-test.cc:1859] Sending 1024MB via ssl-enabled unix socket: real 2.398s user 2.662s sys 1.607s
I20260929 16:25:54.233471 383 rpc-test.cc:1859] Sending 1024MB via ssl-enabled unix socket: real 2.293s user 2.450s sys 1.642s
I20260929 16:25:56.643713 383 rpc-test.cc:1859] Sending 1024MB via ssl-enabled unix socket: real 2.410s user 2.662s sys 1.647s
I20260929 16:25:59.055652 383 rpc-test.cc:1859] Sending 1024MB via ssl-enabled unix socket: real 2.412s user 2.649s sys 1.619s
I20260929 16:26:01.423700 383 rpc-test.cc:1859] Sending 1024MB via ssl-enabled unix socket: real 2.368s user 2.534s sys 1.666s
[ OK ] Parameters/TestRpc.TestPerformanceBySocketType/SSL_UnixSocket (11933 ms)
[----------] 20 tests from Parameters/TestRpc (40806 ms total)
[----------] 1 test from Parameters/TestRpcSocketTxRxQueue
[ RUN ] Parameters/TestRpcSocketTxRxQueue.AcceptorRxQueueSizeMetric/0
I20260929 16:26:01.434963 865 acceptor_pool.cc:254] collecting diagnostics on the listening RPC socket 0.0.0.0:34957 every 1 connection(s)
I20260929 16:26:01.435144 866 acceptor_pool.cc:254] collecting diagnostics on the listening RPC socket 0.0.0.0:34957 every 1 connection(s)
W20260929 16:26:01.436224 861 negotiation.cc:337] Failed RPC negotiation. Trace:
0929 16:26:01.435882 (+ 0us) reactor.cc:625] Submitting negotiation task for server connection from 127.0.0.1:49300 (local address 127.0.0.1:34957)
0929 16:26:01.436032 (+ 150us) server_negotiation.cc:206] Beginning negotiation
0929 16:26:01.436036 (+ 4us) server_negotiation.cc:399] Waiting for connection header
0929 16:26:01.436135 (+ 99us) negotiation.cc:327] Negotiation complete: Network error: Server connection negotiation failed: server connection from 127.0.0.1:49300: BlockingRecv error: recv got EOF from 127.0.0.1:49300 (error 108)
Metrics: {"server-negotiator.queue_time_us":62}
[ OK ] Parameters/TestRpcSocketTxRxQueue.AcceptorRxQueueSizeMetric/0 (12 ms)
[----------] 1 test from Parameters/TestRpcSocketTxRxQueue (12 ms total)
[----------] Global test environment tear-down
[==========] 21 tests from 2 test suites ran. (40818 ms total)
[ PASSED ] 20 tests.
[ FAILED ] 1 test, listed below:
[ FAILED ] Parameters/TestRpc.TestCallWithChainCertAndChainCA/SSL_UnixSocket, where GetParam() = (true, true)
1 FAILED TEST