Diagnosed failure

Parameters/TestRpc.TestCallWithChainCertAndChainCA/SSL_TCP: /data0/somelongdirectorytoavoidrpathissues/src/kudu/src/kudu/rpc/rpc-test.cc:270: Failure
Failed
Bad status: Runtime error: could not verify certificate chain (error with cert: subject=CN = localhost, ST = sadfjas, C = AS, emailAddress = sdflkdsajf, O = lskdfjlsad, OU = sldfkja, issuer=C = AS, ST = ASDfkjdhf, L = lskdjf, O = saldfja, OU = skdjf, CN = localhost, emailAddress = sadjflkadsj): : certificate has expired
Google Test trace:
/data0/somelongdirectorytoavoidrpathissues/src/kudu/src/kudu/rpc/rpc-test.cc:267: Connecting to 0.0.0.0:44217
I20260923 14:34:16.471444 14705 test_util.cc:175] -----------------------------------------------
I20260923 14:34:16.471630 14705 test_util.cc:176] Had fatal failures, leaving test files at /tmp/dist-test-taskb4MeBj/test-tmp/rpc-test.5.Parameters_TestRpc.TestCallWithChainCertAndChainCA_SSL_TCP.1790174054996143-14705-0

Full log

Note: This is test shard 6 of 8.
[==========] Running 21 tests from 2 test suites.
[----------] Global test environment set-up.
[----------] 20 tests from Parameters/TestRpc
[ RUN      ] Parameters/TestRpc.TestMessengerCreateDestroy/SSL_TCP
WARNING: Logging before InitGoogleLogging() is written to STDERR
I20260923 14:34:15.104156 14705 rpc-test.cc:169] started messenger TestCreateDestroy
[       OK ] Parameters/TestRpc.TestMessengerCreateDestroy/SSL_TCP (1221 ms)
[ RUN      ] Parameters/TestRpc.TestNegotiationDeadlock/SSL_TCP
I20260923 14:34:16.313360 14727 acceptor_pool.cc:254] collecting diagnostics on the listening RPC socket 0.0.0.0:34513 every 8 connection(s)
I20260923 14:34:16.316916 14728 acceptor_pool.cc:254] collecting diagnostics on the listening RPC socket 0.0.0.0:34513 every 8 connection(s)
[       OK ] Parameters/TestRpc.TestNegotiationDeadlock/SSL_TCP (106 ms)
[ RUN      ] Parameters/TestRpc.TestCallWithChainCertAndChainCA/SSL_TCP
I20260923 14:34:16.428184 14743 acceptor_pool.cc:254] collecting diagnostics on the listening RPC socket 0.0.0.0:44217 every 8 connection(s)
I20260923 14:34:16.431933 14744 acceptor_pool.cc:254] collecting diagnostics on the listening RPC socket 0.0.0.0:44217 every 8 connection(s)
/data0/somelongdirectorytoavoidrpathissues/src/kudu/src/kudu/rpc/rpc-test.cc:270: Failure
Failed
Bad status: Runtime error: could not verify certificate chain (error with cert: subject=CN = localhost, ST = sadfjas, C = AS, emailAddress = sdflkdsajf, O = lskdfjlsad, OU = sldfkja, issuer=C = AS, ST = ASDfkjdhf, L = lskdjf, O = saldfja, OU = skdjf, CN = localhost, emailAddress = sadjflkadsj): : certificate has expired
Google Test trace:
/data0/somelongdirectorytoavoidrpathissues/src/kudu/src/kudu/rpc/rpc-test.cc:267: Connecting to 0.0.0.0:44217
I20260923 14:34:16.471444 14705 test_util.cc:175] -----------------------------------------------
I20260923 14:34:16.471630 14705 test_util.cc:176] Had fatal failures, leaving test files at /tmp/dist-test-taskb4MeBj/test-tmp/rpc-test.5.Parameters_TestRpc.TestCallWithChainCertAndChainCA_SSL_TCP.1790174054996143-14705-0
[  FAILED  ] Parameters/TestRpc.TestCallWithChainCertAndChainCA/SSL_TCP, where GetParam() = (true, false) (88 ms)
[ RUN      ] Parameters/TestRpc.TestCallWithPasswordProtectedKey/SSL_TCP
I20260923 14:34:16.501446 14768 acceptor_pool.cc:254] collecting diagnostics on the listening RPC socket 0.0.0.0:37147 every 8 connection(s)
I20260923 14:34:16.502205 14769 acceptor_pool.cc:254] collecting diagnostics on the listening RPC socket 0.0.0.0:37147 every 8 connection(s)
[       OK ] Parameters/TestRpc.TestCallWithPasswordProtectedKey/SSL_TCP (87 ms)
[ RUN      ] Parameters/TestRpc.TestCallToBadServer/SSL_TCP
I20260923 14:34:16.581336 14705 rpc-test.cc:394] Status: Network error: Client connection negotiation failed: client connection to 0.0.0.0:0: connect: Connection refused (error 111)
I20260923 14:34:16.582914 14705 rpc-test.cc:394] Status: Network error: Client connection negotiation failed: client connection to 0.0.0.0:0: connect: Connection refused (error 111)
I20260923 14:34:16.584290 14705 rpc-test.cc:394] Status: Network error: Client connection negotiation failed: client connection to 0.0.0.0:0: connect: Connection refused (error 111)
I20260923 14:34:16.585590 14705 rpc-test.cc:394] Status: Network error: Client connection negotiation failed: client connection to 0.0.0.0:0: connect: Connection refused (error 111)
I20260923 14:34:16.586845 14705 rpc-test.cc:394] Status: Network error: Client connection negotiation failed: client connection to 0.0.0.0:0: connect: Connection refused (error 111)
[       OK ] Parameters/TestRpc.TestCallToBadServer/SSL_TCP (30 ms)
[ RUN      ] Parameters/TestRpc.TestWrongService/SSL_TCP
I20260923 14:34:16.633226 14803 acceptor_pool.cc:254] collecting diagnostics on the listening RPC socket 0.0.0.0:38651 every 8 connection(s)
I20260923 14:34:16.634097 14804 acceptor_pool.cc:254] collecting diagnostics on the listening RPC socket 0.0.0.0:38651 every 8 connection(s)
I20260923 14:34:16.665694 14802 messenger.cc:345] service WrongServiceName not registered on TestServer
[       OK ] Parameters/TestRpc.TestWrongService/SSL_TCP (83 ms)
[ RUN      ] Parameters/TestRpc.TestConnectionKeepalive/SSL_TCP
I20260923 14:34:16.694779 14826 acceptor_pool.cc:254] collecting diagnostics on the listening RPC socket 0.0.0.0:35563 every 8 connection(s)
I20260923 14:34:16.695538 14827 acceptor_pool.cc:254] collecting diagnostics on the listening RPC socket 0.0.0.0:35563 every 8 connection(s)
I20260923 14:34:16.698997 14705 rpc-test.cc:488] Connecting to 0.0.0.0:35563
[       OK ] Parameters/TestRpc.TestConnectionKeepalive/SSL_TCP (1073 ms)
[ RUN      ] Parameters/TestRpc.TestClientConnectionMetrics/SSL_TCP
I20260923 14:34:17.777252 14852 acceptor_pool.cc:254] collecting diagnostics on the listening RPC socket 0.0.0.0:45431 every 8 connection(s)
I20260923 14:34:17.778187 14853 acceptor_pool.cc:254] collecting diagnostics on the listening RPC socket 0.0.0.0:45431 every 8 connection(s)
I20260923 14:34:17.781455 14705 rpc-test.cc:569] Connecting to 0.0.0.0:45431
[       OK ] Parameters/TestRpc.TestClientConnectionMetrics/SSL_TCP (124741 ms)
[ RUN      ] Parameters/TestRpc.TestCredentialsPolicy/SSL_TCP
I20260923 14:36:22.518613 14887 acceptor_pool.cc:254] collecting diagnostics on the listening RPC socket 0.0.0.0:38169 every 8 connection(s)
I20260923 14:36:22.519531 14888 acceptor_pool.cc:254] collecting diagnostics on the listening RPC socket 0.0.0.0:38169 every 8 connection(s)
I20260923 14:36:22.523124 14705 rpc-test.cc:700] Connecting to 0.0.0.0:38169
[       OK ] Parameters/TestRpc.TestCredentialsPolicy/SSL_TCP (94 ms)
[ RUN      ] Parameters/TestRpc.TestCallLongerThanKeepalive/SSL_TCP
I20260923 14:36:22.625996 14912 acceptor_pool.cc:254] collecting diagnostics on the listening RPC socket 0.0.0.0:43765 every 8 connection(s)
I20260923 14:36:22.626840 14913 acceptor_pool.cc:254] collecting diagnostics on the listening RPC socket 0.0.0.0:43765 every 8 connection(s)
I20260923 14:36:22.665107 14916 rpc-test-base.h:222] got call: sleep_micros: 3000000 deferred: true
I20260923 14:36:25.669787 14916 rpcz_store.cc:275] Call kudu.rpc.GenericCalculatorService.Sleep from 127.0.0.1:33796 (request call id 0) took 3004 ms. Trace:
I20260923 14:36:25.670300 14916 rpcz_store.cc:276] 0923 14:36:22.664834 (+     0us) service_pool.cc:170] Inserting onto call queue
0923 14:36:22.664956 (+   122us) service_pool.cc:227] Handling call
0923 14:36:25.669575 (+3004619us) inbound_call.cc:173] Queueing success response
Metrics: {}
[       OK ] Parameters/TestRpc.TestCallLongerThanKeepalive/SSL_TCP (3100 ms)
[ RUN      ] Parameters/TestRpc.TestRpcSidecar/SSL_TCP
I20260923 14:36:25.723212 14938 acceptor_pool.cc:254] collecting diagnostics on the listening RPC socket 0.0.0.0:33215 every 8 connection(s)
I20260923 14:36:25.724010 14939 acceptor_pool.cc:254] collecting diagnostics on the listening RPC socket 0.0.0.0:33215 every 8 connection(s)
[       OK ] Parameters/TestRpc.TestRpcSidecar/SSL_TCP (650 ms)
[ RUN      ] Parameters/TestRpc.TestRpcSidecarLimits/SSL_TCP
I20260923 14:36:46.583665 14965 acceptor_pool.cc:254] collecting diagnostics on the listening RPC socket 0.0.0.0:40121 every 8 connection(s)
I20260923 14:36:46.584563 14966 acceptor_pool.cc:254] collecting diagnostics on the listening RPC socket 0.0.0.0:40121 every 8 connection(s)
W20260923 14:36:46.611769 14705 serialization.cc:72] Serialized kudu.rpc_test.PushStringsRequestPB (2147483654 bytes) is larger than the maximum configured RPC message size (52428800 bytes). Sending anyway, but peer may reject the data.
W20260923 14:36:46.624001 14962 connection.cc:535] server connection from 127.0.0.1:46156 recv error: Network error: RPC frame had a length of 2147483714, but we only support messages up to 52428800 bytes long.
W20260923 14:36:46.624455 14962 connection.cc:158] shutting down server connection from 127.0.0.1:46156 with pending inbound data: 4/2147483714 bytes received; last active 0 ns ago: status Network error: RPC frame had a length of 2147483714, but we only support messages up to 52428800 bytes long.
W20260923 14:36:46.625530 14978 connection.cc:698] client connection to 0.0.0.0:40121 send error: Network error: failed to write to TLS socket: Connection reset by peer
W20260923 14:36:46.626358 14978 connection.cc:196] Error closing socket: Network error: TlsSocket::Close: Success
[       OK ] Parameters/TestRpc.TestRpcSidecarLimits/SSL_TCP (20964 ms)
[ RUN      ] Parameters/TestRpc.TestCallTimeoutDoesntAffectNegotiation/SSL_TCP
I20260923 14:36:47.319864 14990 acceptor_pool.cc:254] collecting diagnostics on the listening RPC socket 0.0.0.0:42975 every 8 connection(s)
I20260923 14:36:47.320595 14991 acceptor_pool.cc:254] collecting diagnostics on the listening RPC socket 0.0.0.0:42975 every 8 connection(s)
W20260923 14:36:47.341046 14986 negotiation.cc:266] Injecting 500ms delay in negotiation
I20260923 14:36:47.391566 14705 rpc-test-base.h:595] status: Timed out: connection negotiation to 0.0.0.0:42975 for RPC Sleep timed out after 0.050s (ON_OUTBOUND_QUEUE), seconds elapsed: 0.0516016
[       OK ] Parameters/TestRpc.TestCallTimeoutDoesntAffectNegotiation/SSL_TCP (562 ms)
[ RUN      ] Parameters/TestRpc.TestRpcHandlerLatencyMetric/SSL_TCP
I20260923 14:36:47.899147 15016 acceptor_pool.cc:254] collecting diagnostics on the listening RPC socket 0.0.0.0:36733 every 8 connection(s)
I20260923 14:36:47.899905 15017 acceptor_pool.cc:254] collecting diagnostics on the listening RPC socket 0.0.0.0:36733 every 8 connection(s)
I20260923 14:36:47.968152 14705 rpc-test.cc:1236] Sleep() min lat: 21778
I20260923 14:36:47.968397 14705 rpc-test.cc:1237] Sleep() mean lat: 21778
I20260923 14:36:47.968542 14705 rpc-test.cc:1238] Sleep() max lat: 21778
I20260923 14:36:47.968665 14705 rpc-test.cc:1239] Sleep() #calls: 1
[       OK ] Parameters/TestRpc.TestRpcHandlerLatencyMetric/SSL_TCP (115 ms)
[ RUN      ] Parameters/TestRpc.TimedOutOnResponseMetricServiceQueue/SSL_TCP
I20260923 14:36:48.016606 15042 acceptor_pool.cc:254] collecting diagnostics on the listening RPC socket 0.0.0.0:39737 every 8 connection(s)
I20260923 14:36:48.017562 15043 acceptor_pool.cc:254] collecting diagnostics on the listening RPC socket 0.0.0.0:39737 every 8 connection(s)
W20260923 14:36:48.100214 15044 rpcz_store.cc:267] Call kudu.rpc_test.CalculatorService.Sleep from 127.0.0.1:45660 (request call id 2) took 20 ms (client timeout 20 ms). Trace:
W20260923 14:36:48.100616 15044 rpcz_store.cc:269] 0923 14:36:48.079677 (+     0us) service_pool.cc:170] Inserting onto call queue
0923 14:36:48.100089 (+ 20412us) service_pool.cc:214] Skipping call since client already timed out
0923 14:36:48.100166 (+    77us) inbound_call.cc:173] Queueing failure response
Metrics: {}
[       OK ] Parameters/TestRpc.TimedOutOnResponseMetricServiceQueue/SSL_TCP (129 ms)
[ RUN      ] Parameters/TestRpc.RpcPendingConnectionsMetric/SSL_TCP
I20260923 14:36:48.119431 15065 acceptor_pool.cc:254] collecting diagnostics on the listening RPC socket 0.0.0.0:46231 every 8 connection(s)
I20260923 14:36:48.120245 15066 acceptor_pool.cc:254] collecting diagnostics on the listening RPC socket 0.0.0.0:46231 every 8 connection(s)
W20260923 14:36:48.126174 15061 negotiation.cc:337] Failed RPC negotiation. Trace:
0923 14:36:48.124681 (+     0us) reactor.cc:625] Submitting negotiation task for server connection from 127.0.0.1:51272 (local address 127.0.0.1:46231)
0923 14:36:48.125085 (+   404us) server_negotiation.cc:206] Beginning negotiation
0923 14:36:48.125102 (+    17us) server_negotiation.cc:399] Waiting for connection header
0923 14:36:48.125339 (+   237us) negotiation.cc:327] Negotiation complete: Network error: Server connection negotiation failed: server connection from 127.0.0.1:51272: BlockingRecv error: recv got EOF from 127.0.0.1:51272 (error 108)
Metrics: {"server-negotiator.queue_time_us":107}
[       OK ] Parameters/TestRpc.RpcPendingConnectionsMetric/SSL_TCP (31 ms)
[ RUN      ] Parameters/TestRpc.TestRpcContextClientDeadline/SSL_TCP
I20260923 14:36:48.161448 15081 acceptor_pool.cc:254] collecting diagnostics on the listening RPC socket 0.0.0.0:38025 every 8 connection(s)
I20260923 14:36:48.162232 15082 acceptor_pool.cc:254] collecting diagnostics on the listening RPC socket 0.0.0.0:38025 every 8 connection(s)
[       OK ] Parameters/TestRpc.TestRpcContextClientDeadline/SSL_TCP (105 ms)
[ RUN      ] Parameters/TestRpc.TestApplicationFeatureFlagUnsupportedServer/SSL_TCP
I20260923 14:36:48.264555 15107 acceptor_pool.cc:254] collecting diagnostics on the listening RPC socket 0.0.0.0:44965 every 8 connection(s)
I20260923 14:36:48.265383 15108 acceptor_pool.cc:254] collecting diagnostics on the listening RPC socket 0.0.0.0:44965 every 8 connection(s)
[       OK ] Parameters/TestRpc.TestApplicationFeatureFlagUnsupportedServer/SSL_TCP (72 ms)
[ RUN      ] Parameters/TestRpc.TestCancellationAsync/SSL_TCP
I20260923 14:36:48.344985 15132 acceptor_pool.cc:254] collecting diagnostics on the listening RPC socket 0.0.0.0:35117 every 8 connection(s)
I20260923 14:36:48.345837 15133 acceptor_pool.cc:254] collecting diagnostics on the listening RPC socket 0.0.0.0:35117 every 8 connection(s)
I20260923 14:36:48.349426 14705 rpc-test.cc:1716] Connecting to 0.0.0.0:35117
I20260923 14:36:48.373474 14705 test_util.cc:268] Using random seed: 1774629581
I20260923 14:36:48.640923 15136 rpc-test-base.h:240] got call: sleep_micros: 500 pattern: 4294967295 num_repetitions: 2097152 sidecar_idx: 0
I20260923 14:36:48.856384 15136 rpc-test-base.h:240] got call: sleep_micros: 500 pattern: 4294967295 num_repetitions: 2097152 sidecar_idx: 0
I20260923 14:36:49.068382 15136 rpc-test-base.h:240] got call: sleep_micros: 500 pattern: 4294967295 num_repetitions: 2097152 sidecar_idx: 0
I20260923 14:36:49.266994 15136 rpc-test-base.h:240] got call: sleep_micros: 500 pattern: 4294967295 num_repetitions: 2097152 sidecar_idx: 0
I20260923 14:36:49.456346 15135 rpc-test-base.h:240] got call: sleep_micros: 500 pattern: 4294967295 num_repetitions: 2097152 sidecar_idx: 0
I20260923 14:36:49.656713 15135 rpc-test-base.h:240] got call: sleep_micros: 500 pattern: 4294967295 num_repetitions: 2097152 sidecar_idx: 0
I20260923 14:36:49.851277 15135 rpc-test-base.h:240] got call: sleep_micros: 500 pattern: 4294967295 num_repetitions: 2097152 sidecar_idx: 0
I20260923 14:36:50.062281 15135 rpc-test-base.h:240] got call: sleep_micros: 500 pattern: 4294967295 num_repetitions: 2097152 sidecar_idx: 0
W20260923 14:36:50.237591 15130 connection.cc:158] shutting down server connection from 127.0.0.1:41200 with pending inbound data: 7422037/8388693 bytes received; last active 0 ns ago: status Service unavailable: reactor is shutting down (error 108)
W20260923 14:36:50.238178 15130 connection.cc:196] Error closing socket: Network error: TlsSocket::Close: Broken pipe
[       OK ] Parameters/TestRpc.TestCancellationAsync/SSL_TCP (1928 ms)
[ RUN      ] Parameters/TestRpc.TestPerformanceBySocketType/SSL_TCP
I20260923 14:36:50.374941 15157 acceptor_pool.cc:254] collecting diagnostics on the listening RPC socket 0.0.0.0:46075 every 8 connection(s)
I20260923 14:36:50.375914 15158 acceptor_pool.cc:254] collecting diagnostics on the listening RPC socket 0.0.0.0:46075 every 8 connection(s)
I20260923 14:36:50.379343 14705 rpc-test.cc:1846] Connecting to 0.0.0.0:46075
I20260923 14:37:11.264081 14705 rpc-test.cc:1859] Sending 1024MB via ssl-enabled tcp socket: real 20.857s	user 17.404s	sys 12.314s
I20260923 14:37:31.456334 14705 rpc-test.cc:1859] Sending 1024MB via ssl-enabled tcp socket: real 20.192s	user 17.080s	sys 11.593s
I20260923 14:37:51.662921 14705 rpc-test.cc:1859] Sending 1024MB via ssl-enabled tcp socket: real 20.206s	user 16.970s	sys 11.681s
I20260923 14:38:12.104097 14705 rpc-test.cc:1859] Sending 1024MB via ssl-enabled tcp socket: real 20.441s	user 17.325s	sys 11.733s
I20260923 14:38:33.057963 14705 rpc-test.cc:1859] Sending 1024MB via ssl-enabled tcp socket: real 20.953s	user 17.803s	sys 12.025s
[       OK ] Parameters/TestRpc.TestPerformanceBySocketType/SSL_TCP (102833 ms)
[----------] 20 tests from Parameters/TestRpc (258025 ms total)

[----------] 1 test from Parameters/TestRpcSocketTxRxQueue
[ RUN      ] Parameters/TestRpcSocketTxRxQueue.OverCapacity/0
W20260923 14:38:33.566368 15184 negotiation.cc:337] Failed RPC negotiation. Trace:
0923 14:38:33.095142 (+     0us) reactor.cc:625] Submitting negotiation task for client connection to 0.0.0.0:38035 (local address 127.0.0.1:33568)
0923 14:38:33.095915 (+   773us) negotiation.cc:107] Waiting for socket to connect
0923 14:38:33.095974 (+    59us) client_negotiation.cc:174] Beginning negotiation
0923 14:38:33.096519 (+   545us) client_negotiation.cc:252] Sending NEGOTIATE NegotiatePB request
0923 14:38:33.564519 (+468000us) negotiation.cc:327] Negotiation complete: Network error: Client connection negotiation failed: client connection to 0.0.0.0:38035: BlockingRecv error: recv error from unknown peer: Transport endpoint is not connected (error 107)
Metrics: {"client-negotiator.queue_time_us":126}
W20260923 14:38:33.566443 15202 negotiation.cc:337] Failed RPC negotiation. Trace:
0923 14:38:33.110295 (+     0us) reactor.cc:625] Submitting negotiation task for client connection to 0.0.0.0:38035 (local address 127.0.0.1:33576)
0923 14:38:33.110845 (+   550us) negotiation.cc:107] Waiting for socket to connect
0923 14:38:33.110875 (+    30us) client_negotiation.cc:174] Beginning negotiation
0923 14:38:33.111275 (+   400us) client_negotiation.cc:252] Sending NEGOTIATE NegotiatePB request
0923 14:38:33.564379 (+453104us) negotiation.cc:327] Negotiation complete: Network error: Client connection negotiation failed: client connection to 0.0.0.0:38035: BlockingRecv error: recv error from unknown peer: Transport endpoint is not connected (error 107)
Metrics: {"client-negotiator.queue_time_us":135}
W20260923 14:38:33.566435 15193 negotiation.cc:337] Failed RPC negotiation. Trace:
0923 14:38:33.102582 (+     0us) reactor.cc:625] Submitting negotiation task for client connection to 0.0.0.0:38035 (local address 127.0.0.1:33572)
0923 14:38:33.103135 (+   553us) negotiation.cc:107] Waiting for socket to connect
0923 14:38:33.103165 (+    30us) client_negotiation.cc:174] Beginning negotiation
0923 14:38:33.103357 (+   192us) client_negotiation.cc:252] Sending NEGOTIATE NegotiatePB request
0923 14:38:33.564342 (+460985us) negotiation.cc:327] Negotiation complete: Network error: Client connection negotiation failed: client connection to 0.0.0.0:38035: BlockingRecv error: recv error from unknown peer: Transport endpoint is not connected (error 107)
Metrics: {"client-negotiator.queue_time_us":143}
W20260923 14:38:33.567839 15211 negotiation.cc:337] Failed RPC negotiation. Trace:
0923 14:38:33.124338 (+     0us) reactor.cc:625] Submitting negotiation task for client connection to 0.0.0.0:38035 (local address 127.0.0.1:33584)
0923 14:38:33.124991 (+   653us) negotiation.cc:107] Waiting for socket to connect
0923 14:38:33.125028 (+    37us) client_negotiation.cc:174] Beginning negotiation
0923 14:38:33.125253 (+   225us) client_negotiation.cc:252] Sending NEGOTIATE NegotiatePB request
0923 14:38:33.564342 (+439089us) negotiation.cc:327] Negotiation complete: Network error: Client connection negotiation failed: client connection to 0.0.0.0:38035: BlockingRecv error: recv error from unknown peer: Transport endpoint is not connected (error 107)
Metrics: {"client-negotiator.queue_time_us":176}
W20260923 14:38:33.570236 15221 negotiation.cc:337] Failed RPC negotiation. Trace:
0923 14:38:33.138524 (+     0us) reactor.cc:625] Submitting negotiation task for client connection to 0.0.0.0:38035 (local address 127.0.0.1:33600)
0923 14:38:33.139107 (+   583us) negotiation.cc:107] Waiting for socket to connect
0923 14:38:33.139138 (+    31us) client_negotiation.cc:174] Beginning negotiation
0923 14:38:33.139330 (+   192us) client_negotiation.cc:252] Sending NEGOTIATE NegotiatePB request
0923 14:38:33.566902 (+427572us) negotiation.cc:327] Negotiation complete: Network error: Client connection negotiation failed: client connection to 0.0.0.0:38035: BlockingRecv error: recv error from unknown peer: Transport endpoint is not connected (error 107)
Metrics: {"client-negotiator.queue_time_us":144}
W20260923 14:38:33.570407 15230 negotiation.cc:337] Failed RPC negotiation. Trace:
0923 14:38:33.150718 (+     0us) reactor.cc:625] Submitting negotiation task for client connection to 0.0.0.0:38035 (local address 127.0.0.1:33606)
0923 14:38:33.151314 (+   596us) negotiation.cc:107] Waiting for socket to connect
0923 14:38:33.151344 (+    30us) client_negotiation.cc:174] Beginning negotiation
0923 14:38:33.151532 (+   188us) client_negotiation.cc:252] Sending NEGOTIATE NegotiatePB request
0923 14:38:33.567605 (+416073us) negotiation.cc:327] Negotiation complete: Network error: Client connection negotiation failed: client connection to 0.0.0.0:38035: BlockingRecv error: recv error from unknown peer: Transport endpoint is not connected (error 107)
Metrics: {"client-negotiator.queue_time_us":166}
[       OK ] Parameters/TestRpcSocketTxRxQueue.OverCapacity/0 (1296 ms)
[----------] 1 test from Parameters/TestRpcSocketTxRxQueue (1296 ms total)

[----------] Global test environment tear-down
[==========] 21 tests from 2 test suites ran. (259323 ms total)
[  PASSED  ] 20 tests.
[  FAILED  ] 1 test, listed below:
[  FAILED  ] Parameters/TestRpc.TestCallWithChainCertAndChainCA/SSL_TCP, where GetParam() = (true, false)

 1 FAILED TEST