Parameters/TestRpc.TestCallWithChainCertAndRootCA/SSL_UnixSocket: /data0/somelongdirectorytoavoidrpathissues/src/kudu/src/kudu/rpc/rpc-test.cc:303: Failure
Failed
Bad status: Runtime error: could not verify certificate chain (error with cert: subject=CN = localhost, ST = sadfjas, C = AS, emailAddress = sdflkdsajf, O = lskdfjlsad, OU = sldfkja, issuer=C = AS, ST = ASDfkjdhf, L = lskdjf, O = saldfja, OU = skdjf, CN = localhost, emailAddress = sadjflkadsj): : certificate has expired
Google Test trace:
/data0/somelongdirectorytoavoidrpathissues/src/kudu/src/kudu/rpc/rpc-test.cc:300: Connecting to unix:/tmp/dist-test-taskZngtq3/test-tmp/rpc-test-33d225e6120c4748a1f53d331c704df2.sock
I20260926 16:14:33.448248 11767 test_util.cc:175] -----------------------------------------------
I20260926 16:14:33.448436 11767 test_util.cc:176] Had fatal failures, leaving test files at /tmp/dist-test-taskZngtq3/test-tmp/rpc-test.2.Parameters_TestRpc.TestCallWithChainCertAndRootCA_SSL_UnixSocket.1790439269998364-11767-0
Note: This is test shard 3 of 8.
[==========] Running 21 tests from 2 test suites.
[----------] Global test environment set-up.
[----------] 1 test from TestRpc
[ RUN ] TestRpc.TestNegotiationTimeout
WARNING: Logging before InitGoogleLogging() is written to STDERR
I20260926 16:14:30.188670 11767 rpc-test-base.h:595] status: Timed out: connection negotiation to 0.0.0.0:39425 for RPC Sleep timed out after 0.100s (ON_OUTBOUND_QUEUE), seconds elapsed: 0.101153
W20260926 16:14:33.146245 11777 negotiation.cc:337] Failed RPC negotiation. Trace:
0926 16:14:30.088620 (+ 0us) reactor.cc:625] Submitting negotiation task for client connection to 0.0.0.0:39425 (local address 127.0.0.1:54682)
0926 16:14:30.089346 (+ 726us) negotiation.cc:107] Waiting for socket to connect
0926 16:14:30.089396 (+ 50us) client_negotiation.cc:174] Beginning negotiation
0926 16:14:30.101930 (+ 12534us) client_negotiation.cc:252] Sending NEGOTIATE NegotiatePB request
0926 16:14:33.145043 (+3043113us) negotiation.cc:327] Negotiation complete: Timed out: Client connection negotiation failed: client connection to 0.0.0.0:39425: received 0 of 4 requested bytes
Metrics: {"client-negotiator.queue_time_us":267}
[ OK ] TestRpc.TestNegotiationTimeout (3097 ms)
[----------] 1 test from TestRpc (3098 ms total)
[----------] 20 tests from Parameters/TestRpc
[ RUN ] Parameters/TestRpc.TestAcceptorPoolStartStop/SSL_UnixSocket
I20260926 16:14:33.187840 11793 acceptor_pool.cc:254] collecting diagnostics on the listening RPC socket unix:/tmp/dist-test-taskZngtq3/test-tmp/rpc-test-bd38cc3c372b4d7fb3777d515b51ec3f.sock every 8 connection(s)
I20260926 16:14:33.189589 11794 acceptor_pool.cc:254] collecting diagnostics on the listening RPC socket unix:/tmp/dist-test-taskZngtq3/test-tmp/rpc-test-bd38cc3c372b4d7fb3777d515b51ec3f.sock every 8 connection(s)
I20260926 16:14:33.223793 11804 acceptor_pool.cc:254] collecting diagnostics on the listening RPC socket unix:/tmp/dist-test-taskZngtq3/test-tmp/rpc-test-bd38cc3c372b4d7fb3777d515b51ec3f.sock every 8 connection(s)
I20260926 16:14:33.225301 11805 acceptor_pool.cc:254] collecting diagnostics on the listening RPC socket unix:/tmp/dist-test-taskZngtq3/test-tmp/rpc-test-bd38cc3c372b4d7fb3777d515b51ec3f.sock every 8 connection(s)
I20260926 16:14:33.259801 11815 acceptor_pool.cc:254] collecting diagnostics on the listening RPC socket unix:/tmp/dist-test-taskZngtq3/test-tmp/rpc-test-bd38cc3c372b4d7fb3777d515b51ec3f.sock every 8 connection(s)
I20260926 16:14:33.260668 11816 acceptor_pool.cc:254] collecting diagnostics on the listening RPC socket unix:/tmp/dist-test-taskZngtq3/test-tmp/rpc-test-bd38cc3c372b4d7fb3777d515b51ec3f.sock every 8 connection(s)
I20260926 16:14:33.282666 11826 acceptor_pool.cc:254] collecting diagnostics on the listening RPC socket unix:/tmp/dist-test-taskZngtq3/test-tmp/rpc-test-bd38cc3c372b4d7fb3777d515b51ec3f.sock every 8 connection(s)
I20260926 16:14:33.283450 11827 acceptor_pool.cc:254] collecting diagnostics on the listening RPC socket unix:/tmp/dist-test-taskZngtq3/test-tmp/rpc-test-bd38cc3c372b4d7fb3777d515b51ec3f.sock every 8 connection(s)
I20260926 16:14:33.307464 11837 acceptor_pool.cc:254] collecting diagnostics on the listening RPC socket unix:/tmp/dist-test-taskZngtq3/test-tmp/rpc-test-bd38cc3c372b4d7fb3777d515b51ec3f.sock every 8 connection(s)
I20260926 16:14:33.308400 11838 acceptor_pool.cc:254] collecting diagnostics on the listening RPC socket unix:/tmp/dist-test-taskZngtq3/test-tmp/rpc-test-bd38cc3c372b4d7fb3777d515b51ec3f.sock every 8 connection(s)
[ OK ] Parameters/TestRpc.TestAcceptorPoolStartStop/SSL_UnixSocket (162 ms)
[ RUN ] Parameters/TestRpc.TestCall/SSL_UnixSocket
I20260926 16:14:33.342178 11850 acceptor_pool.cc:254] collecting diagnostics on the listening RPC socket unix:/tmp/dist-test-taskZngtq3/test-tmp/rpc-test-1510917df2454ed3b6f9e23a4bc10caf.sock every 8 connection(s)
I20260926 16:14:33.344465 11851 acceptor_pool.cc:254] collecting diagnostics on the listening RPC socket unix:/tmp/dist-test-taskZngtq3/test-tmp/rpc-test-1510917df2454ed3b6f9e23a4bc10caf.sock every 8 connection(s)
I20260926 16:14:33.349677 11767 rpc-test.cc:234] Connecting to unix:/tmp/dist-test-taskZngtq3/test-tmp/rpc-test-1510917df2454ed3b6f9e23a4bc10caf.sock
[ OK ] Parameters/TestRpc.TestCall/SSL_UnixSocket (94 ms)
[ RUN ] Parameters/TestRpc.TestCallWithChainCertAndRootCA/SSL_UnixSocket
I20260926 16:14:33.426702 11875 acceptor_pool.cc:254] collecting diagnostics on the listening RPC socket unix:/tmp/dist-test-taskZngtq3/test-tmp/rpc-test-33d225e6120c4748a1f53d331c704df2.sock every 8 connection(s)
I20260926 16:14:33.427444 11876 acceptor_pool.cc:254] collecting diagnostics on the listening RPC socket unix:/tmp/dist-test-taskZngtq3/test-tmp/rpc-test-33d225e6120c4748a1f53d331c704df2.sock every 8 connection(s)
/data0/somelongdirectorytoavoidrpathissues/src/kudu/src/kudu/rpc/rpc-test.cc:303: Failure
Failed
Bad status: Runtime error: could not verify certificate chain (error with cert: subject=CN = localhost, ST = sadfjas, C = AS, emailAddress = sdflkdsajf, O = lskdfjlsad, OU = sldfkja, issuer=C = AS, ST = ASDfkjdhf, L = lskdjf, O = saldfja, OU = skdjf, CN = localhost, emailAddress = sadjflkadsj): : certificate has expired
Google Test trace:
/data0/somelongdirectorytoavoidrpathissues/src/kudu/src/kudu/rpc/rpc-test.cc:300: Connecting to unix:/tmp/dist-test-taskZngtq3/test-tmp/rpc-test-33d225e6120c4748a1f53d331c704df2.sock
I20260926 16:14:33.448248 11767 test_util.cc:175] -----------------------------------------------
I20260926 16:14:33.448436 11767 test_util.cc:176] Had fatal failures, leaving test files at /tmp/dist-test-taskZngtq3/test-tmp/rpc-test.2.Parameters_TestRpc.TestCallWithChainCertAndRootCA_SSL_UnixSocket.1790439269998364-11767-0
[ FAILED ] Parameters/TestRpc.TestCallWithChainCertAndRootCA/SSL_UnixSocket, where GetParam() = (true, true) (41 ms)
[ RUN ] Parameters/TestRpc.TestCallWithBadPasswordProtectedKey/SSL_UnixSocket
[ OK ] Parameters/TestRpc.TestCallWithBadPasswordProtectedKey/SSL_UnixSocket (32 ms)
[ RUN ] Parameters/TestRpc.TestInvalidMethodCall/SSL_UnixSocket
I20260926 16:14:33.501565 11912 acceptor_pool.cc:254] collecting diagnostics on the listening RPC socket unix:/tmp/dist-test-taskZngtq3/test-tmp/rpc-test-e3c24289237f49b19ef05277d21513c7.sock every 8 connection(s)
I20260926 16:14:33.502454 11913 acceptor_pool.cc:254] collecting diagnostics on the listening RPC socket unix:/tmp/dist-test-taskZngtq3/test-tmp/rpc-test-e3c24289237f49b19ef05277d21513c7.sock every 8 connection(s)
I20260926 16:14:33.506078 11767 rpc-test.cc:406] Connecting to unix:/tmp/dist-test-taskZngtq3/test-tmp/rpc-test-e3c24289237f49b19ef05277d21513c7.sock
W20260926 16:14:33.543103 11909 connection.cc:196] Error closing socket: Network error: TlsSocket::Close: Broken pipe
[ OK ] Parameters/TestRpc.TestInvalidMethodCall/SSL_UnixSocket (66 ms)
[ RUN ] Parameters/TestRpc.TestHighFDs/SSL_UnixSocket
I20260926 16:14:33.771135 11937 acceptor_pool.cc:254] collecting diagnostics on the listening RPC socket unix:/tmp/dist-test-taskZngtq3/test-tmp/rpc-test-4efbdc86f3eb4c3c9ed2160e44fb99a2.sock every 8 connection(s)
I20260926 16:14:33.771896 11938 acceptor_pool.cc:254] collecting diagnostics on the listening RPC socket unix:/tmp/dist-test-taskZngtq3/test-tmp/rpc-test-4efbdc86f3eb4c3c9ed2160e44fb99a2.sock every 8 connection(s)
W20260926 16:14:33.814426 11934 connection.cc:196] Error closing socket: Network error: TlsSocket::Close: Broken pipe
[ OK ] Parameters/TestRpc.TestHighFDs/SSL_UnixSocket (280 ms)
[ RUN ] Parameters/TestRpc.TestConnectionAlwaysKeepalive/SSL_UnixSocket
I20260926 16:14:33.845534 11960 acceptor_pool.cc:254] collecting diagnostics on the listening RPC socket unix:/tmp/dist-test-taskZngtq3/test-tmp/rpc-test-162016f385fb4cf2a2c2a8f077d8ea38.sock every 8 connection(s)
I20260926 16:14:33.846328 11961 acceptor_pool.cc:254] collecting diagnostics on the listening RPC socket unix:/tmp/dist-test-taskZngtq3/test-tmp/rpc-test-162016f385fb4cf2a2c2a8f077d8ea38.sock every 8 connection(s)
I20260926 16:14:33.850035 11767 rpc-test.cc:532] Connecting to unix:/tmp/dist-test-taskZngtq3/test-tmp/rpc-test-162016f385fb4cf2a2c2a8f077d8ea38.sock
[ OK ] Parameters/TestRpc.TestConnectionAlwaysKeepalive/SSL_UnixSocket (3069 ms)
[ RUN ] Parameters/TestRpc.TestReopenOutboundConnections/SSL_UnixSocket
I20260926 16:14:36.921512 11983 acceptor_pool.cc:254] collecting diagnostics on the listening RPC socket unix:/tmp/dist-test-taskZngtq3/test-tmp/rpc-test-5c668a511a894d84ae8e31ce4c301e45.sock every 8 connection(s)
I20260926 16:14:36.922273 11984 acceptor_pool.cc:254] collecting diagnostics on the listening RPC socket unix:/tmp/dist-test-taskZngtq3/test-tmp/rpc-test-5c668a511a894d84ae8e31ce4c301e45.sock every 8 connection(s)
I20260926 16:14:36.925590 11767 rpc-test.cc:658] Connecting to unix:/tmp/dist-test-taskZngtq3/test-tmp/rpc-test-5c668a511a894d84ae8e31ce4c301e45.sock
W20260926 16:14:36.971374 11982 connection.cc:196] Error closing socket: Network error: TlsSocket::Close: Broken pipe
W20260926 16:14:36.982635 11982 connection.cc:196] Error closing socket: Network error: TlsSocket::Close: Broken pipe
W20260926 16:14:36.993726 11982 connection.cc:196] Error closing socket: Network error: TlsSocket::Close: Broken pipe
W20260926 16:14:37.004590 11982 connection.cc:196] Error closing socket: Network error: TlsSocket::Close: Broken pipe
W20260926 16:14:37.015885 11982 connection.cc:196] Error closing socket: Network error: TlsSocket::Close: Broken pipe
W20260926 16:14:37.025949 11982 connection.cc:196] Error closing socket: Network error: TlsSocket::Close: Broken pipe
W20260926 16:14:37.036815 11982 connection.cc:196] Error closing socket: Network error: TlsSocket::Close: Broken pipe
W20260926 16:14:37.047917 11982 connection.cc:196] Error closing socket: Network error: TlsSocket::Close: Broken pipe
W20260926 16:14:37.059085 11982 connection.cc:196] Error closing socket: Network error: TlsSocket::Close: Broken pipe
W20260926 16:14:37.071369 11982 connection.cc:196] Error closing socket: Network error: TlsSocket::Close: Broken pipe
W20260926 16:14:37.084761 11982 connection.cc:196] Error closing socket: Network error: TlsSocket::Close: Broken pipe
W20260926 16:14:37.096248 11982 connection.cc:196] Error closing socket: Network error: TlsSocket::Close: Broken pipe
W20260926 16:14:37.107710 11982 connection.cc:196] Error closing socket: Network error: TlsSocket::Close: Broken pipe
W20260926 16:14:37.118769 11982 connection.cc:196] Error closing socket: Network error: TlsSocket::Close: Broken pipe
W20260926 16:14:37.118919 11983 acceptor_pool.cc:285] unable to collect diagnostics on RPC socket unix:/tmp/dist-test-taskZngtq3/test-tmp/rpc-test-5c668a511a894d84ae8e31ce4c301e45.sock: Not implemented: netlink diagnostics is currently supported only on IPv4 TCP sockets
W20260926 16:14:37.130167 11982 connection.cc:196] Error closing socket: Network error: TlsSocket::Close: Broken pipe
W20260926 16:14:37.142006 11982 connection.cc:196] Error closing socket: Network error: TlsSocket::Close: Broken pipe
W20260926 16:14:37.154546 11982 connection.cc:196] Error closing socket: Network error: TlsSocket::Close: Broken pipe
W20260926 16:14:37.165261 11982 connection.cc:196] Error closing socket: Network error: TlsSocket::Close: Broken pipe
W20260926 16:14:37.175263 11982 connection.cc:196] Error closing socket: Network error: TlsSocket::Close: Broken pipe
W20260926 16:14:37.186101 11982 connection.cc:196] Error closing socket: Network error: TlsSocket::Close: Broken pipe
W20260926 16:14:37.197417 11982 connection.cc:196] Error closing socket: Network error: TlsSocket::Close: Broken pipe
W20260926 16:14:37.207945 11982 connection.cc:196] Error closing socket: Network error: TlsSocket::Close: Broken pipe
W20260926 16:14:37.218277 11982 connection.cc:196] Error closing socket: Network error: TlsSocket::Close: Broken pipe
W20260926 16:14:37.229256 11982 connection.cc:196] Error closing socket: Network error: TlsSocket::Close: Broken pipe
W20260926 16:14:37.241011 11982 connection.cc:196] Error closing socket: Network error: TlsSocket::Close: Broken pipe
W20260926 16:14:37.252275 11982 connection.cc:196] Error closing socket: Network error: TlsSocket::Close: Broken pipe
W20260926 16:14:37.263916 11982 connection.cc:196] Error closing socket: Network error: TlsSocket::Close: Broken pipe
W20260926 16:14:37.285743 11982 connection.cc:196] Error closing socket: Network error: TlsSocket::Close: Broken pipe
W20260926 16:14:37.296425 11982 connection.cc:196] Error closing socket: Network error: TlsSocket::Close: Broken pipe
W20260926 16:14:37.307386 11982 connection.cc:196] Error closing socket: Network error: TlsSocket::Close: Broken pipe
W20260926 16:14:37.319588 11982 connection.cc:196] Error closing socket: Network error: TlsSocket::Close: Broken pipe
[ OK ] Parameters/TestRpc.TestReopenOutboundConnections/SSL_UnixSocket (425 ms)
[ RUN ] Parameters/TestRpc.TestConnectionNetworkPlane/SSL_UnixSocket
I20260926 16:14:37.354789 12006 acceptor_pool.cc:254] collecting diagnostics on the listening RPC socket unix:/tmp/dist-test-taskZngtq3/test-tmp/rpc-test-a449b1198d2848658ede882a930b6648.sock every 8 connection(s)
I20260926 16:14:37.355537 12007 acceptor_pool.cc:254] collecting diagnostics on the listening RPC socket unix:/tmp/dist-test-taskZngtq3/test-tmp/rpc-test-a449b1198d2848658ede882a930b6648.sock every 8 connection(s)
I20260926 16:14:37.358697 11767 rpc-test.cc:772] Connecting to unix:/tmp/dist-test-taskZngtq3/test-tmp/rpc-test-a449b1198d2848658ede882a930b6648.sock
W20260926 16:14:37.406256 12005 connection.cc:196] Error closing socket: Network error: TlsSocket::Close: Broken pipe
[ OK ] Parameters/TestRpc.TestConnectionNetworkPlane/SSL_UnixSocket (89 ms)
[ RUN ] Parameters/TestRpc.TestTCPKeepalive/SSL_UnixSocket
I20260926 16:14:37.439589 12031 acceptor_pool.cc:254] collecting diagnostics on the listening RPC socket unix:/tmp/dist-test-taskZngtq3/test-tmp/rpc-test-52dbbf7c9c0b43c18d8630fb3841e455.sock every 8 connection(s)
I20260926 16:14:37.440405 12032 acceptor_pool.cc:254] collecting diagnostics on the listening RPC socket unix:/tmp/dist-test-taskZngtq3/test-tmp/rpc-test-52dbbf7c9c0b43c18d8630fb3841e455.sock every 8 connection(s)
I20260926 16:14:37.476856 12035 rpc-test-base.h:222] got call: sleep_micros: 8000000 deferred: true
I20260926 16:14:45.481141 12035 rpcz_store.cc:275] Call kudu.rpc.GenericCalculatorService.Sleep from unix:<unnamed> (request call id 0) took 8004 ms. Trace:
I20260926 16:14:45.481567 12035 rpcz_store.cc:276] 0926 16:14:37.476624 (+ 0us) service_pool.cc:170] Inserting onto call queue
0926 16:14:37.476768 (+ 144us) service_pool.cc:227] Handling call
0926 16:14:45.480970 (+8004202us) inbound_call.cc:173] Queueing success response
Metrics: {}
W20260926 16:14:45.488291 12028 connection.cc:196] Error closing socket: Network error: TlsSocket::Close: Broken pipe
[ OK ] Parameters/TestRpc.TestTCPKeepalive/SSL_UnixSocket (8082 ms)
[ RUN ] Parameters/TestRpc.TestMaxSmallSidecars/SSL_UnixSocket
I20260926 16:14:45.540518 12057 acceptor_pool.cc:254] collecting diagnostics on the listening RPC socket unix:/tmp/dist-test-taskZngtq3/test-tmp/rpc-test-d936f65a96fb455eb716340f0db11ce4.sock every 8 connection(s)
I20260926 16:14:45.541401 12058 acceptor_pool.cc:254] collecting diagnostics on the listening RPC socket unix:/tmp/dist-test-taskZngtq3/test-tmp/rpc-test-d936f65a96fb455eb716340f0db11ce4.sock every 8 connection(s)
W20260926 16:14:45.704411 12054 connection.cc:196] Error closing socket: Network error: TlsSocket::Close: Broken pipe
[ OK ] Parameters/TestRpc.TestMaxSmallSidecars/SSL_UnixSocket (213 ms)
[ RUN ] Parameters/TestRpc.TestCallTimeout/SSL_UnixSocket
I20260926 16:14:45.752286 12082 acceptor_pool.cc:254] collecting diagnostics on the listening RPC socket unix:/tmp/dist-test-taskZngtq3/test-tmp/rpc-test-d2fc49db4a6444f98672118d81549dad.sock every 8 connection(s)
I20260926 16:14:45.753255 12083 acceptor_pool.cc:254] collecting diagnostics on the listening RPC socket unix:/tmp/dist-test-taskZngtq3/test-tmp/rpc-test-d2fc49db4a6444f98672118d81549dad.sock every 8 connection(s)
I20260926 16:14:45.781325 11767 rpc-test-base.h:595] status: Timed out: connection negotiation to unix:/tmp/dist-test-taskZngtq3/test-tmp/rpc-test-d2fc49db4a6444f98672118d81549dad.sock for RPC Sleep timed out after 0.000s (ON_OUTBOUND_QUEUE), seconds elapsed: 0.00255934
I20260926 16:14:45.789135 12086 rpc-test-base.h:222] got call: sleep_micros: 700000
I20260926 16:14:45.983034 11767 rpc-test-base.h:595] status: Timed out: Sleep RPC to unix:/tmp/dist-test-taskZngtq3/test-tmp/rpc-test-d2fc49db4a6444f98672118d81549dad.sock timed out after 0.200s (SENT), seconds elapsed: 0.201401
I20260926 16:14:45.984676 12085 rpc-test-base.h:222] got call: sleep_micros: 2000000
W20260926 16:14:46.489956 12086 rpcz_store.cc:267] Call kudu.rpc.GenericCalculatorService.Sleep from unix:<unnamed> (request call id 1) took 701 ms (client timeout 200 ms). Trace:
W20260926 16:14:46.490341 12086 rpcz_store.cc:269] 0926 16:14:45.788821 (+ 0us) service_pool.cc:170] Inserting onto call queue
0926 16:14:45.788987 (+ 166us) service_pool.cc:227] Handling call
0926 16:14:46.489890 (+700903us) inbound_call.cc:173] Queueing success response
Metrics: {}
I20260926 16:14:47.485124 11767 rpc-test-base.h:595] status: Timed out: Sleep RPC to unix:/tmp/dist-test-taskZngtq3/test-tmp/rpc-test-d2fc49db4a6444f98672118d81549dad.sock timed out after 1.500s (SENT), seconds elapsed: 1.50172
W20260926 16:14:47.985314 12085 rpcz_store.cc:267] Call kudu.rpc.GenericCalculatorService.Sleep from unix:<unnamed> (request call id 2) took 2000 ms (client timeout 1500 ms). Trace:
W20260926 16:14:47.985682 12085 rpcz_store.cc:269] 0926 16:14:45.984397 (+ 0us) service_pool.cc:170] Inserting onto call queue
0926 16:14:45.984606 (+ 209us) service_pool.cc:227] Handling call
0926 16:14:47.985256 (+2000650us) inbound_call.cc:173] Queueing success response
Metrics: {}
W20260926 16:14:47.986435 12079 connection.cc:441] server connection from unix:<unnamed> torn down before Call kudu.rpc.GenericCalculatorService.Sleep from unix:<unnamed> (request call id 2) could send its response
[ OK ] Parameters/TestRpc.TestCallTimeout/SSL_UnixSocket (2282 ms)
[ RUN ] Parameters/TestRpc.TestServerShutsDown/SSL_UnixSocket
I20260926 16:14:47.994223 11767 rpc-test.cc:1125] Connecting to 0.0.0.0:34509
W20260926 16:14:48.005357 12099 negotiation.cc:337] Failed RPC negotiation. Trace:
0926 16:14:48.003478 (+ 0us) reactor.cc:625] Submitting negotiation task for client connection to 0.0.0.0:34509 (local address 127.0.0.1:46280)
0926 16:14:48.004260 (+ 782us) negotiation.cc:107] Waiting for socket to connect
0926 16:14:48.004295 (+ 35us) client_negotiation.cc:174] Beginning negotiation
0926 16:14:48.004518 (+ 223us) client_negotiation.cc:252] Sending NEGOTIATE NegotiatePB request
0926 16:14:48.004782 (+ 264us) negotiation.cc:327] Negotiation complete: Network error: Client connection negotiation failed: client connection to 0.0.0.0:34509: BlockingWrite error: write error: Broken pipe (error 32)
Metrics: {"client-negotiator.queue_time_us":338}
[ OK ] Parameters/TestRpc.TestServerShutsDown/SSL_UnixSocket (16 ms)
[ RUN ] Parameters/TestRpc.TimedOutOnResponseMetric/SSL_UnixSocket
I20260926 16:14:48.028316 12116 acceptor_pool.cc:254] collecting diagnostics on the listening RPC socket unix:/tmp/dist-test-taskZngtq3/test-tmp/rpc-test-cbdf4d665e8d410aa9d07020820ebb59.sock every 8 connection(s)
I20260926 16:14:48.029062 12117 acceptor_pool.cc:254] collecting diagnostics on the listening RPC socket unix:/tmp/dist-test-taskZngtq3/test-tmp/rpc-test-cbdf4d665e8d410aa9d07020820ebb59.sock every 8 connection(s)
W20260926 16:14:48.267642 12120 rpcz_store.cc:267] Call kudu.rpc_test.CalculatorService.Sleep from unix:<unnamed> (request call id 3) took 50 ms (client timeout 25 ms). Trace:
W20260926 16:14:48.267992 12120 rpcz_store.cc:269] 0926 16:14:48.216934 (+ 0us) service_pool.cc:170] Inserting onto call queue
0926 16:14:48.217088 (+ 154us) service_pool.cc:227] Handling call
0926 16:14:48.267549 (+ 50461us) inbound_call.cc:173] Queueing success response
Related trace 'test_child':
Metrics: {"test_sleep_us":50000,"child_traces":[["test_child",{"related_trace_metric":1}]]}
W20260926 16:14:48.327864 12120 rpcz_store.cc:267] Call kudu.rpc_test.CalculatorService.Sleep from unix:<unnamed> (request call id 4) took 50 ms (client timeout 50 ms). Trace:
W20260926 16:14:48.328238 12120 rpcz_store.cc:269] 0926 16:14:48.277255 (+ 0us) service_pool.cc:170] Inserting onto call queue
0926 16:14:48.277422 (+ 167us) service_pool.cc:227] Handling call
0926 16:14:48.327800 (+ 50378us) inbound_call.cc:173] Queueing success response
Related trace 'test_child':
Metrics: {"test_sleep_us":50000,"child_traces":[["test_child",{"related_trace_metric":1}]]}
[ OK ] Parameters/TestRpc.TimedOutOnResponseMetric/SSL_UnixSocket (328 ms)
[ RUN ] Parameters/TestRpc.AcceptorDispatchingTimesMetric/SSL_UnixSocket
I20260926 16:14:48.348457 12141 acceptor_pool.cc:254] collecting diagnostics on the listening RPC socket 0.0.0.0:41761 every 8 connection(s)
I20260926 16:14:48.349193 12142 acceptor_pool.cc:254] collecting diagnostics on the listening RPC socket 0.0.0.0:41761 every 8 connection(s)
W20260926 16:14:48.354794 12137 negotiation.cc:337] Failed RPC negotiation. Trace:
0926 16:14:48.353436 (+ 0us) reactor.cc:625] Submitting negotiation task for server connection from 127.0.0.1:42216 (local address 127.0.0.1:41761)
0926 16:14:48.353946 (+ 510us) server_negotiation.cc:206] Beginning negotiation
0926 16:14:48.353961 (+ 15us) server_negotiation.cc:399] Waiting for connection header
0926 16:14:48.354238 (+ 277us) negotiation.cc:327] Negotiation complete: Network error: Server connection negotiation failed: server connection from 127.0.0.1:42216: BlockingRecv error: recv got EOF from 127.0.0.1:42216 (error 108)
Metrics: {"server-negotiator.queue_time_us":188}
[ OK ] Parameters/TestRpc.AcceptorDispatchingTimesMetric/SSL_UnixSocket (23 ms)
[ RUN ] Parameters/TestRpc.TestRpcCallbackDestroysMessenger/SSL_UnixSocket
[ OK ] Parameters/TestRpc.TestRpcCallbackDestroysMessenger/SSL_UnixSocket (36 ms)
[ RUN ] Parameters/TestRpc.TestApplicationFeatureFlag/SSL_UnixSocket
I20260926 16:14:48.419869 12166 acceptor_pool.cc:254] collecting diagnostics on the listening RPC socket unix:/tmp/dist-test-taskZngtq3/test-tmp/rpc-test-c8826bde45f940c6848691824d814e0c.sock every 8 connection(s)
I20260926 16:14:48.420678 12167 acceptor_pool.cc:254] collecting diagnostics on the listening RPC socket unix:/tmp/dist-test-taskZngtq3/test-tmp/rpc-test-c8826bde45f940c6848691824d814e0c.sock every 8 connection(s)
W20260926 16:14:48.456987 12163 messenger.cc:357] Unable to handle RPC call: Not implemented: call requires unsupported application feature flags: 99
W20260926 16:14:48.459942 12163 connection.cc:196] Error closing socket: Network error: TlsSocket::Close: Broken pipe
[ OK ] Parameters/TestRpc.TestApplicationFeatureFlag/SSL_UnixSocket (69 ms)
[ RUN ] Parameters/TestRpc.TestCancellation/SSL_UnixSocket
I20260926 16:14:48.502761 12191 acceptor_pool.cc:254] collecting diagnostics on the listening RPC socket unix:/tmp/dist-test-taskZngtq3/test-tmp/rpc-test-bf51ea7f7e8246ca8fee6173221b6143.sock every 8 connection(s)
I20260926 16:14:48.503474 12192 acceptor_pool.cc:254] collecting diagnostics on the listening RPC socket unix:/tmp/dist-test-taskZngtq3/test-tmp/rpc-test-bf51ea7f7e8246ca8fee6173221b6143.sock every 8 connection(s)
I20260926 16:14:48.506739 11767 rpc-test.cc:1648] Connecting to unix:/tmp/dist-test-taskZngtq3/test-tmp/rpc-test-bf51ea7f7e8246ca8fee6173221b6143.sock
I20260926 16:14:48.616389 11767 rpc-test-base.h:595] status: Aborted: Sleep RPC to unix:/tmp/dist-test-taskZngtq3/test-tmp/rpc-test-bf51ea7f7e8246ca8fee6173221b6143.sock is cancelled in state READY, seconds elapsed: 0.000574193
I20260926 16:14:48.815241 11767 rpc-test-base.h:595] status: Aborted: Sleep RPC to unix:/tmp/dist-test-taskZngtq3/test-tmp/rpc-test-bf51ea7f7e8246ca8fee6173221b6143.sock is cancelled in state SENT, seconds elapsed: 0.00108986
I20260926 16:14:48.815364 12194 rpc-test-base.h:222] got call: sleep_micros: 510000
I20260926 16:14:48.998193 11767 rpc-test-base.h:595] status: Aborted: Sleep RPC to unix:/tmp/dist-test-taskZngtq3/test-tmp/rpc-test-bf51ea7f7e8246ca8fee6173221b6143.sock is cancelled in state SENT, seconds elapsed: 0.000779831
I20260926 16:14:48.998620 12193 rpc-test-base.h:222] got call: sleep_micros: 510000
I20260926 16:14:49.183369 11767 rpc-test-base.h:595] status: Aborted: Sleep RPC to unix:/tmp/dist-test-taskZngtq3/test-tmp/rpc-test-bf51ea7f7e8246ca8fee6173221b6143.sock is cancelled in state SENT, seconds elapsed: 0.00109443
W20260926 16:14:49.194963 12195 rpcz_store.cc:267] Call kudu.rpc.GenericCalculatorService.Sleep from unix:<unnamed> (request call id 11) took 11 ms (client timeout 10 ms). Trace:
W20260926 16:14:49.195245 12195 rpcz_store.cc:269] 0926 16:14:49.183368 (+ 0us) service_pool.cc:170] Inserting onto call queue
0926 16:14:49.194714 (+ 11346us) service_pool.cc:214] Skipping call since client already timed out
0926 16:14:49.194821 (+ 107us) inbound_call.cc:173] Queueing failure response
Metrics: {}
I20260926 16:14:49.195668 12195 rpc-test-base.h:222] got call: sleep_micros: 1500000
W20260926 16:14:49.326007 12194 rpcz_store.cc:267] Call kudu.rpc.GenericCalculatorService.Sleep from unix:<unnamed> (request call id 3) took 510 ms (client timeout 10 ms). Trace:
W20260926 16:14:49.326372 12194 rpcz_store.cc:269] 0926 16:14:48.815170 (+ 0us) service_pool.cc:170] Inserting onto call queue
0926 16:14:48.815297 (+ 127us) service_pool.cc:227] Handling call
0926 16:14:49.325947 (+510650us) inbound_call.cc:173] Queueing success response
Metrics: {}
W20260926 16:14:49.509177 12193 rpcz_store.cc:267] Call kudu.rpc.GenericCalculatorService.Sleep from unix:<unnamed> (request call id 7) took 510 ms (client timeout 10 ms). Trace:
W20260926 16:14:49.509548 12193 rpcz_store.cc:269] 0926 16:14:48.998425 (+ 0us) service_pool.cc:170] Inserting onto call queue
0926 16:14:48.998554 (+ 129us) service_pool.cc:227] Handling call
0926 16:14:49.509101 (+510547us) inbound_call.cc:173] Queueing success response
Metrics: {}
I20260926 16:14:50.186638 11767 rpc-test-base.h:595] status: Timed out: Sleep RPC to unix:/tmp/dist-test-taskZngtq3/test-tmp/rpc-test-bf51ea7f7e8246ca8fee6173221b6143.sock timed out after 1.000s (SENT), seconds elapsed: 1.00276
I20260926 16:14:50.188915 12193 rpc-test-base.h:222] got call: sleep_micros: 1500000
W20260926 16:14:50.696455 12195 rpcz_store.cc:267] Call kudu.rpc.GenericCalculatorService.Sleep from unix:<unnamed> (request call id 12) took 1511 ms (client timeout 1000 ms). Trace:
W20260926 16:14:50.696856 12195 rpcz_store.cc:269] 0926 16:14:49.184554 (+ 0us) service_pool.cc:170] Inserting onto call queue
0926 16:14:49.195641 (+ 11087us) service_pool.cc:227] Handling call
0926 16:14:50.696290 (+1500649us) inbound_call.cc:173] Queueing success response
Metrics: {}
I20260926 16:14:51.189256 11767 rpc-test-base.h:595] status: Timed out: Sleep RPC to unix:/tmp/dist-test-taskZngtq3/test-tmp/rpc-test-bf51ea7f7e8246ca8fee6173221b6143.sock timed out after 1.000s (SENT), seconds elapsed: 1.00208
W20260926 16:14:51.190884 12188 messenger.cc:357] Unable to handle RPC call: Not implemented: call requires unsupported application feature flags: 99, 1
W20260926 16:14:51.192548 12188 messenger.cc:357] Unable to handle RPC call: Not implemented: call requires unsupported application feature flags: 99, 1
W20260926 16:14:51.420859 12188 connection.cc:196] Error closing socket: Network error: TlsSocket::Close: Broken pipe
W20260926 16:14:51.689607 12193 rpcz_store.cc:267] Call kudu.rpc.GenericCalculatorService.Sleep from unix:<unnamed> (request call id 13) took 1501 ms (client timeout 1000 ms). Trace:
W20260926 16:14:51.689987 12193 rpcz_store.cc:269] 0926 16:14:50.188520 (+ 0us) service_pool.cc:170] Inserting onto call queue
0926 16:14:50.188787 (+ 267us) service_pool.cc:227] Handling call
0926 16:14:51.689548 (+1500761us) inbound_call.cc:173] Queueing success response
Metrics: {}
W20260926 16:14:51.690591 12188 connection.cc:441] server connection from unix:<unnamed> torn down before Call kudu.rpc.GenericCalculatorService.Sleep from unix:<unnamed> (request call id 13) could send its response
[ OK ] Parameters/TestRpc.TestCancellation/SSL_UnixSocket (3231 ms)
[ RUN ] Parameters/TestRpc.TestCancellationMultiThreads/SSL_UnixSocket
I20260926 16:14:51.726123 12217 acceptor_pool.cc:254] collecting diagnostics on the listening RPC socket unix:/tmp/dist-test-taskZngtq3/test-tmp/rpc-test-5eadc2994b684a8b9a6495d696dde14f.sock every 8 connection(s)
I20260926 16:14:51.726992 12218 acceptor_pool.cc:254] collecting diagnostics on the listening RPC socket unix:/tmp/dist-test-taskZngtq3/test-tmp/rpc-test-5eadc2994b684a8b9a6495d696dde14f.sock every 8 connection(s)
I20260926 16:14:51.730430 11767 rpc-test.cc:1808] Connecting to unix:/tmp/dist-test-taskZngtq3/test-tmp/rpc-test-5eadc2994b684a8b9a6495d696dde14f.sock
I20260926 16:14:51.902899 12231 test_util.cc:268] Using random seed: 570186563
I20260926 16:14:51.904253 12232 test_util.cc:268] Using random seed: 570187998
I20260926 16:14:51.906191 12233 test_util.cc:268] Using random seed: 570189855
I20260926 16:14:51.907713 12234 test_util.cc:268] Using random seed: 570191431
I20260926 16:14:51.909379 12235 test_util.cc:268] Using random seed: 570192968
I20260926 16:14:51.911166 12236 test_util.cc:268] Using random seed: 570194762
I20260926 16:14:51.913468 12237 test_util.cc:268] Using random seed: 570197032
I20260926 16:14:51.914938 12238 test_util.cc:268] Using random seed: 570198577
I20260926 16:14:51.916496 12239 test_util.cc:268] Using random seed: 570200150
I20260926 16:14:51.917873 12240 test_util.cc:268] Using random seed: 570201529
I20260926 16:14:51.919489 12241 test_util.cc:268] Using random seed: 570203143
I20260926 16:14:51.920921 12242 test_util.cc:268] Using random seed: 570204572
I20260926 16:14:51.922278 12243 test_util.cc:268] Using random seed: 570205916
I20260926 16:14:51.923833 12244 test_util.cc:268] Using random seed: 570207478
I20260926 16:14:51.925467 12245 test_util.cc:268] Using random seed: 570209053
I20260926 16:14:51.928422 12246 test_util.cc:268] Using random seed: 570212031
I20260926 16:14:51.930181 12247 test_util.cc:268] Using random seed: 570213792
I20260926 16:14:51.932017 12248 test_util.cc:268] Using random seed: 570215556
I20260926 16:14:51.933929 12249 test_util.cc:268] Using random seed: 570217519
I20260926 16:14:51.935870 12250 test_util.cc:268] Using random seed: 570219429
I20260926 16:14:51.937670 12251 test_util.cc:268] Using random seed: 570221215
I20260926 16:14:51.939538 12252 test_util.cc:268] Using random seed: 570223110
I20260926 16:14:51.942276 12253 test_util.cc:268] Using random seed: 570225798
I20260926 16:14:51.944495 12254 test_util.cc:268] Using random seed: 570228020
I20260926 16:14:51.946085 12255 test_util.cc:268] Using random seed: 570229646
I20260926 16:14:51.948383 12256 test_util.cc:268] Using random seed: 570231939
I20260926 16:14:51.950367 12257 test_util.cc:268] Using random seed: 570233903
I20260926 16:14:51.952327 12258 test_util.cc:268] Using random seed: 570235881
I20260926 16:14:51.954592 12259 test_util.cc:268] Using random seed: 570238156
I20260926 16:14:51.956542 12260 test_util.cc:268] Using random seed: 570240147
W20260926 16:15:13.198783 12214 connection.cc:196] Error closing socket: Network error: TlsSocket::Close: Broken pipe
[ OK ] Parameters/TestRpc.TestCancellationMultiThreads/SSL_UnixSocket (21520 ms)
[ RUN ] Parameters/TestRpc.TestCallId/SSL_UnixSocket
I20260926 16:15:13.261647 12274 acceptor_pool.cc:254] collecting diagnostics on the listening RPC socket unix:/tmp/dist-test-taskZngtq3/test-tmp/rpc-test-494217f8f24b4cfdae3b0d0e2f01cab4.sock every 8 connection(s)
I20260926 16:15:13.262499 12275 acceptor_pool.cc:254] collecting diagnostics on the listening RPC socket unix:/tmp/dist-test-taskZngtq3/test-tmp/rpc-test-494217f8f24b4cfdae3b0d0e2f01cab4.sock every 8 connection(s)
W20260926 16:15:13.307583 12271 connection.cc:196] Error closing socket: Network error: TlsSocket::Close: Broken pipe
[ OK ] Parameters/TestRpc.TestCallId/SSL_UnixSocket (96 ms)
[----------] 20 tests from Parameters/TestRpc (40166 ms total)
[----------] Global test environment tear-down
[==========] 21 tests from 2 test suites ran. (43265 ms total)
[ PASSED ] 20 tests.
[ FAILED ] 1 test, listed below:
[ FAILED ] Parameters/TestRpc.TestCallWithChainCertAndRootCA/SSL_UnixSocket, where GetParam() = (true, true)
1 FAILED TEST
I20260926 16:15:13.334932 11767 logging.cc:424] LogThrottler /data0/somelongdirectorytoavoidrpathissues/src/kudu/src/kudu/rpc/acceptor_pool.cc:285: suppressed but not reported on 3 messages since previous log ~36 seconds ago