Diagnosed failure

Parameters/TestRpc.TestCallWithChainCertAndChainCA/SSL_TCP: /data0/somelongdirectorytoavoidrpathissues/src/kudu/src/kudu/rpc/rpc-test.cc:270: Failure
Failed
Bad status: Runtime error: could not verify certificate chain (error with cert: subject=CN = localhost, ST = sadfjas, C = AS, emailAddress = sdflkdsajf, O = lskdfjlsad, OU = sldfkja, issuer=C = AS, ST = ASDfkjdhf, L = lskdjf, O = saldfja, OU = skdjf, CN = localhost, emailAddress = sadjflkadsj): : certificate has expired
Google Test trace:
/data0/somelongdirectorytoavoidrpathissues/src/kudu/src/kudu/rpc/rpc-test.cc:267: Connecting to 0.0.0.0:39719
I20260924 21:10:35.495554   812 test_util.cc:175] -----------------------------------------------
I20260924 21:10:35.495610   812 test_util.cc:176] Had fatal failures, leaving test files at /tmp/dist-test-taskomWNYI/test-tmp/rpc-test.5.Parameters_TestRpc.TestCallWithChainCertAndChainCA_SSL_TCP.1790284235417319-812-0

Full log

Note: This is test shard 6 of 8.
[==========] Running 21 tests from 2 test suites.
[----------] Global test environment set-up.
[----------] 20 tests from Parameters/TestRpc
[ RUN      ] Parameters/TestRpc.TestMessengerCreateDestroy/SSL_TCP
WARNING: Logging before InitGoogleLogging() is written to STDERR
I20260924 21:10:35.462318   812 rpc-test.cc:169] started messenger TestCreateDestroy
[       OK ] Parameters/TestRpc.TestMessengerCreateDestroy/SSL_TCP (43 ms)
[ RUN      ] Parameters/TestRpc.TestNegotiationDeadlock/SSL_TCP
I20260924 21:10:35.469898   832 acceptor_pool.cc:254] collecting diagnostics on the listening RPC socket 0.0.0.0:43631 every 8 connection(s)
I20260924 21:10:35.469906   833 acceptor_pool.cc:254] collecting diagnostics on the listening RPC socket 0.0.0.0:43631 every 8 connection(s)
[       OK ] Parameters/TestRpc.TestNegotiationDeadlock/SSL_TCP (13 ms)
[ RUN      ] Parameters/TestRpc.TestCallWithChainCertAndChainCA/SSL_TCP
I20260924 21:10:35.491205   848 acceptor_pool.cc:254] collecting diagnostics on the listening RPC socket 0.0.0.0:39719 every 8 connection(s)
I20260924 21:10:35.491221   849 acceptor_pool.cc:254] collecting diagnostics on the listening RPC socket 0.0.0.0:39719 every 8 connection(s)
/data0/somelongdirectorytoavoidrpathissues/src/kudu/src/kudu/rpc/rpc-test.cc:270: Failure
Failed
Bad status: Runtime error: could not verify certificate chain (error with cert: subject=CN = localhost, ST = sadfjas, C = AS, emailAddress = sdflkdsajf, O = lskdfjlsad, OU = sldfkja, issuer=C = AS, ST = ASDfkjdhf, L = lskdjf, O = saldfja, OU = skdjf, CN = localhost, emailAddress = sadjflkadsj): : certificate has expired
Google Test trace:
/data0/somelongdirectorytoavoidrpathissues/src/kudu/src/kudu/rpc/rpc-test.cc:267: Connecting to 0.0.0.0:39719
I20260924 21:10:35.495554   812 test_util.cc:175] -----------------------------------------------
I20260924 21:10:35.495610   812 test_util.cc:176] Had fatal failures, leaving test files at /tmp/dist-test-taskomWNYI/test-tmp/rpc-test.5.Parameters_TestRpc.TestCallWithChainCertAndChainCA_SSL_TCP.1790284235417319-812-0
[  FAILED  ] Parameters/TestRpc.TestCallWithChainCertAndChainCA/SSL_TCP, where GetParam() = (true, false) (17 ms)
[ RUN      ] Parameters/TestRpc.TestCallWithPasswordProtectedKey/SSL_TCP
I20260924 21:10:35.510156   873 acceptor_pool.cc:254] collecting diagnostics on the listening RPC socket 0.0.0.0:38951 every 8 connection(s)
I20260924 21:10:35.510156   874 acceptor_pool.cc:254] collecting diagnostics on the listening RPC socket 0.0.0.0:38951 every 8 connection(s)
[       OK ] Parameters/TestRpc.TestCallWithPasswordProtectedKey/SSL_TCP (28 ms)
[ RUN      ] Parameters/TestRpc.TestCallToBadServer/SSL_TCP
I20260924 21:10:35.537817   812 rpc-test.cc:394] Status: Network error: Client connection negotiation failed: client connection to 0.0.0.0:0: connect: Connection refused (error 111)
I20260924 21:10:35.538194   812 rpc-test.cc:394] Status: Network error: Client connection negotiation failed: client connection to 0.0.0.0:0: connect: Connection refused (error 111)
I20260924 21:10:35.538501   812 rpc-test.cc:394] Status: Network error: Client connection negotiation failed: client connection to 0.0.0.0:0: connect: Connection refused (error 111)
I20260924 21:10:35.538729   812 rpc-test.cc:394] Status: Network error: Client connection negotiation failed: client connection to 0.0.0.0:0: connect: Connection refused (error 111)
I20260924 21:10:35.538975   812 rpc-test.cc:394] Status: Network error: Client connection negotiation failed: client connection to 0.0.0.0:0: connect: Connection refused (error 111)
[       OK ] Parameters/TestRpc.TestCallToBadServer/SSL_TCP (15 ms)
[ RUN      ] Parameters/TestRpc.TestWrongService/SSL_TCP
I20260924 21:10:35.558969   908 acceptor_pool.cc:254] collecting diagnostics on the listening RPC socket 0.0.0.0:33881 every 8 connection(s)
I20260924 21:10:35.558991   909 acceptor_pool.cc:254] collecting diagnostics on the listening RPC socket 0.0.0.0:33881 every 8 connection(s)
I20260924 21:10:35.575127   905 messenger.cc:345] service WrongServiceName not registered on TestServer
[       OK ] Parameters/TestRpc.TestWrongService/SSL_TCP (37 ms)
[ RUN      ] Parameters/TestRpc.TestConnectionKeepalive/SSL_TCP
I20260924 21:10:35.586205   931 acceptor_pool.cc:254] collecting diagnostics on the listening RPC socket 0.0.0.0:41101 every 8 connection(s)
I20260924 21:10:35.586247   932 acceptor_pool.cc:254] collecting diagnostics on the listening RPC socket 0.0.0.0:41101 every 8 connection(s)
I20260924 21:10:35.586463   812 rpc-test.cc:488] Connecting to 0.0.0.0:41101
[       OK ] Parameters/TestRpc.TestConnectionKeepalive/SSL_TCP (1025 ms)
[ RUN      ] Parameters/TestRpc.TestClientConnectionMetrics/SSL_TCP
I20260924 21:10:36.615727   956 acceptor_pool.cc:254] collecting diagnostics on the listening RPC socket 0.0.0.0:40967 every 8 connection(s)
I20260924 21:10:36.615734   957 acceptor_pool.cc:254] collecting diagnostics on the listening RPC socket 0.0.0.0:40967 every 8 connection(s)
I20260924 21:10:36.615891   812 rpc-test.cc:569] Connecting to 0.0.0.0:40967
[       OK ] Parameters/TestRpc.TestClientConnectionMetrics/SSL_TCP (8938 ms)
[ RUN      ] Parameters/TestRpc.TestCredentialsPolicy/SSL_TCP
I20260924 21:10:45.547559   979 acceptor_pool.cc:254] collecting diagnostics on the listening RPC socket 0.0.0.0:34001 every 8 connection(s)
I20260924 21:10:45.547668   980 acceptor_pool.cc:254] collecting diagnostics on the listening RPC socket 0.0.0.0:34001 every 8 connection(s)
I20260924 21:10:45.547820   812 rpc-test.cc:700] Connecting to 0.0.0.0:34001
[       OK ] Parameters/TestRpc.TestCredentialsPolicy/SSL_TCP (58 ms)
[ RUN      ] Parameters/TestRpc.TestCallLongerThanKeepalive/SSL_TCP
I20260924 21:10:45.627604  1004 acceptor_pool.cc:254] collecting diagnostics on the listening RPC socket 0.0.0.0:34501 every 8 connection(s)
I20260924 21:10:45.627655  1005 acceptor_pool.cc:254] collecting diagnostics on the listening RPC socket 0.0.0.0:34501 every 8 connection(s)
I20260924 21:10:45.637563  1008 rpc-test-base.h:222] got call: sleep_micros: 3000000 deferred: true
I20260924 21:10:48.638326  1008 rpcz_store.cc:275] Call kudu.rpc.GenericCalculatorService.Sleep from 127.0.0.1:53282 (request call id 0) took 3000 ms. Trace:
I20260924 21:10:48.638458  1008 rpcz_store.cc:276] 0924 21:10:45.637468 (+     0us) service_pool.cc:170] Inserting onto call queue
0924 21:10:45.637534 (+    66us) service_pool.cc:227] Handling call
0924 21:10:48.638243 (+3000709us) inbound_call.cc:173] Queueing success response
Metrics: {}
[       OK ] Parameters/TestRpc.TestCallLongerThanKeepalive/SSL_TCP (3042 ms)
[ RUN      ] Parameters/TestRpc.TestRpcSidecar/SSL_TCP
I20260924 21:10:48.667865  1029 acceptor_pool.cc:254] collecting diagnostics on the listening RPC socket 0.0.0.0:45389 every 8 connection(s)
I20260924 21:10:48.667903  1030 acceptor_pool.cc:254] collecting diagnostics on the listening RPC socket 0.0.0.0:45389 every 8 connection(s)
[       OK ] Parameters/TestRpc.TestRpcSidecar/SSL_TCP (66 ms)
[ RUN      ] Parameters/TestRpc.TestRpcSidecarLimits/SSL_TCP
I20260924 21:10:50.441285  1054 acceptor_pool.cc:254] collecting diagnostics on the listening RPC socket 0.0.0.0:43047 every 8 connection(s)
I20260924 21:10:50.441298  1055 acceptor_pool.cc:254] collecting diagnostics on the listening RPC socket 0.0.0.0:43047 every 8 connection(s)
W20260924 21:10:50.454896   812 serialization.cc:72] Serialized kudu.rpc_test.PushStringsRequestPB (2147483654 bytes) is larger than the maximum configured RPC message size (52428800 bytes). Sending anyway, but peer may reject the data.
W20260924 21:10:50.458595  1052 connection.cc:535] server connection from 127.0.0.1:40998 recv error: Network error: RPC frame had a length of 2147483714, but we only support messages up to 52428800 bytes long.
W20260924 21:10:50.458688  1052 connection.cc:158] shutting down server connection from 127.0.0.1:40998 with pending inbound data: 4/2147483714 bytes received; last active 0 ns ago: status Network error: RPC frame had a length of 2147483714, but we only support messages up to 52428800 bytes long.
W20260924 21:10:50.458932  1067 connection.cc:196] Error closing socket: Network error: TlsSocket::Close: Connection reset by peer
I20260924 21:10:50.495474  1079 acceptor_pool.cc:254] collecting diagnostics on the listening RPC socket 0.0.0.0:46577 every 8 connection(s)
I20260924 21:10:50.495651  1080 acceptor_pool.cc:254] collecting diagnostics on the listening RPC socket 0.0.0.0:46577 every 8 connection(s)
W20260924 21:10:54.339473  1078 connection.cc:577] server connection from 127.0.0.1:42232: received bad data: 'Corruption: Invalid packet: message had a length of 2147483710, but we only support messages up to 2147483647 bytes
'
[       OK ] Parameters/TestRpc.TestRpcSidecarLimits/SSL_TCP (5634 ms)
[ RUN      ] Parameters/TestRpc.TestCallTimeoutDoesntAffectNegotiation/SSL_TCP
I20260924 21:10:54.360390  1104 acceptor_pool.cc:254] collecting diagnostics on the listening RPC socket 0.0.0.0:33705 every 8 connection(s)
I20260924 21:10:54.360419  1105 acceptor_pool.cc:254] collecting diagnostics on the listening RPC socket 0.0.0.0:33705 every 8 connection(s)
W20260924 21:10:54.379366  1100 negotiation.cc:266] Injecting 500ms delay in negotiation
I20260924 21:10:54.429709   812 rpc-test-base.h:595] status: Timed out: connection negotiation to 0.0.0.0:33705 for RPC Sleep timed out after 0.050s (ON_OUTBOUND_QUEUE), seconds elapsed: 0.0506545
[       OK ] Parameters/TestRpc.TestCallTimeoutDoesntAffectNegotiation/SSL_TCP (546 ms)
[ RUN      ] Parameters/TestRpc.TestRpcHandlerLatencyMetric/SSL_TCP
I20260924 21:10:54.907632  1129 acceptor_pool.cc:254] collecting diagnostics on the listening RPC socket 0.0.0.0:37281 every 8 connection(s)
I20260924 21:10:54.907635  1130 acceptor_pool.cc:254] collecting diagnostics on the listening RPC socket 0.0.0.0:37281 every 8 connection(s)
I20260924 21:10:54.951740   812 rpc-test.cc:1236] Sleep() min lat: 20336
I20260924 21:10:54.951817   812 rpc-test.cc:1237] Sleep() mean lat: 20336
I20260924 21:10:54.951843   812 rpc-test.cc:1238] Sleep() max lat: 20336
I20260924 21:10:54.951855   812 rpc-test.cc:1239] Sleep() #calls: 1
[       OK ] Parameters/TestRpc.TestRpcHandlerLatencyMetric/SSL_TCP (63 ms)
[ RUN      ] Parameters/TestRpc.TimedOutOnResponseMetricServiceQueue/SSL_TCP
I20260924 21:10:54.973974  1155 acceptor_pool.cc:254] collecting diagnostics on the listening RPC socket 0.0.0.0:40543 every 8 connection(s)
I20260924 21:10:54.973987  1156 acceptor_pool.cc:254] collecting diagnostics on the listening RPC socket 0.0.0.0:40543 every 8 connection(s)
W20260924 21:10:55.033684  1157 rpcz_store.cc:267] Call kudu.rpc_test.CalculatorService.Sleep from 127.0.0.1:34120 (request call id 2) took 20 ms (client timeout 20 ms). Trace:
W20260924 21:10:55.033782  1157 rpcz_store.cc:269] 0924 21:10:55.013413 (+     0us) service_pool.cc:170] Inserting onto call queue
0924 21:10:55.033645 (+ 20232us) service_pool.cc:214] Skipping call since client already timed out
0924 21:10:55.033653 (+     8us) inbound_call.cc:173] Queueing failure response
Metrics: {}
[       OK ] Parameters/TestRpc.TimedOutOnResponseMetricServiceQueue/SSL_TCP (82 ms)
[ RUN      ] Parameters/TestRpc.RpcPendingConnectionsMetric/SSL_TCP
I20260924 21:10:55.037222  1178 acceptor_pool.cc:254] collecting diagnostics on the listening RPC socket 0.0.0.0:32849 every 8 connection(s)
I20260924 21:10:55.037292  1179 acceptor_pool.cc:254] collecting diagnostics on the listening RPC socket 0.0.0.0:32849 every 8 connection(s)
W20260924 21:10:55.046938  1174 negotiation.cc:337] Failed RPC negotiation. Trace:
0924 21:10:55.046709 (+     0us) reactor.cc:625] Submitting negotiation task for server connection from 127.0.0.1:43380 (local address 127.0.0.1:32849)
0924 21:10:55.046776 (+    67us) server_negotiation.cc:206] Beginning negotiation
0924 21:10:55.046780 (+     4us) server_negotiation.cc:399] Waiting for connection header
0924 21:10:55.046852 (+    72us) negotiation.cc:327] Negotiation complete: Network error: Server connection negotiation failed: server connection from 127.0.0.1:43380: BlockingRecv error: recv got EOF from 127.0.0.1:43380 (error 108)
Metrics: {"server-negotiator.queue_time_us":33}
[       OK ] Parameters/TestRpc.RpcPendingConnectionsMetric/SSL_TCP (22 ms)
[ RUN      ] Parameters/TestRpc.TestRpcContextClientDeadline/SSL_TCP
I20260924 21:10:55.079425  1194 acceptor_pool.cc:254] collecting diagnostics on the listening RPC socket 0.0.0.0:43829 every 8 connection(s)
I20260924 21:10:55.079450  1195 acceptor_pool.cc:254] collecting diagnostics on the listening RPC socket 0.0.0.0:43829 every 8 connection(s)
[       OK ] Parameters/TestRpc.TestRpcContextClientDeadline/SSL_TCP (52 ms)
[ RUN      ] Parameters/TestRpc.TestApplicationFeatureFlagUnsupportedServer/SSL_TCP
I20260924 21:10:55.127915  1219 acceptor_pool.cc:254] collecting diagnostics on the listening RPC socket 0.0.0.0:45707 every 8 connection(s)
I20260924 21:10:55.127961  1220 acceptor_pool.cc:254] collecting diagnostics on the listening RPC socket 0.0.0.0:45707 every 8 connection(s)
[       OK ] Parameters/TestRpc.TestApplicationFeatureFlagUnsupportedServer/SSL_TCP (25 ms)
[ RUN      ] Parameters/TestRpc.TestCancellationAsync/SSL_TCP
I20260924 21:10:55.151863  1245 acceptor_pool.cc:254] collecting diagnostics on the listening RPC socket 0.0.0.0:36509 every 8 connection(s)
I20260924 21:10:55.151880  1244 acceptor_pool.cc:254] collecting diagnostics on the listening RPC socket 0.0.0.0:36509 every 8 connection(s)
I20260924 21:10:55.152036   812 rpc-test.cc:1716] Connecting to 0.0.0.0:36509
I20260924 21:10:55.163977   812 test_util.cc:268] Using random seed: 152270406
I20260924 21:10:55.184032  1248 rpc-test-base.h:240] got call: sleep_micros: 500 pattern: 4294967295 num_repetitions: 2097152 sidecar_idx: 0
I20260924 21:10:55.200281  1248 rpc-test-base.h:240] got call: sleep_micros: 500 pattern: 4294967295 num_repetitions: 2097152 sidecar_idx: 0
I20260924 21:10:55.216684  1248 rpc-test-base.h:240] got call: sleep_micros: 500 pattern: 4294967295 num_repetitions: 2097152 sidecar_idx: 0
I20260924 21:10:55.232926  1248 rpc-test-base.h:240] got call: sleep_micros: 500 pattern: 4294967295 num_repetitions: 2097152 sidecar_idx: 0
I20260924 21:10:55.245466  1248 rpc-test-base.h:240] got call: sleep_micros: 500 pattern: 4294967295 num_repetitions: 2097152 sidecar_idx: 0
I20260924 21:10:55.257678  1248 rpc-test-base.h:240] got call: sleep_micros: 500 pattern: 4294967295 num_repetitions: 2097152 sidecar_idx: 0
I20260924 21:10:55.271169  1248 rpc-test-base.h:240] got call: sleep_micros: 500 pattern: 4294967295 num_repetitions: 2097152 sidecar_idx: 0
I20260924 21:10:55.285739  1248 rpc-test-base.h:240] got call: sleep_micros: 500 pattern: 4294967295 num_repetitions: 2097152 sidecar_idx: 0
W20260924 21:10:55.289038  1241 connection.cc:441] server connection from 127.0.0.1:39776 torn down before Call kudu.rpc.GenericCalculatorService.SleepWithSidecar from 127.0.0.1:39776 (request call id 9) could send its response
[       OK ] Parameters/TestRpc.TestCancellationAsync/SSL_TCP (153 ms)
[ RUN      ] Parameters/TestRpc.TestPerformanceBySocketType/SSL_TCP
I20260924 21:10:55.307026  1269 acceptor_pool.cc:254] collecting diagnostics on the listening RPC socket 0.0.0.0:33369 every 8 connection(s)
I20260924 21:10:55.307029  1270 acceptor_pool.cc:254] collecting diagnostics on the listening RPC socket 0.0.0.0:33369 every 8 connection(s)
I20260924 21:10:55.307247   812 rpc-test.cc:1846] Connecting to 0.0.0.0:33369
I20260924 21:10:57.070482   812 rpc-test.cc:1859] Sending 1024MB via ssl-enabled tcp socket: real 1.747s	user 1.618s	sys 1.475s
I20260924 21:10:58.801532   812 rpc-test.cc:1859] Sending 1024MB via ssl-enabled tcp socket: real 1.731s	user 1.550s	sys 1.510s
I20260924 21:11:00.658288   812 rpc-test.cc:1859] Sending 1024MB via ssl-enabled tcp socket: real 1.857s	user 1.675s	sys 1.596s
I20260924 21:11:02.463814   812 rpc-test.cc:1859] Sending 1024MB via ssl-enabled tcp socket: real 1.805s	user 1.725s	sys 1.456s
I20260924 21:11:04.333698   812 rpc-test.cc:1859] Sending 1024MB via ssl-enabled tcp socket: real 1.870s	user 1.561s	sys 1.727s
[       OK ] Parameters/TestRpc.TestPerformanceBySocketType/SSL_TCP (9045 ms)
[----------] 20 tests from Parameters/TestRpc (28915 ms total)

[----------] 1 test from Parameters/TestRpcSocketTxRxQueue
[ RUN      ] Parameters/TestRpcSocketTxRxQueue.OverCapacity/0
W20260924 21:11:04.610471  1312 negotiation.cc:337] Failed RPC negotiation. Trace:
0924 21:11:04.347130 (+     0us) reactor.cc:625] Submitting negotiation task for client connection to 0.0.0.0:40991 (local address 127.0.0.1:34530)
0924 21:11:04.347247 (+   117us) negotiation.cc:107] Waiting for socket to connect
0924 21:11:04.347258 (+    11us) client_negotiation.cc:174] Beginning negotiation
0924 21:11:04.347317 (+    59us) client_negotiation.cc:252] Sending NEGOTIATE NegotiatePB request
0924 21:11:04.610323 (+263006us) negotiation.cc:327] Negotiation complete: Network error: Client connection negotiation failed: client connection to 0.0.0.0:40991: BlockingRecv error: recv error from unknown peer: Transport endpoint is not connected (error 107)
Metrics: {"client-negotiator.queue_time_us":92}
W20260924 21:11:04.610481  1304 negotiation.cc:337] Failed RPC negotiation. Trace:
0924 21:11:04.345896 (+     0us) reactor.cc:625] Submitting negotiation task for client connection to 0.0.0.0:40991 (local address 127.0.0.1:34516)
0924 21:11:04.345969 (+    73us) negotiation.cc:107] Waiting for socket to connect
0924 21:11:04.345981 (+    12us) client_negotiation.cc:174] Beginning negotiation
0924 21:11:04.346040 (+    59us) client_negotiation.cc:252] Sending NEGOTIATE NegotiatePB request
0924 21:11:04.610323 (+264283us) negotiation.cc:327] Negotiation complete: Network error: Client connection negotiation failed: client connection to 0.0.0.0:40991: BlockingRecv error: recv error from unknown peer: Transport endpoint is not connected (error 107)
Metrics: {"client-negotiator.queue_time_us":48}
W20260924 21:11:04.610486  1295 negotiation.cc:337] Failed RPC negotiation. Trace:
0924 21:11:04.344707 (+     0us) reactor.cc:625] Submitting negotiation task for client connection to 0.0.0.0:40991 (local address 127.0.0.1:34500)
0924 21:11:04.344763 (+    56us) negotiation.cc:107] Waiting for socket to connect
0924 21:11:04.344773 (+    10us) client_negotiation.cc:174] Beginning negotiation
0924 21:11:04.344828 (+    55us) client_negotiation.cc:252] Sending NEGOTIATE NegotiatePB request
0924 21:11:04.610338 (+265510us) negotiation.cc:327] Negotiation complete: Network error: Client connection negotiation failed: client connection to 0.0.0.0:40991: BlockingRecv error: recv error from unknown peer: Transport endpoint is not connected (error 107)
Metrics: {"client-negotiator.queue_time_us":20}
W20260924 21:11:04.610482  1286 negotiation.cc:337] Failed RPC negotiation. Trace:
0924 21:11:04.343439 (+     0us) reactor.cc:625] Submitting negotiation task for client connection to 0.0.0.0:40991 (local address 127.0.0.1:34490)
0924 21:11:04.343542 (+   103us) negotiation.cc:107] Waiting for socket to connect
0924 21:11:04.343555 (+    13us) client_negotiation.cc:174] Beginning negotiation
0924 21:11:04.343634 (+    79us) client_negotiation.cc:252] Sending NEGOTIATE NegotiatePB request
0924 21:11:04.610338 (+266704us) negotiation.cc:327] Negotiation complete: Network error: Client connection negotiation failed: client connection to 0.0.0.0:40991: BlockingRecv error: recv error from unknown peer: Transport endpoint is not connected (error 107)
Metrics: {"client-negotiator.queue_time_us":69}
W20260924 21:11:04.610839  1322 negotiation.cc:337] Failed RPC negotiation. Trace:
0924 21:11:04.348328 (+     0us) reactor.cc:625] Submitting negotiation task for client connection to 0.0.0.0:40991 (local address 127.0.0.1:34540)
0924 21:11:04.348433 (+   105us) negotiation.cc:107] Waiting for socket to connect
0924 21:11:04.348445 (+    12us) client_negotiation.cc:174] Beginning negotiation
0924 21:11:04.348508 (+    63us) client_negotiation.cc:252] Sending NEGOTIATE NegotiatePB request
0924 21:11:04.610788 (+262280us) negotiation.cc:327] Negotiation complete: Network error: Client connection negotiation failed: client connection to 0.0.0.0:40991: BlockingRecv error: recv error from unknown peer: Transport endpoint is not connected (error 107)
Metrics: {"client-negotiator.queue_time_us":41}
W20260924 21:11:04.611054  1331 negotiation.cc:337] Failed RPC negotiation. Trace:
0924 21:11:04.350347 (+     0us) reactor.cc:625] Submitting negotiation task for client connection to 0.0.0.0:40991 (local address 127.0.0.1:34544)
0924 21:11:04.350391 (+    44us) negotiation.cc:107] Waiting for socket to connect
0924 21:11:04.350402 (+    11us) client_negotiation.cc:174] Beginning negotiation
0924 21:11:04.350462 (+    60us) client_negotiation.cc:252] Sending NEGOTIATE NegotiatePB request
0924 21:11:04.611005 (+260543us) negotiation.cc:327] Negotiation complete: Network error: Client connection negotiation failed: client connection to 0.0.0.0:40991: BlockingRecv error: recv error from unknown peer: Transport endpoint is not connected (error 107)
Metrics: {"client-negotiator.queue_time_us":18}
[       OK ] Parameters/TestRpcSocketTxRxQueue.OverCapacity/0 (1053 ms)
[----------] 1 test from Parameters/TestRpcSocketTxRxQueue (1053 ms total)

[----------] Global test environment tear-down
[==========] 21 tests from 2 test suites ran. (29969 ms total)
[  PASSED  ] 20 tests.
[  FAILED  ] 1 test, listed below:
[  FAILED  ] Parameters/TestRpc.TestCallWithChainCertAndChainCA/SSL_TCP, where GetParam() = (true, false)

 1 FAILED TEST