Diagnosed failure
Parameters/TestRpc.TestCallWithChainCertAndChainCA/SSL_UnixSocket: /data0/somelongdirectorytoavoidrpathissues/src/kudu/src/kudu/rpc/rpc-test.cc:270: Failure
Failed
Bad status: Runtime error: could not verify certificate chain (error with cert: subject=CN = localhost, ST = sadfjas, C = AS, emailAddress = sdflkdsajf, O = lskdfjlsad, OU = sldfkja, issuer=C = AS, ST = ASDfkjdhf, L = lskdjf, O = saldfja, OU = skdjf, CN = localhost, emailAddress = sadjflkadsj): : certificate has expired
Google Test trace:
/data0/somelongdirectorytoavoidrpathissues/src/kudu/src/kudu/rpc/rpc-test.cc:267: Connecting to unix:/tmp/dist-test-task0zUINS/test-tmp/rpc-test-a263e3f2fb5240d7b6a23696ecd16e41.sock
I20260927 06:07:55.075016 815 test_util.cc:175] -----------------------------------------------
I20260927 06:07:55.075238 815 test_util.cc:176] Had fatal failures, leaving test files at /tmp/dist-test-task0zUINS/test-tmp/rpc-test.6.Parameters_TestRpc.TestCallWithChainCertAndChainCA_SSL_UnixSocket.1790489273655129-815-0
Full log
Note: This is test shard 7 of 8.
[==========] Running 21 tests from 2 test suites.
[----------] Global test environment set-up.
[----------] 20 tests from Parameters/TestRpc
[ RUN ] Parameters/TestRpc.TestMessengerCreateDestroy/SSL_UnixSocket
WARNING: Logging before InitGoogleLogging() is written to STDERR
I20260927 06:07:53.762737 815 rpc-test.cc:169] started messenger TestCreateDestroy
[ OK ] Parameters/TestRpc.TestMessengerCreateDestroy/SSL_UnixSocket (1209 ms)
[ RUN ] Parameters/TestRpc.TestNegotiationDeadlock/SSL_UnixSocket
I20260927 06:07:54.938421 837 acceptor_pool.cc:254] collecting diagnostics on the listening RPC socket unix:/tmp/dist-test-task0zUINS/test-tmp/rpc-test-07e4f4fb7cd04de4bcb6c2cac3027b01.sock every 8 connection(s)
I20260927 06:07:54.940054 838 acceptor_pool.cc:254] collecting diagnostics on the listening RPC socket unix:/tmp/dist-test-task0zUINS/test-tmp/rpc-test-07e4f4fb7cd04de4bcb6c2cac3027b01.sock every 8 connection(s)
[ OK ] Parameters/TestRpc.TestNegotiationDeadlock/SSL_UnixSocket (80 ms)
[ RUN ] Parameters/TestRpc.TestCallWithChainCertAndChainCA/SSL_UnixSocket
I20260927 06:07:55.039605 853 acceptor_pool.cc:254] collecting diagnostics on the listening RPC socket unix:/tmp/dist-test-task0zUINS/test-tmp/rpc-test-a263e3f2fb5240d7b6a23696ecd16e41.sock every 8 connection(s)
I20260927 06:07:55.042240 854 acceptor_pool.cc:254] collecting diagnostics on the listening RPC socket unix:/tmp/dist-test-task0zUINS/test-tmp/rpc-test-a263e3f2fb5240d7b6a23696ecd16e41.sock every 8 connection(s)
/data0/somelongdirectorytoavoidrpathissues/src/kudu/src/kudu/rpc/rpc-test.cc:270: Failure
Failed
Bad status: Runtime error: could not verify certificate chain (error with cert: subject=CN = localhost, ST = sadfjas, C = AS, emailAddress = sdflkdsajf, O = lskdfjlsad, OU = sldfkja, issuer=C = AS, ST = ASDfkjdhf, L = lskdjf, O = saldfja, OU = skdjf, CN = localhost, emailAddress = sadjflkadsj): : certificate has expired
Google Test trace:
/data0/somelongdirectorytoavoidrpathissues/src/kudu/src/kudu/rpc/rpc-test.cc:267: Connecting to unix:/tmp/dist-test-task0zUINS/test-tmp/rpc-test-a263e3f2fb5240d7b6a23696ecd16e41.sock
I20260927 06:07:55.075016 815 test_util.cc:175] -----------------------------------------------
I20260927 06:07:55.075238 815 test_util.cc:176] Had fatal failures, leaving test files at /tmp/dist-test-task0zUINS/test-tmp/rpc-test.6.Parameters_TestRpc.TestCallWithChainCertAndChainCA_SSL_UnixSocket.1790489273655129-815-0
[ FAILED ] Parameters/TestRpc.TestCallWithChainCertAndChainCA/SSL_UnixSocket, where GetParam() = (true, true) (75 ms)
[ RUN ] Parameters/TestRpc.TestCallWithPasswordProtectedKey/SSL_UnixSocket
I20260927 06:07:55.097270 878 acceptor_pool.cc:254] collecting diagnostics on the listening RPC socket unix:/tmp/dist-test-task0zUINS/test-tmp/rpc-test-f184c4ec21b14742a7391fd4086f1547.sock every 8 connection(s)
I20260927 06:07:55.098063 879 acceptor_pool.cc:254] collecting diagnostics on the listening RPC socket unix:/tmp/dist-test-task0zUINS/test-tmp/rpc-test-f184c4ec21b14742a7391fd4086f1547.sock every 8 connection(s)
W20260927 06:07:55.144290 875 connection.cc:196] Error closing socket: Network error: TlsSocket::Close: Broken pipe
[ OK ] Parameters/TestRpc.TestCallWithPasswordProtectedKey/SSL_UnixSocket (76 ms)
[ RUN ] Parameters/TestRpc.TestCallToBadServer/SSL_UnixSocket
I20260927 06:07:55.173215 815 rpc-test.cc:394] Status: Network error: Client connection negotiation failed: client connection to 0.0.0.0:0: connect: Connection refused (error 111)
I20260927 06:07:55.175029 815 rpc-test.cc:394] Status: Network error: Client connection negotiation failed: client connection to 0.0.0.0:0: connect: Connection refused (error 111)
I20260927 06:07:55.176643 815 rpc-test.cc:394] Status: Network error: Client connection negotiation failed: client connection to 0.0.0.0:0: connect: Connection refused (error 111)
I20260927 06:07:55.178332 815 rpc-test.cc:394] Status: Network error: Client connection negotiation failed: client connection to 0.0.0.0:0: connect: Connection refused (error 111)
I20260927 06:07:55.180150 815 rpc-test.cc:394] Status: Network error: Client connection negotiation failed: client connection to 0.0.0.0:0: connect: Connection refused (error 111)
[ OK ] Parameters/TestRpc.TestCallToBadServer/SSL_UnixSocket (30 ms)
[ RUN ] Parameters/TestRpc.TestWrongService/SSL_UnixSocket
I20260927 06:07:55.230242 913 acceptor_pool.cc:254] collecting diagnostics on the listening RPC socket unix:/tmp/dist-test-task0zUINS/test-tmp/rpc-test-cb5d09a2cd924932ae070a7274e926db.sock every 8 connection(s)
I20260927 06:07:55.231240 914 acceptor_pool.cc:254] collecting diagnostics on the listening RPC socket unix:/tmp/dist-test-task0zUINS/test-tmp/rpc-test-cb5d09a2cd924932ae070a7274e926db.sock every 8 connection(s)
I20260927 06:07:55.273835 910 messenger.cc:345] service WrongServiceName not registered on TestServer
W20260927 06:07:55.278225 910 connection.cc:196] Error closing socket: Network error: TlsSocket::Close: Broken pipe
[ OK ] Parameters/TestRpc.TestWrongService/SSL_UnixSocket (100 ms)
[ RUN ] Parameters/TestRpc.TestConnectionKeepalive/SSL_UnixSocket
I20260927 06:07:55.300113 936 acceptor_pool.cc:254] collecting diagnostics on the listening RPC socket unix:/tmp/dist-test-task0zUINS/test-tmp/rpc-test-1f99444a771f4bf7af287706fa3aed60.sock every 8 connection(s)
I20260927 06:07:55.300863 937 acceptor_pool.cc:254] collecting diagnostics on the listening RPC socket unix:/tmp/dist-test-task0zUINS/test-tmp/rpc-test-1f99444a771f4bf7af287706fa3aed60.sock every 8 connection(s)
I20260927 06:07:55.304486 815 rpc-test.cc:488] Connecting to unix:/tmp/dist-test-task0zUINS/test-tmp/rpc-test-1f99444a771f4bf7af287706fa3aed60.sock
W20260927 06:07:55.787000 949 connection.cc:196] Error closing socket: Network error: TlsSocket::Close: Broken pipe
[ OK ] Parameters/TestRpc.TestConnectionKeepalive/SSL_UnixSocket (1066 ms)
[ RUN ] Parameters/TestRpc.TestClientConnectionMetrics/SSL_UnixSocket
I20260927 06:07:56.383658 961 acceptor_pool.cc:254] collecting diagnostics on the listening RPC socket unix:/tmp/dist-test-task0zUINS/test-tmp/rpc-test-25eea0f816c744bcb516c98daa97e5ea.sock every 8 connection(s)
I20260927 06:07:56.384440 962 acceptor_pool.cc:254] collecting diagnostics on the listening RPC socket unix:/tmp/dist-test-task0zUINS/test-tmp/rpc-test-25eea0f816c744bcb516c98daa97e5ea.sock every 8 connection(s)
I20260927 06:07:56.387881 815 rpc-test.cc:569] Connecting to unix:/tmp/dist-test-task0zUINS/test-tmp/rpc-test-25eea0f816c744bcb516c98daa97e5ea.sock
W20260927 06:10:26.160980 958 connection.cc:196] Error closing socket: Network error: TlsSocket::Close: Broken pipe
[ OK ] Parameters/TestRpc.TestClientConnectionMetrics/SSL_UnixSocket (149820 ms)
[ RUN ] Parameters/TestRpc.TestCredentialsPolicy/SSL_UnixSocket
I20260927 06:10:26.213879 999 acceptor_pool.cc:254] collecting diagnostics on the listening RPC socket unix:/tmp/dist-test-task0zUINS/test-tmp/rpc-test-fb1cc1c5965b4125b99493ca6964bdca.sock every 8 connection(s)
I20260927 06:10:26.214805 1000 acceptor_pool.cc:254] collecting diagnostics on the listening RPC socket unix:/tmp/dist-test-task0zUINS/test-tmp/rpc-test-fb1cc1c5965b4125b99493ca6964bdca.sock every 8 connection(s)
I20260927 06:10:26.218326 815 rpc-test.cc:700] Connecting to unix:/tmp/dist-test-task0zUINS/test-tmp/rpc-test-fb1cc1c5965b4125b99493ca6964bdca.sock
W20260927 06:10:26.274330 998 connection.cc:196] Error closing socket: Network error: TlsSocket::Close: Broken pipe
[ OK ] Parameters/TestRpc.TestCredentialsPolicy/SSL_UnixSocket (129 ms)
[ RUN ] Parameters/TestRpc.TestCallLongerThanKeepalive/SSL_UnixSocket
I20260927 06:10:26.330647 1024 acceptor_pool.cc:254] collecting diagnostics on the listening RPC socket unix:/tmp/dist-test-task0zUINS/test-tmp/rpc-test-93b98c37b2ed4d76b7614e36eecec1ae.sock every 8 connection(s)
I20260927 06:10:26.331347 1025 acceptor_pool.cc:254] collecting diagnostics on the listening RPC socket unix:/tmp/dist-test-task0zUINS/test-tmp/rpc-test-93b98c37b2ed4d76b7614e36eecec1ae.sock every 8 connection(s)
I20260927 06:10:26.382292 1028 rpc-test-base.h:222] got call: sleep_micros: 3000000 deferred: true
I20260927 06:10:29.388145 1028 rpcz_store.cc:275] Call kudu.rpc.GenericCalculatorService.Sleep from unix:<unnamed> (request call id 0) took 3006 ms. Trace:
I20260927 06:10:29.388515 1028 rpcz_store.cc:276] 0927 06:10:26.382102 (+ 0us) service_pool.cc:170] Inserting onto call queue
0927 06:10:26.382223 (+ 121us) service_pool.cc:227] Handling call
0927 06:10:29.388092 (+3005869us) inbound_call.cc:173] Queueing success response
Metrics: {}
W20260927 06:10:29.393028 1021 connection.cc:196] Error closing socket: Network error: TlsSocket::Close: Broken pipe
[ OK ] Parameters/TestRpc.TestCallLongerThanKeepalive/SSL_UnixSocket (3098 ms)
[ RUN ] Parameters/TestRpc.TestRpcSidecar/SSL_UnixSocket
I20260927 06:10:29.432314 1049 acceptor_pool.cc:254] collecting diagnostics on the listening RPC socket unix:/tmp/dist-test-task0zUINS/test-tmp/rpc-test-9dbb806047f745178dd608f41b55112d.sock every 8 connection(s)
I20260927 06:10:29.433032 1050 acceptor_pool.cc:254] collecting diagnostics on the listening RPC socket unix:/tmp/dist-test-task0zUINS/test-tmp/rpc-test-9dbb806047f745178dd608f41b55112d.sock every 8 connection(s)
W20260927 06:10:29.959555 1046 connection.cc:196] Error closing socket: Network error: TlsSocket::Close: Broken pipe
[ OK ] Parameters/TestRpc.TestRpcSidecar/SSL_UnixSocket (566 ms)
[ RUN ] Parameters/TestRpc.TestRpcSidecarLimits/SSL_UnixSocket
I20260927 06:10:47.587983 1076 acceptor_pool.cc:254] collecting diagnostics on the listening RPC socket unix:/tmp/dist-test-task0zUINS/test-tmp/rpc-test-6c2c8f2ffd3e4976ad646d6749bb5f6c.sock every 8 connection(s)
I20260927 06:10:47.588878 1077 acceptor_pool.cc:254] collecting diagnostics on the listening RPC socket unix:/tmp/dist-test-task0zUINS/test-tmp/rpc-test-6c2c8f2ffd3e4976ad646d6749bb5f6c.sock every 8 connection(s)
W20260927 06:10:47.637681 815 serialization.cc:72] Serialized kudu.rpc_test.PushStringsRequestPB (2147483654 bytes) is larger than the maximum configured RPC message size (52428800 bytes). Sending anyway, but peer may reject the data.
W20260927 06:10:47.648697 1073 connection.cc:535] server connection from unix:<unnamed> recv error: Network error: RPC frame had a length of 2147483714, but we only support messages up to 52428800 bytes long.
W20260927 06:10:47.649073 1073 connection.cc:158] shutting down server connection from unix:<unnamed> with pending inbound data: 4/2147483714 bytes received; last active 0 ns ago: status Network error: RPC frame had a length of 2147483714, but we only support messages up to 52428800 bytes long.
W20260927 06:10:47.649987 1089 connection.cc:698] client connection to unix:/tmp/dist-test-task0zUINS/test-tmp/rpc-test-6c2c8f2ffd3e4976ad646d6749bb5f6c.sock send error: Network error: failed to write to TLS socket: Broken pipe
W20260927 06:10:47.650689 1089 connection.cc:196] Error closing socket: Network error: TlsSocket::Close: Success
[ OK ] Parameters/TestRpc.TestRpcSidecarLimits/SSL_UnixSocket (18350 ms)
[ RUN ] Parameters/TestRpc.TestCallTimeoutDoesntAffectNegotiation/SSL_UnixSocket
I20260927 06:10:48.352667 1101 acceptor_pool.cc:254] collecting diagnostics on the listening RPC socket unix:/tmp/dist-test-task0zUINS/test-tmp/rpc-test-8393cf2853124e32b6818043aaa05aa8.sock every 8 connection(s)
I20260927 06:10:48.353408 1102 acceptor_pool.cc:254] collecting diagnostics on the listening RPC socket unix:/tmp/dist-test-task0zUINS/test-tmp/rpc-test-8393cf2853124e32b6818043aaa05aa8.sock every 8 connection(s)
W20260927 06:10:48.374256 1097 negotiation.cc:266] Injecting 500ms delay in negotiation
I20260927 06:10:48.423877 815 rpc-test-base.h:595] status: Timed out: connection negotiation to unix:/tmp/dist-test-task0zUINS/test-tmp/rpc-test-8393cf2853124e32b6818043aaa05aa8.sock for RPC Sleep timed out after 0.050s (ON_OUTBOUND_QUEUE), seconds elapsed: 0.0507225
W20260927 06:10:48.886618 1098 connection.cc:196] Error closing socket: Network error: TlsSocket::Close: Broken pipe
[ OK ] Parameters/TestRpc.TestCallTimeoutDoesntAffectNegotiation/SSL_UnixSocket (574 ms)
[ RUN ] Parameters/TestRpc.TestRpcHandlerLatencyMetric/SSL_UnixSocket
I20260927 06:10:48.933914 1126 acceptor_pool.cc:254] collecting diagnostics on the listening RPC socket unix:/tmp/dist-test-task0zUINS/test-tmp/rpc-test-3504772cca0540409af59fcf3ca799e9.sock every 8 connection(s)
I20260927 06:10:48.934707 1127 acceptor_pool.cc:254] collecting diagnostics on the listening RPC socket unix:/tmp/dist-test-task0zUINS/test-tmp/rpc-test-3504772cca0540409af59fcf3ca799e9.sock every 8 connection(s)
I20260927 06:10:48.984009 815 rpc-test.cc:1236] Sleep() min lat: 21742
I20260927 06:10:48.984268 815 rpc-test.cc:1237] Sleep() mean lat: 21742
I20260927 06:10:48.984462 815 rpc-test.cc:1238] Sleep() max lat: 21742
I20260927 06:10:48.984629 815 rpc-test.cc:1239] Sleep() #calls: 1
[ OK ] Parameters/TestRpc.TestRpcHandlerLatencyMetric/SSL_UnixSocket (100 ms)
[ RUN ] Parameters/TestRpc.TimedOutOnResponseMetricServiceQueue/SSL_UnixSocket
I20260927 06:10:49.012087 1152 acceptor_pool.cc:254] collecting diagnostics on the listening RPC socket unix:/tmp/dist-test-task0zUINS/test-tmp/rpc-test-479062fc1b9340f48877d4cb56e0a8ed.sock every 8 connection(s)
I20260927 06:10:49.012768 1153 acceptor_pool.cc:254] collecting diagnostics on the listening RPC socket unix:/tmp/dist-test-task0zUINS/test-tmp/rpc-test-479062fc1b9340f48877d4cb56e0a8ed.sock every 8 connection(s)
W20260927 06:10:49.100116 1154 rpcz_store.cc:267] Call kudu.rpc_test.CalculatorService.Sleep from unix:<unnamed> (request call id 2) took 20 ms (client timeout 20 ms). Trace:
W20260927 06:10:49.100745 1154 rpcz_store.cc:269] 0927 06:10:49.079539 (+ 0us) service_pool.cc:170] Inserting onto call queue
0927 06:10:49.099944 (+ 20405us) service_pool.cc:214] Skipping call since client already timed out
0927 06:10:49.100051 (+ 107us) inbound_call.cc:173] Queueing failure response
Metrics: {}
[ OK ] Parameters/TestRpc.TimedOutOnResponseMetricServiceQueue/SSL_UnixSocket (120 ms)
[ RUN ] Parameters/TestRpc.RpcPendingConnectionsMetric/SSL_UnixSocket
I20260927 06:10:49.128736 1175 acceptor_pool.cc:254] collecting diagnostics on the listening RPC socket 0.0.0.0:35097 every 8 connection(s)
I20260927 06:10:49.129534 1176 acceptor_pool.cc:254] collecting diagnostics on the listening RPC socket 0.0.0.0:35097 every 8 connection(s)
W20260927 06:10:49.148684 1171 negotiation.cc:337] Failed RPC negotiation. Trace:
0927 06:10:49.146951 (+ 0us) reactor.cc:625] Submitting negotiation task for server connection from 127.0.0.1:50166 (local address 127.0.0.1:35097)
0927 06:10:49.147566 (+ 615us) server_negotiation.cc:206] Beginning negotiation
0927 06:10:49.147591 (+ 25us) server_negotiation.cc:399] Waiting for connection header
0927 06:10:49.147916 (+ 325us) negotiation.cc:327] Negotiation complete: Network error: Server connection negotiation failed: server connection from 127.0.0.1:50166: BlockingRecv error: recv got EOF from 127.0.0.1:50166 (error 108)
Metrics: {"server-negotiator.queue_time_us":152}
[ OK ] Parameters/TestRpc.RpcPendingConnectionsMetric/SSL_UnixSocket (51 ms)
[ RUN ] Parameters/TestRpc.TestRpcContextClientDeadline/SSL_UnixSocket
I20260927 06:10:49.219676 1191 acceptor_pool.cc:254] collecting diagnostics on the listening RPC socket unix:/tmp/dist-test-task0zUINS/test-tmp/rpc-test-88289c2d1b24481a99e1bb79913bfbee.sock every 8 connection(s)
I20260927 06:10:49.220371 1192 acceptor_pool.cc:254] collecting diagnostics on the listening RPC socket unix:/tmp/dist-test-task0zUINS/test-tmp/rpc-test-88289c2d1b24481a99e1bb79913bfbee.sock every 8 connection(s)
[ OK ] Parameters/TestRpc.TestRpcContextClientDeadline/SSL_UnixSocket (126 ms)
[ RUN ] Parameters/TestRpc.TestApplicationFeatureFlagUnsupportedServer/SSL_UnixSocket
I20260927 06:10:49.310599 1216 acceptor_pool.cc:254] collecting diagnostics on the listening RPC socket unix:/tmp/dist-test-task0zUINS/test-tmp/rpc-test-13bd86a165bc4b6681a59807f2f383a5.sock every 8 connection(s)
I20260927 06:10:49.311352 1217 acceptor_pool.cc:254] collecting diagnostics on the listening RPC socket unix:/tmp/dist-test-task0zUINS/test-tmp/rpc-test-13bd86a165bc4b6681a59807f2f383a5.sock every 8 connection(s)
W20260927 06:10:49.356117 1213 connection.cc:196] Error closing socket: Network error: TlsSocket::Close: Broken pipe
[ OK ] Parameters/TestRpc.TestApplicationFeatureFlagUnsupportedServer/SSL_UnixSocket (71 ms)
[ RUN ] Parameters/TestRpc.TestCancellationAsync/SSL_UnixSocket
I20260927 06:10:49.396811 1241 acceptor_pool.cc:254] collecting diagnostics on the listening RPC socket unix:/tmp/dist-test-task0zUINS/test-tmp/rpc-test-9afc9cb60ce548029f10c125fc89998f.sock every 8 connection(s)
I20260927 06:10:49.397578 1242 acceptor_pool.cc:254] collecting diagnostics on the listening RPC socket unix:/tmp/dist-test-task0zUINS/test-tmp/rpc-test-9afc9cb60ce548029f10c125fc89998f.sock every 8 connection(s)
I20260927 06:10:49.400861 815 rpc-test.cc:1716] Connecting to unix:/tmp/dist-test-task0zUINS/test-tmp/rpc-test-9afc9cb60ce548029f10c125fc89998f.sock
I20260927 06:10:49.428591 815 test_util.cc:268] Using random seed: -811895207
I20260927 06:10:49.680382 1245 rpc-test-base.h:240] got call: sleep_micros: 500 pattern: 4294967295 num_repetitions: 2097152 sidecar_idx: 0
I20260927 06:10:49.920194 1244 rpc-test-base.h:240] got call: sleep_micros: 500 pattern: 4294967295 num_repetitions: 2097152 sidecar_idx: 0
I20260927 06:10:50.131910 1245 rpc-test-base.h:240] got call: sleep_micros: 500 pattern: 4294967295 num_repetitions: 2097152 sidecar_idx: 0
I20260927 06:10:50.376842 1245 rpc-test-base.h:240] got call: sleep_micros: 500 pattern: 4294967295 num_repetitions: 2097152 sidecar_idx: 0
I20260927 06:10:50.593627 1245 rpc-test-base.h:240] got call: sleep_micros: 500 pattern: 4294967295 num_repetitions: 2097152 sidecar_idx: 0
I20260927 06:10:50.802627 1245 rpc-test-base.h:240] got call: sleep_micros: 500 pattern: 4294967295 num_repetitions: 2097152 sidecar_idx: 0
I20260927 06:10:50.997654 1244 rpc-test-base.h:240] got call: sleep_micros: 500 pattern: 4294967295 num_repetitions: 2097152 sidecar_idx: 0
I20260927 06:10:51.219648 1245 rpc-test-base.h:240] got call: sleep_micros: 500 pattern: 4294967295 num_repetitions: 2097152 sidecar_idx: 0
I20260927 06:10:51.411916 1244 rpc-test-base.h:240] got call: sleep_micros: 500 pattern: 4294967295 num_repetitions: 2097152 sidecar_idx: 0
W20260927 06:10:51.436276 1238 connection.cc:196] Error closing socket: Network error: TlsSocket::Close: Broken pipe
W20260927 06:10:51.472103 1238 connection.cc:441] server connection from unix:<unnamed> torn down before Call kudu.rpc.GenericCalculatorService.SleepWithSidecar from unix:<unnamed> (request call id 8) could send its response
W20260927 06:10:51.559332 1238 connection.cc:441] server connection from unix:<unnamed> torn down before Call kudu.rpc.GenericCalculatorService.SleepWithSidecar from unix:<unnamed> (request call id 9) could send its response
[ OK ] Parameters/TestRpc.TestCancellationAsync/SSL_UnixSocket (2209 ms)
[ RUN ] Parameters/TestRpc.TestPerformanceBySocketType/SSL_UnixSocket
I20260927 06:10:51.668831 1266 acceptor_pool.cc:254] collecting diagnostics on the listening RPC socket unix:/tmp/dist-test-task0zUINS/test-tmp/rpc-test-41788de61166470ab60b09d62a3712df.sock every 8 connection(s)
I20260927 06:10:51.669533 1267 acceptor_pool.cc:254] collecting diagnostics on the listening RPC socket unix:/tmp/dist-test-task0zUINS/test-tmp/rpc-test-41788de61166470ab60b09d62a3712df.sock every 8 connection(s)
I20260927 06:10:51.672761 815 rpc-test.cc:1846] Connecting to unix:/tmp/dist-test-task0zUINS/test-tmp/rpc-test-41788de61166470ab60b09d62a3712df.sock
I20260927 06:11:14.105192 815 rpc-test.cc:1859] Sending 1024MB via ssl-enabled unix socket: real 22.407s user 20.341s sys 13.614s
I20260927 06:11:36.527527 815 rpc-test.cc:1859] Sending 1024MB via ssl-enabled unix socket: real 22.422s user 20.139s sys 13.806s
I20260927 06:11:58.949239 815 rpc-test.cc:1859] Sending 1024MB via ssl-enabled unix socket: real 22.421s user 20.137s sys 13.708s
I20260927 06:12:21.174952 815 rpc-test.cc:1859] Sending 1024MB via ssl-enabled unix socket: real 22.225s user 20.076s sys 13.462s
I20260927 06:12:43.637421 815 rpc-test.cc:1859] Sending 1024MB via ssl-enabled unix socket: real 22.462s user 20.182s sys 13.832s
W20260927 06:12:43.645891 1263 connection.cc:196] Error closing socket: Network error: TlsSocket::Close: Broken pipe
[ OK ] Parameters/TestRpc.TestPerformanceBySocketType/SSL_UnixSocket (112083 ms)
[----------] 20 tests from Parameters/TestRpc (289947 ms total)
[----------] 1 test from Parameters/TestRpcSocketTxRxQueue
[ RUN ] Parameters/TestRpcSocketTxRxQueue.AcceptorRxQueueSizeMetric/0
I20260927 06:12:43.673009 1302 acceptor_pool.cc:254] collecting diagnostics on the listening RPC socket 0.0.0.0:37865 every 1 connection(s)
I20260927 06:12:43.673897 1303 acceptor_pool.cc:254] collecting diagnostics on the listening RPC socket 0.0.0.0:37865 every 1 connection(s)
W20260927 06:12:43.679600 1298 negotiation.cc:337] Failed RPC negotiation. Trace:
0927 06:12:43.677898 (+ 0us) reactor.cc:625] Submitting negotiation task for server connection from 127.0.0.1:37648 (local address 127.0.0.1:37865)
0927 06:12:43.678350 (+ 452us) server_negotiation.cc:206] Beginning negotiation
0927 06:12:43.678374 (+ 24us) server_negotiation.cc:399] Waiting for connection header
0927 06:12:43.678598 (+ 224us) negotiation.cc:327] Negotiation complete: Network error: Server connection negotiation failed: server connection from 127.0.0.1:37648: BlockingRecv error: recv got EOF from 127.0.0.1:37648 (error 108)
Metrics: {"server-negotiator.queue_time_us":109}
[ OK ] Parameters/TestRpcSocketTxRxQueue.AcceptorRxQueueSizeMetric/0 (31 ms)
[----------] 1 test from Parameters/TestRpcSocketTxRxQueue (32 ms total)
[----------] Global test environment tear-down
[==========] 21 tests from 2 test suites ran. (289979 ms total)
[ PASSED ] 20 tests.
[ FAILED ] 1 test, listed below:
[ FAILED ] Parameters/TestRpc.TestCallWithChainCertAndChainCA/SSL_UnixSocket, where GetParam() = (true, true)
1 FAILED TEST