Diagnosed failure
Parameters/TestRpc.TestCallWithChainCertAndChainCA/SSL_UnixSocket: /data0/somelongdirectorytoavoidrpathissues/src/kudu/src/kudu/rpc/rpc-test.cc:270: Failure
Failed
Bad status: Runtime error: could not verify certificate chain (error with cert: subject=CN = localhost, ST = sadfjas, C = AS, emailAddress = sdflkdsajf, O = lskdfjlsad, OU = sldfkja, issuer=C = AS, ST = ASDfkjdhf, L = lskdjf, O = saldfja, OU = skdjf, CN = localhost, emailAddress = sadjflkadsj): : certificate has expired
Google Test trace:
/data0/somelongdirectorytoavoidrpathissues/src/kudu/src/kudu/rpc/rpc-test.cc:267: Connecting to unix:/tmp/dist-test-taskdHonuw/test-tmp/rpc-test-17aba06bb9c146f9a65a7f95330332c9.sock
I20260927 19:37:05.648396 2853 test_util.cc:175] -----------------------------------------------
I20260927 19:37:05.648586 2853 test_util.cc:176] Had fatal failures, leaving test files at /tmp/dist-test-taskdHonuw/test-tmp/rpc-test.6.Parameters_TestRpc.TestCallWithChainCertAndChainCA_SSL_UnixSocket.1790537824367814-2853-0
Full log
Note: This is test shard 7 of 8.
[==========] Running 21 tests from 2 test suites.
[----------] Global test environment set-up.
[----------] 20 tests from Parameters/TestRpc
[ RUN ] Parameters/TestRpc.TestMessengerCreateDestroy/SSL_UnixSocket
WARNING: Logging before InitGoogleLogging() is written to STDERR
I20260927 19:37:04.469523 2853 rpc-test.cc:169] started messenger TestCreateDestroy
[ OK ] Parameters/TestRpc.TestMessengerCreateDestroy/SSL_UnixSocket (1089 ms)
[ RUN ] Parameters/TestRpc.TestNegotiationDeadlock/SSL_UnixSocket
I20260927 19:37:05.548658 2875 acceptor_pool.cc:254] collecting diagnostics on the listening RPC socket unix:/tmp/dist-test-taskdHonuw/test-tmp/rpc-test-40d2155c820e497bbaf983e8f3acd762.sock every 8 connection(s)
I20260927 19:37:05.550015 2876 acceptor_pool.cc:254] collecting diagnostics on the listening RPC socket unix:/tmp/dist-test-taskdHonuw/test-tmp/rpc-test-40d2155c820e497bbaf983e8f3acd762.sock every 8 connection(s)
[ OK ] Parameters/TestRpc.TestNegotiationDeadlock/SSL_UnixSocket (88 ms)
[ RUN ] Parameters/TestRpc.TestCallWithChainCertAndChainCA/SSL_UnixSocket
I20260927 19:37:05.620810 2891 acceptor_pool.cc:254] collecting diagnostics on the listening RPC socket unix:/tmp/dist-test-taskdHonuw/test-tmp/rpc-test-17aba06bb9c146f9a65a7f95330332c9.sock every 8 connection(s)
I20260927 19:37:05.622813 2892 acceptor_pool.cc:254] collecting diagnostics on the listening RPC socket unix:/tmp/dist-test-taskdHonuw/test-tmp/rpc-test-17aba06bb9c146f9a65a7f95330332c9.sock every 8 connection(s)
/data0/somelongdirectorytoavoidrpathissues/src/kudu/src/kudu/rpc/rpc-test.cc:270: Failure
Failed
Bad status: Runtime error: could not verify certificate chain (error with cert: subject=CN = localhost, ST = sadfjas, C = AS, emailAddress = sdflkdsajf, O = lskdfjlsad, OU = sldfkja, issuer=C = AS, ST = ASDfkjdhf, L = lskdjf, O = saldfja, OU = skdjf, CN = localhost, emailAddress = sadjflkadsj): : certificate has expired
Google Test trace:
/data0/somelongdirectorytoavoidrpathissues/src/kudu/src/kudu/rpc/rpc-test.cc:267: Connecting to unix:/tmp/dist-test-taskdHonuw/test-tmp/rpc-test-17aba06bb9c146f9a65a7f95330332c9.sock
I20260927 19:37:05.648396 2853 test_util.cc:175] -----------------------------------------------
I20260927 19:37:05.648586 2853 test_util.cc:176] Had fatal failures, leaving test files at /tmp/dist-test-taskdHonuw/test-tmp/rpc-test.6.Parameters_TestRpc.TestCallWithChainCertAndChainCA_SSL_UnixSocket.1790537824367814-2853-0
[ FAILED ] Parameters/TestRpc.TestCallWithChainCertAndChainCA/SSL_UnixSocket, where GetParam() = (true, true) (46 ms)
[ RUN ] Parameters/TestRpc.TestCallWithPasswordProtectedKey/SSL_UnixSocket
I20260927 19:37:05.686136 2916 acceptor_pool.cc:254] collecting diagnostics on the listening RPC socket unix:/tmp/dist-test-taskdHonuw/test-tmp/rpc-test-025421f92f184ebf86c31d14f9c982ed.sock every 8 connection(s)
I20260927 19:37:05.686894 2917 acceptor_pool.cc:254] collecting diagnostics on the listening RPC socket unix:/tmp/dist-test-taskdHonuw/test-tmp/rpc-test-025421f92f184ebf86c31d14f9c982ed.sock every 8 connection(s)
[ OK ] Parameters/TestRpc.TestCallWithPasswordProtectedKey/SSL_UnixSocket (84 ms)
[ RUN ] Parameters/TestRpc.TestCallToBadServer/SSL_UnixSocket
I20260927 19:37:05.748790 2853 rpc-test.cc:394] Status: Network error: Client connection negotiation failed: client connection to 0.0.0.0:0: connect: Connection refused (error 111)
I20260927 19:37:05.750260 2853 rpc-test.cc:394] Status: Network error: Client connection negotiation failed: client connection to 0.0.0.0:0: connect: Connection refused (error 111)
I20260927 19:37:05.751724 2853 rpc-test.cc:394] Status: Network error: Client connection negotiation failed: client connection to 0.0.0.0:0: connect: Connection refused (error 111)
I20260927 19:37:05.753089 2853 rpc-test.cc:394] Status: Network error: Client connection negotiation failed: client connection to 0.0.0.0:0: connect: Connection refused (error 111)
I20260927 19:37:05.754503 2853 rpc-test.cc:394] Status: Network error: Client connection negotiation failed: client connection to 0.0.0.0:0: connect: Connection refused (error 111)
[ OK ] Parameters/TestRpc.TestCallToBadServer/SSL_UnixSocket (23 ms)
[ RUN ] Parameters/TestRpc.TestWrongService/SSL_UnixSocket
I20260927 19:37:05.781556 2951 acceptor_pool.cc:254] collecting diagnostics on the listening RPC socket unix:/tmp/dist-test-taskdHonuw/test-tmp/rpc-test-94c0c095500f433cbed9d5c0f5f90f93.sock every 8 connection(s)
I20260927 19:37:05.782294 2952 acceptor_pool.cc:254] collecting diagnostics on the listening RPC socket unix:/tmp/dist-test-taskdHonuw/test-tmp/rpc-test-94c0c095500f433cbed9d5c0f5f90f93.sock every 8 connection(s)
I20260927 19:37:05.816075 2948 messenger.cc:345] service WrongServiceName not registered on TestServer
[ OK ] Parameters/TestRpc.TestWrongService/SSL_UnixSocket (66 ms)
[ RUN ] Parameters/TestRpc.TestConnectionKeepalive/SSL_UnixSocket
I20260927 19:37:05.837278 2974 acceptor_pool.cc:254] collecting diagnostics on the listening RPC socket unix:/tmp/dist-test-taskdHonuw/test-tmp/rpc-test-485d52e7efbd4ef99a6f7668bd7e6b1e.sock every 8 connection(s)
I20260927 19:37:05.837976 2975 acceptor_pool.cc:254] collecting diagnostics on the listening RPC socket unix:/tmp/dist-test-taskdHonuw/test-tmp/rpc-test-485d52e7efbd4ef99a6f7668bd7e6b1e.sock every 8 connection(s)
I20260927 19:37:05.841192 2853 rpc-test.cc:488] Connecting to unix:/tmp/dist-test-taskdHonuw/test-tmp/rpc-test-485d52e7efbd4ef99a6f7668bd7e6b1e.sock
W20260927 19:37:06.327406 2987 connection.cc:196] Error closing socket: Network error: TlsSocket::Close: Broken pipe
[ OK ] Parameters/TestRpc.TestConnectionKeepalive/SSL_UnixSocket (1060 ms)
[ RUN ] Parameters/TestRpc.TestClientConnectionMetrics/SSL_UnixSocket
I20260927 19:37:06.913756 2999 acceptor_pool.cc:254] collecting diagnostics on the listening RPC socket unix:/tmp/dist-test-taskdHonuw/test-tmp/rpc-test-94682e8528464f5d8c6f42a4447cf748.sock every 8 connection(s)
I20260927 19:37:06.914582 3000 acceptor_pool.cc:254] collecting diagnostics on the listening RPC socket unix:/tmp/dist-test-taskdHonuw/test-tmp/rpc-test-94682e8528464f5d8c6f42a4447cf748.sock every 8 connection(s)
I20260927 19:37:06.917908 2853 rpc-test.cc:569] Connecting to unix:/tmp/dist-test-taskdHonuw/test-tmp/rpc-test-94682e8528464f5d8c6f42a4447cf748.sock
W20260927 19:39:19.839453 2996 connection.cc:196] Error closing socket: Network error: TlsSocket::Close: Broken pipe
[ OK ] Parameters/TestRpc.TestClientConnectionMetrics/SSL_UnixSocket (132962 ms)
[ RUN ] Parameters/TestRpc.TestCredentialsPolicy/SSL_UnixSocket
I20260927 19:39:19.874730 3035 acceptor_pool.cc:254] collecting diagnostics on the listening RPC socket unix:/tmp/dist-test-taskdHonuw/test-tmp/rpc-test-d6dc9d18285c4836971b01428925b728.sock every 8 connection(s)
I20260927 19:39:19.875618 3036 acceptor_pool.cc:254] collecting diagnostics on the listening RPC socket unix:/tmp/dist-test-taskdHonuw/test-tmp/rpc-test-d6dc9d18285c4836971b01428925b728.sock every 8 connection(s)
I20260927 19:39:19.878608 2853 rpc-test.cc:700] Connecting to unix:/tmp/dist-test-taskdHonuw/test-tmp/rpc-test-d6dc9d18285c4836971b01428925b728.sock
W20260927 19:39:19.919945 3034 connection.cc:196] Error closing socket: Network error: TlsSocket::Close: Broken pipe
[ OK ] Parameters/TestRpc.TestCredentialsPolicy/SSL_UnixSocket (93 ms)
[ RUN ] Parameters/TestRpc.TestCallLongerThanKeepalive/SSL_UnixSocket
I20260927 19:39:19.953552 3060 acceptor_pool.cc:254] collecting diagnostics on the listening RPC socket unix:/tmp/dist-test-taskdHonuw/test-tmp/rpc-test-557b48aad55c46c49cadc9e1808986c9.sock every 8 connection(s)
I20260927 19:39:19.954228 3061 acceptor_pool.cc:254] collecting diagnostics on the listening RPC socket unix:/tmp/dist-test-taskdHonuw/test-tmp/rpc-test-557b48aad55c46c49cadc9e1808986c9.sock every 8 connection(s)
I20260927 19:39:19.985836 3064 rpc-test-base.h:222] got call: sleep_micros: 3000000 deferred: true
I20260927 19:39:22.990046 3064 rpcz_store.cc:275] Call kudu.rpc.GenericCalculatorService.Sleep from unix:<unnamed> (request call id 0) took 3004 ms. Trace:
I20260927 19:39:22.990350 3064 rpcz_store.cc:276] 0927 19:39:19.985681 (+ 0us) service_pool.cc:170] Inserting onto call queue
0927 19:39:19.985779 (+ 98us) service_pool.cc:227] Handling call
0927 19:39:22.989992 (+3004213us) inbound_call.cc:173] Queueing success response
Metrics: {}
[ OK ] Parameters/TestRpc.TestCallLongerThanKeepalive/SSL_UnixSocket (3058 ms)
[ RUN ] Parameters/TestRpc.TestRpcSidecar/SSL_UnixSocket
I20260927 19:39:23.016696 3085 acceptor_pool.cc:254] collecting diagnostics on the listening RPC socket unix:/tmp/dist-test-taskdHonuw/test-tmp/rpc-test-f19acd60dd8f4f1bb7878c80a45f2bda.sock every 8 connection(s)
I20260927 19:39:23.017453 3086 acceptor_pool.cc:254] collecting diagnostics on the listening RPC socket unix:/tmp/dist-test-taskdHonuw/test-tmp/rpc-test-f19acd60dd8f4f1bb7878c80a45f2bda.sock every 8 connection(s)
W20260927 19:39:23.515132 3082 connection.cc:196] Error closing socket: Network error: TlsSocket::Close: Broken pipe
[ OK ] Parameters/TestRpc.TestRpcSidecar/SSL_UnixSocket (521 ms)
[ RUN ] Parameters/TestRpc.TestRpcSidecarLimits/SSL_UnixSocket
I20260927 19:39:46.850986 3113 acceptor_pool.cc:254] collecting diagnostics on the listening RPC socket unix:/tmp/dist-test-taskdHonuw/test-tmp/rpc-test-c9439f16a0a6478fa1e099760cdc74fb.sock every 8 connection(s)
I20260927 19:39:46.851732 3114 acceptor_pool.cc:254] collecting diagnostics on the listening RPC socket unix:/tmp/dist-test-taskdHonuw/test-tmp/rpc-test-c9439f16a0a6478fa1e099760cdc74fb.sock every 8 connection(s)
W20260927 19:39:46.879846 2853 serialization.cc:72] Serialized kudu.rpc_test.PushStringsRequestPB (2147483654 bytes) is larger than the maximum configured RPC message size (52428800 bytes). Sending anyway, but peer may reject the data.
W20260927 19:39:46.890278 3110 connection.cc:535] server connection from unix:<unnamed> recv error: Network error: RPC frame had a length of 2147483714, but we only support messages up to 52428800 bytes long.
W20260927 19:39:46.890684 3110 connection.cc:158] shutting down server connection from unix:<unnamed> with pending inbound data: 4/2147483714 bytes received; last active 0 ns ago: status Network error: RPC frame had a length of 2147483714, but we only support messages up to 52428800 bytes long.
W20260927 19:39:46.891700 3126 connection.cc:196] Error closing socket: Network error: TlsSocket::Close: Broken pipe
[ OK ] Parameters/TestRpc.TestRpcSidecarLimits/SSL_UnixSocket (23942 ms)
[ RUN ] Parameters/TestRpc.TestCallTimeoutDoesntAffectNegotiation/SSL_UnixSocket
I20260927 19:39:47.502202 3138 acceptor_pool.cc:254] collecting diagnostics on the listening RPC socket unix:/tmp/dist-test-taskdHonuw/test-tmp/rpc-test-141b4c9b311a4e01a363a7d95ab1b77a.sock every 8 connection(s)
I20260927 19:39:47.502849 3139 acceptor_pool.cc:254] collecting diagnostics on the listening RPC socket unix:/tmp/dist-test-taskdHonuw/test-tmp/rpc-test-141b4c9b311a4e01a363a7d95ab1b77a.sock every 8 connection(s)
W20260927 19:39:47.554654 3134 negotiation.cc:266] Injecting 500ms delay in negotiation
I20260927 19:39:47.604803 2853 rpc-test-base.h:595] status: Timed out: connection negotiation to unix:/tmp/dist-test-taskdHonuw/test-tmp/rpc-test-141b4c9b311a4e01a363a7d95ab1b77a.sock for RPC Sleep timed out after 0.050s (ON_OUTBOUND_QUEUE), seconds elapsed: 0.0512773
W20260927 19:39:48.065989 3135 connection.cc:196] Error closing socket: Network error: TlsSocket::Close: Broken pipe
[ OK ] Parameters/TestRpc.TestCallTimeoutDoesntAffectNegotiation/SSL_UnixSocket (610 ms)
[ RUN ] Parameters/TestRpc.TestRpcHandlerLatencyMetric/SSL_UnixSocket
I20260927 19:39:48.104849 3163 acceptor_pool.cc:254] collecting diagnostics on the listening RPC socket unix:/tmp/dist-test-taskdHonuw/test-tmp/rpc-test-2c3c6697f938407db7ca5e439ea89b8b.sock every 8 connection(s)
I20260927 19:39:48.105536 3164 acceptor_pool.cc:254] collecting diagnostics on the listening RPC socket unix:/tmp/dist-test-taskdHonuw/test-tmp/rpc-test-2c3c6697f938407db7ca5e439ea89b8b.sock every 8 connection(s)
I20260927 19:39:48.157012 2853 rpc-test.cc:1236] Sleep() min lat: 21596
I20260927 19:39:48.157286 2853 rpc-test.cc:1237] Sleep() mean lat: 21596
I20260927 19:39:48.157449 2853 rpc-test.cc:1238] Sleep() max lat: 21596
I20260927 19:39:48.157580 2853 rpc-test.cc:1239] Sleep() #calls: 1
[ OK ] Parameters/TestRpc.TestRpcHandlerLatencyMetric/SSL_UnixSocket (91 ms)
[ RUN ] Parameters/TestRpc.TimedOutOnResponseMetricServiceQueue/SSL_UnixSocket
I20260927 19:39:48.186379 3189 acceptor_pool.cc:254] collecting diagnostics on the listening RPC socket unix:/tmp/dist-test-taskdHonuw/test-tmp/rpc-test-efa8c36a42984e298a012ff971c87ad1.sock every 8 connection(s)
I20260927 19:39:48.187054 3190 acceptor_pool.cc:254] collecting diagnostics on the listening RPC socket unix:/tmp/dist-test-taskdHonuw/test-tmp/rpc-test-efa8c36a42984e298a012ff971c87ad1.sock every 8 connection(s)
W20260927 19:39:48.257295 3191 rpcz_store.cc:267] Call kudu.rpc_test.CalculatorService.Sleep from unix:<unnamed> (request call id 2) took 20 ms (client timeout 20 ms). Trace:
W20260927 19:39:48.257615 3191 rpcz_store.cc:269] 0927 19:39:48.236778 (+ 0us) service_pool.cc:170] Inserting onto call queue
0927 19:39:48.257111 (+ 20333us) service_pool.cc:214] Skipping call since client already timed out
0927 19:39:48.257240 (+ 129us) inbound_call.cc:173] Queueing failure response
Metrics: {}
[ OK ] Parameters/TestRpc.TimedOutOnResponseMetricServiceQueue/SSL_UnixSocket (100 ms)
[ RUN ] Parameters/TestRpc.RpcPendingConnectionsMetric/SSL_UnixSocket
I20260927 19:39:48.274866 3212 acceptor_pool.cc:254] collecting diagnostics on the listening RPC socket 0.0.0.0:46151 every 8 connection(s)
I20260927 19:39:48.275564 3213 acceptor_pool.cc:254] collecting diagnostics on the listening RPC socket 0.0.0.0:46151 every 8 connection(s)
W20260927 19:39:48.288960 3208 negotiation.cc:337] Failed RPC negotiation. Trace:
0927 19:39:48.287219 (+ 0us) reactor.cc:625] Submitting negotiation task for server connection from 127.0.0.1:58696 (local address 127.0.0.1:46151)
0927 19:39:48.287810 (+ 591us) server_negotiation.cc:206] Beginning negotiation
0927 19:39:48.287837 (+ 27us) server_negotiation.cc:399] Waiting for connection header
0927 19:39:48.288160 (+ 323us) negotiation.cc:327] Negotiation complete: Network error: Server connection negotiation failed: server connection from 127.0.0.1:58696: BlockingRecv error: recv got EOF from 127.0.0.1:58696 (error 108)
Metrics: {"server-negotiator.queue_time_us":136}
[ OK ] Parameters/TestRpc.RpcPendingConnectionsMetric/SSL_UnixSocket (36 ms)
[ RUN ] Parameters/TestRpc.TestRpcContextClientDeadline/SSL_UnixSocket
I20260927 19:39:48.323366 3228 acceptor_pool.cc:254] collecting diagnostics on the listening RPC socket unix:/tmp/dist-test-taskdHonuw/test-tmp/rpc-test-dd5c1ce9d9954103b2d5ba5e94ebe0fc.sock every 8 connection(s)
I20260927 19:39:48.323978 3229 acceptor_pool.cc:254] collecting diagnostics on the listening RPC socket unix:/tmp/dist-test-taskdHonuw/test-tmp/rpc-test-dd5c1ce9d9954103b2d5ba5e94ebe0fc.sock every 8 connection(s)
W20260927 19:39:48.385579 3225 connection.cc:196] Error closing socket: Network error: TlsSocket::Close: Broken pipe
[ OK ] Parameters/TestRpc.TestRpcContextClientDeadline/SSL_UnixSocket (89 ms)
[ RUN ] Parameters/TestRpc.TestApplicationFeatureFlagUnsupportedServer/SSL_UnixSocket
I20260927 19:39:48.415189 3253 acceptor_pool.cc:254] collecting diagnostics on the listening RPC socket unix:/tmp/dist-test-taskdHonuw/test-tmp/rpc-test-5e08f2282ef84a95991a8142fe592f83.sock every 8 connection(s)
I20260927 19:39:48.415835 3254 acceptor_pool.cc:254] collecting diagnostics on the listening RPC socket unix:/tmp/dist-test-taskdHonuw/test-tmp/rpc-test-5e08f2282ef84a95991a8142fe592f83.sock every 8 connection(s)
W20260927 19:39:48.449548 3250 connection.cc:196] Error closing socket: Network error: TlsSocket::Close: Broken pipe
[ OK ] Parameters/TestRpc.TestApplicationFeatureFlagUnsupportedServer/SSL_UnixSocket (63 ms)
[ RUN ] Parameters/TestRpc.TestCancellationAsync/SSL_UnixSocket
I20260927 19:39:48.469882 3278 acceptor_pool.cc:254] collecting diagnostics on the listening RPC socket unix:/tmp/dist-test-taskdHonuw/test-tmp/rpc-test-84bd9a5b961a4460a16b2a0f6f66d71f.sock every 8 connection(s)
I20260927 19:39:48.470590 3279 acceptor_pool.cc:254] collecting diagnostics on the listening RPC socket unix:/tmp/dist-test-taskdHonuw/test-tmp/rpc-test-84bd9a5b961a4460a16b2a0f6f66d71f.sock every 8 connection(s)
I20260927 19:39:48.474681 2853 rpc-test.cc:1716] Connecting to unix:/tmp/dist-test-taskdHonuw/test-tmp/rpc-test-84bd9a5b961a4460a16b2a0f6f66d71f.sock
I20260927 19:39:48.490048 2853 test_util.cc:268] Using random seed: 482525994
I20260927 19:39:48.705490 3282 rpc-test-base.h:240] got call: sleep_micros: 500 pattern: 4294967295 num_repetitions: 2097152 sidecar_idx: 0
I20260927 19:39:48.917243 3282 rpc-test-base.h:240] got call: sleep_micros: 500 pattern: 4294967295 num_repetitions: 2097152 sidecar_idx: 0
I20260927 19:39:49.100070 3281 rpc-test-base.h:240] got call: sleep_micros: 500 pattern: 4294967295 num_repetitions: 2097152 sidecar_idx: 0
I20260927 19:39:49.282845 3282 rpc-test-base.h:240] got call: sleep_micros: 500 pattern: 4294967295 num_repetitions: 2097152 sidecar_idx: 0
I20260927 19:39:49.513188 3281 rpc-test-base.h:240] got call: sleep_micros: 500 pattern: 4294967295 num_repetitions: 2097152 sidecar_idx: 0
I20260927 19:39:49.695544 3282 rpc-test-base.h:240] got call: sleep_micros: 500 pattern: 4294967295 num_repetitions: 2097152 sidecar_idx: 0
I20260927 19:39:49.889712 3281 rpc-test-base.h:240] got call: sleep_micros: 500 pattern: 4294967295 num_repetitions: 2097152 sidecar_idx: 0
I20260927 19:39:50.095604 3282 rpc-test-base.h:240] got call: sleep_micros: 500 pattern: 4294967295 num_repetitions: 2097152 sidecar_idx: 0
I20260927 19:39:50.313119 3281 rpc-test-base.h:240] got call: sleep_micros: 500 pattern: 4294967295 num_repetitions: 2097152 sidecar_idx: 0
W20260927 19:39:50.333509 3275 connection.cc:196] Error closing socket: Network error: TlsSocket::Close: Broken pipe
W20260927 19:39:50.458120 3275 connection.cc:441] server connection from unix:<unnamed> torn down before Call kudu.rpc.GenericCalculatorService.SleepWithSidecar from unix:<unnamed> (request call id 9) could send its response
[ OK ] Parameters/TestRpc.TestCancellationAsync/SSL_UnixSocket (2011 ms)
[ RUN ] Parameters/TestRpc.TestPerformanceBySocketType/SSL_UnixSocket
I20260927 19:39:50.563678 3303 acceptor_pool.cc:254] collecting diagnostics on the listening RPC socket unix:/tmp/dist-test-taskdHonuw/test-tmp/rpc-test-85c3fdba2d0b41b49c00bb0f585782ce.sock every 8 connection(s)
I20260927 19:39:50.564337 3304 acceptor_pool.cc:254] collecting diagnostics on the listening RPC socket unix:/tmp/dist-test-taskdHonuw/test-tmp/rpc-test-85c3fdba2d0b41b49c00bb0f585782ce.sock every 8 connection(s)
I20260927 19:39:50.567456 2853 rpc-test.cc:1846] Connecting to unix:/tmp/dist-test-taskdHonuw/test-tmp/rpc-test-85c3fdba2d0b41b49c00bb0f585782ce.sock
I20260927 19:40:11.690156 2853 rpc-test.cc:1859] Sending 1024MB via ssl-enabled unix socket: real 21.105s user 19.302s sys 12.729s
I20260927 19:40:32.917832 2853 rpc-test.cc:1859] Sending 1024MB via ssl-enabled unix socket: real 21.227s user 19.537s sys 12.609s
I20260927 19:40:53.730448 2853 rpc-test.cc:1859] Sending 1024MB via ssl-enabled unix socket: real 20.812s user 18.752s sys 12.634s
I20260927 19:41:14.706730 2853 rpc-test.cc:1859] Sending 1024MB via ssl-enabled unix socket: real 20.976s user 19.042s sys 12.640s
I20260927 19:41:35.705509 2853 rpc-test.cc:1859] Sending 1024MB via ssl-enabled unix socket: real 20.998s user 19.247s sys 12.441s
W20260927 19:41:35.710661 3300 connection.cc:196] Error closing socket: Network error: TlsSocket::Close: Broken pipe
[ OK ] Parameters/TestRpc.TestPerformanceBySocketType/SSL_UnixSocket (105254 ms)
[----------] 20 tests from Parameters/TestRpc (271298 ms total)
[----------] 1 test from Parameters/TestRpcSocketTxRxQueue
[ RUN ] Parameters/TestRpcSocketTxRxQueue.AcceptorRxQueueSizeMetric/0
I20260927 19:41:35.738852 3339 acceptor_pool.cc:254] collecting diagnostics on the listening RPC socket 0.0.0.0:43809 every 1 connection(s)
I20260927 19:41:35.739553 3340 acceptor_pool.cc:254] collecting diagnostics on the listening RPC socket 0.0.0.0:43809 every 1 connection(s)
W20260927 19:41:35.744714 3335 negotiation.cc:337] Failed RPC negotiation. Trace:
0927 19:41:35.743324 (+ 0us) reactor.cc:625] Submitting negotiation task for server connection from 127.0.0.1:34524 (local address 127.0.0.1:43809)
0927 19:41:35.743772 (+ 448us) server_negotiation.cc:206] Beginning negotiation
0927 19:41:35.743793 (+ 21us) server_negotiation.cc:399] Waiting for connection header
0927 19:41:35.744031 (+ 238us) negotiation.cc:327] Negotiation complete: Network error: Server connection negotiation failed: server connection from 127.0.0.1:34524: BlockingRecv error: recv got EOF from 127.0.0.1:34524 (error 108)
Metrics: {"server-negotiator.queue_time_us":108}
[ OK ] Parameters/TestRpcSocketTxRxQueue.AcceptorRxQueueSizeMetric/0 (29 ms)
[----------] 1 test from Parameters/TestRpcSocketTxRxQueue (29 ms total)
[----------] Global test environment tear-down
[==========] 21 tests from 2 test suites ran. (271329 ms total)
[ PASSED ] 20 tests.
[ FAILED ] 1 test, listed below:
[ FAILED ] Parameters/TestRpc.TestCallWithChainCertAndChainCA/SSL_UnixSocket, where GetParam() = (true, true)
1 FAILED TEST